##TITLE=$$ Begin of the data block
##JCAMP-DX=5.00 $$ ACD/SpecManager v 10.08
##SPECTROMETER/DATA SYSTEM=Alpha
##DATE=09 Apr 2014 11:14:46
##DATA TYPE=INFRARED SPECTRUM
##DATA CLASS=XYDATA
##ORIGIN=
##OWNER=
##NPOINTS=1765
##FIRSTX=399.75695801
##LASTX=3997.56933594
##MAXX=3997.56933594
##MINX=399.75695801
##MAXY=0.85144007
##MINY=0.35528097
##XFACTOR=1.0000000000
##YFACTOR=1.000000000000000e-9
##FIRSTY=0.64377010
##DELTAX=2.03957629
##XUNITS=1/CM
##YUNITS=ARBITRARY UNITS
##XYDATA=(X++(Y..Y))
$$ plain form
399.8 643770099 642682016 641571760 641277015 640677154 639041185 637835860 638208985 638570547 637170196
418.1 637170196 635720432 636132360 636624813 636098862 635515571 635675192 635472000 634254158 633464277
436.5 633464277 633734584 633855581 633260310 632675409 632671297 632643402 632056713 631696880 631981075 631698489
456.9 631698489 630500972 629889548 630160987 629970491 628537297 627218246 627146125 627170384 626168013
475.2 626168013 624921560 624504566 624523461 623996139 623339772 623376310 623416424 622432172 621079624 620541930
495.6 620541930 620294690 619215965 617808878 617373645 617330432 616491377 615444779 615165055 615011036
514 615011036 613809168 612174094 611576080 611346543 610032439 608158886 607255638 606932223 605760098
532.3 605760098 604070723 603314877 603227913 602398753 601074040 600576043 600687265 599983752 598433375
$$ packed form
399.8F43770099j088083j110256k94745n99861j635969j205325L73125L61562j400351
418.1F37170196j449764M11928M92453n25951n83291J59621k03192j217842p89881
436.5F33464277K70307J20997n95271n84901m112k7895n86689l59833K84195k82586
456.9F31698489j197517o11424K71439j90496j433194j319051p2121K4259j002371
475.2F26168013j246453m16994J8895n27322o56367L6538M0114r84252j352548n37694
495.6F20541930k47240j078725j407087m35233m3213q39055j046598k79724j54019
514F15011036j201868j635074n98014k29537j314104j873553r03248l23415j172125
532.3F05760098j689375p55846q6964q29160j324713m97997J11222p03513j550377
$$ plain form
550.7 598433375 597492874 597294033 596360326 594643950 593612611 593215466 591970026 589815915 588132083
569 588132083 587052584 585404992 583126009 581449151 580535412 579063892 576900899 575394928 574795365
587.4 574795365 573801279 571975112 570606649 570151627 569278896 567426980 565787435 564910352 563815892
605.8 563815892 562297046 561530292 561739087 561764836 561471283 562503278 565477073 568892062 571773231
624.1 571773231 574779809 578454912 581905663 584427357 586741090 589547276 592061162 593296826
640.4 593296826 593802631 594871700 596763790 598657787 599955320 600571394 600639343 601295769 604262888
658.8 604262888 609220564 613966942 617028177 619225383 622410238 625455260 627624691 629702449
675.1 629702449 632161200 634799659 636888087 638379037 639981270 641855955 643463075 644542575
$$ packed form
550.7E98433375r40501j98841r33707j716376j031339l97145j245440k154111j683832
569E88132083j079499j647592k278983j676858r13739j471520k162993j505971n99563
587.4E74795365r94086j826167j368463m55022q72731j851916j639545q77083j094460
605.8E63815892j518846p66754K08795K5749k93553J031995K973795L414989K881169
624.1E71773231L006578L675103L450751K521694K313733K806186K513886J235664
640.4E93296826N05805J069069J892090J893997J297533O16074O7949O56426K967119
658.8F04262888M957676M746378L061235K197206L184855L045022K169431K077758
675.1F29702449K458751K638459K088428J490950J602233J874685J607120J079500
$$ plain form
691.4 644542575 645474792 646608114 647662103 648365378 649069428 650314093 651944935 653367877 654677212
709.8 654677212 656458855 658635199 660561383 662171245 663972557 666082382 668034434 669653118
726.1 669653118 671298921 673223317 675040305 676320374 677474797 678979754 680465758 681546867
742.4 681546867 682710290 684446514 686277807 687600017 688853920 690737605 692834437 694255531
758.7 694255531 695305884 696903050 698701680 699764967 700330317 701252639 702237725 702287674 701543331
777.1 701543331 701029599 700705826 699628294 698077738 697396100 697928727 698909044 700322926 703210950
795.4 703210950 707712471 712446630 716657877 721134067 726105511 730325103 733193517 735761821
811.7 735761821 738537610 740388751 740598142 740188658 739822626 738365531 735100567 731256068 727954626
$$ packed form
691.4F44542575R32217J133322J053989P03275P04050J244665J630842J422942J309335
709.8F54677212J781643K176344J926184J609862J801312K109825J952052J618684
726.1F69653118J645803J924396J816988J280069J154423J504957J486004J081109
742.4F81546867J163423J736224J831293J322210J253903J883685K096832J421094
758.7F94255531J050353J597166J798630J063287N65350R22322R85086M9949p44343
777.1G01543331n13732l23773j077532j550556o81638N32627R80317J413882K888024
795.4G03210950M501521M734159M211247M476190M971444M219592K868414K568304
811.7G35761821K775789J851141K09391m09484l66032j457095l264964l844499l301442
$$ plain form
830.1 727954626 724567652 720513165 716673374 713860691 711344481 708188295 705166638 703601718
846.4 703601718 703352511 703893840 706028700 710722089 717294216 724305034 731530309 739478648 747554123
864.8 747554123 754389107 759797752 764698565 769125462 772208095 773956776 775307596 776310205
881.1 776310205 775964260 774213731 772278070 770602345 768469214 766010404 764569998 764673412 765450954
899.4 765450954 766387939 767867506 769851089 771414220 771860838 771513581 770711303 768873930 765615702
917.8 765615702 761815369 758527040 755897999 753912449 753045499 753505468 754549563 755291522 755718589
936.2 755718589 756209314 756563425 756308377 755565524 754771829 753741145 751807570 748856544 745267093
954.5 745267093 740989149 735576391 728887916 721157193 712463081 702557683 691502392 680057108
$$ packed form
830.1G27954626l386974m054487l839791k812683k516210l156186l021657j564920
846.4G03601718k49207N41329K134860M693389O572127P010818P225275P948339Q075475
864.8G47554123O834984N408645M900813M426897L082633J748681J350820J002609
881.1G76310205l45945j750529j935661j675725k133131k458810j440406J03414P77542
899.4G65450954R36985J479567J983583J563131M46618l47257q02278j837373l258228
917.8G65615702l800333l288329k629041j985550q66950M59969J044095P41959M27067
936.2G55718589M90725L54111k55048p42853p93695j030684j933575k951026l589451
954.5G45267093m277944n412758o688475p730723q694112r905398j1055291j1445284
$$ plain form
970.8 680057108 669121742 659227252 650616944 643405974 637522399 632605016 628187478 624114335
987.1 624114335 620572627 617671013 615200222 612968028 611119747 609804511 608762562 607552707
1003.5 607552707 605975270 603923082 601120651 597406685 593090057 588667572 584360540 580137312
1019.8 580137312 576047957 572286904 568803251 565352142 562015831 559123576 556727707 554578841
1036.1 554578841 552580953 550893068 549486876 548008323 546244502 544411302 542754173 541299701
1052.4 541299701 540222764 539970696 540781558 542196274 543441534 544106305 544038117 542971671 540809035
1070.8 540809035 538047612 535302341 532618940 529759228 526838183 524046361 521115541 517708898
1087.1 517708898 514076889 510878682 508560121 507170677 506705821 507201672 508315206 509440362 510305226
$$ packed form
970.8F80057108j0935366r894490q610308p210970n883575m917383m417538m073143
987.1F24114335l541708k901614k470791k232194j848281j315236j041949j209855
1003.5F07552707j577437k052188k802431l713966m316628m422485m307032m223228
1019.8E80137312m089355l761053l483653l451109l336311k892255k395869k148866
1036.1E54578841j997888j687885j406192j478553j763821j833200j657129j454472
1052.4E41299701j076937k52068Q10862J414716J245260O64771o8188j066446k162636
1070.8E40809035k761423k745271k683401k859712k921045k791822k930820l406643
1087.1E17708898l632009l198207k318561j389444m64856M95851J113534J125156Q64864
$$ plain form
1105.4 510305226 511034906 511593819 511621118 510876358 509356618 506864369 503077030 498629540 495346457
1123.8 495346457 494299531 494781107 495923966 497185379 498100638 499057800 500750959 503249466 506146073
1142.2 506146073 508897424 511163950 513023674 514731288 516368687 517949283 519722402 522009075
1158.5 522009075 524898946 528427482 532833099 538330436 544713974 551494122 558333158 565129638
1174.8 565129638 571763992 577988923 583592057 588552833 592805743 596017063 597953022 598726511
1191.1 598726511 598599970 597876906 597004175 596558511 596946955 598157227 599899471 601858854 603722513
1209.5 603722513 605189621 606113136 606586337 606836855 607059598 607308805 607596934 608004928 608594358
1227.8 608594358 609404027 610463440 611746609 613211572 614826381 616495728 618074358 619476974
$$ packed form
1105.4E10305226P29680N58913K7299p44760j519740k492249l787339m447490l283083
1123.8D95346457j046926M81576J142859J261413R15259R57162J693159K498507K896607
1142.2E06146073K751351K266526J859724J707614J637399J580596J773119K286673
1158.5E22009075K889871L528536M405617N497337O383538O780148O839036O796480
1174.8E65129638O634354O224931N603134M960776M252910L211320J935959P73489
1191.1E98726511j26541p23064q72731m45664L88444J210272J742244J959383J863659
1209.5F03722513J467108R23515M73201K50518K22743K49207K88129M07994N89430
1227.8F08594358Q09669J059413J283169J464963J614809J669347J578630J402616
$$ plain form
1244.1 619476974 620666564 621589303 622168839 622460365 622690618 623021722 623485684 624184787 625366807
1262.5 625366807 627163589 629438877 632102430 635289073 638947248 642744899 646572292 650603950
1278.8 650603950 654866517 659144521 663380742 667805552 672433078 676873744 680911899 684739470
1295.1 684739470 688452363 691771448 694528103 696986973 699366570 701437116 702958405 704177439
1311.4 704177439 705390275 706458330 707273304 708141685 709338665 710691690 711946964 713179171 714484096
1329.8 714484096 715576172 716129482 716344476 716615200 716896415 716997445 717155874 717694461 718442321
1348.1 718442321 718937218 719162941 719453037 719739020 719660521 719182253 718514383 717719793 716619432 715256870
1368.5 715256870 714150727 713283896 711931646 710010469 707657337 704300702 700305402 697770059
$$ packed form
1244.1F19476974J189590R22739N79536K91526K30253L31104M63962O99103J182020
1262.5F25366807J796782K275288K663553L186643L658175L797651L827393M031658
1278.8F50603950M262567M278004M236221M424810M627526M440666M038155L827571
1295.1F84739470L712893L319085K756655K458870K379597K070546J521289J219034
1311.4G04177439J212836J068055Q14974Q68381J196980J353025J255274J232207J304925
1329.8G14484096J092076N53310K14994K70724K81215J01030J58429N38587P47860
1348.1G18442321M94897K25723K90096K85983p8499m78268o67870p94590j100361j362562
1368.5G15256870j106143q66831j352250j921177k353132l356635l995300k535343
$$ plain form
1384.9 697770059 697825193 698835969 699039638 698379040 697205603 695760846 693721592 691189647 688637495
1403.2 688637495 686048388 683522284 681143343 679041684 677521408 676485419 675358832 674000561
1419.5 674000561 673140824 672675610 672177076 671802282 671704412 671830952 672099531 672601640 673511386 674568355
1439.9 674568355 675691187 676999450 678723574 680897295 683226764 685727358 688788593 693458021
1456.2 693458021 699568272 704347432 708619118 713851810 719361722 724181354 729454458 736400604
1472.6 736400604 743053257 747897327 751823902 755205691 757916570 759789288 761033416 761496246
1488.9 761496246 760889292 759827733 758499146 756380558 753600001 750918925 748671949 745862722
1505.2 745862722 740320325 734708726 730552554 726799130 723275840 720000625 717283607 714559674
$$ packed form
1384.9F97770059N5134J010776K03669o60598j173437j444757k039254k531945k552152
1403.2F88637495k589107k526104k378941k101659j520276j035989j126587j358271
1419.5F74000561q59737m65214m98534l74794r7870J26540K68579N02109R09746J056969
1439.9F74568355J122832J308263J724124K173721K329469K500594L061235M669428
1456.2F93458021O110251M779160M271686N232692N509912M819632N273104O946146
1472.6G36400604O652653M844070L926575L381789K710879J872718J244128M62830
1488.9G61496246o06954j061559j328587k118588k780557k681076k246976k809227
1505.2G45862722n542397n611599m156172l753424l523290l275215k717018k723933
$$ plain form
1521.5 714559674 711798728 709245682 706663549 704604447 702787757 700571179 698800325 697750390
1537.8 697750390 696382463 694684029 693655252 693277299 693444073 693993151 694841444 696031272 697403669
1556.2 697403669 698409736 698537886 698331654 697868645 696955502 695151210 692284048 689489603 686262727
1574.5 686262727 681128204 675923645 671369255 666285336 660706639 654890895 648886800 642691255
1590.9 642691255 636395574 630013227 623742878 617702365 611692369 605696321 599914730 594207704
1607.2 594207704 588294983 582542539 577352345 571785688 565157890 559974194 555857837 551097572
1623.5 551097572 546478331 542482555 539017320 536609650 534901381 533226669 532306969 532452285 533344865
1641.8 533344865 534841657 537236154 540388882 543022931 546188951 551263869 555352390 558907628
$$ packed form
1521.5G14559674k760946k553046k582133k059102j816690k216578j770854j049935
1537.8F97750390j367927j698434j028777l77953J66774N49078Q48293J189828J372397
1556.2F97403669J006067J28150k06232m63009r13143j804292k867162k794445l226876
1574.5F86262727n134523n204559m554390n083919n578697n815744o004095o195545
1590.9F42691255o295681o382347o270349o040513o009996n996048n781591n707026
1607.2E94207704n912721n752444n190194n566657o627798n183696m116357m760265
1623.5E51097572m619241l995776l465235k407670j708269j674712r19700J45316Q92580
1641.8E33344865J496792K394497L152728K634049L166020N074918M088521L555238
$$ plain form
1658.2 558907628 563270628 568772733 574687243 579924345 585727334 592760086 599079430 605476141
1674.5 605476141 612634718 619210243 625438213 632611692 642049193 650243580 656919301 664047539
1690.8 664047539 670786023 678327203 687108457 695823133 705702543 713841021 720617712 727497995
1707.1 727497995 733363569 738521636 743392348 748068154 752849936 756951749 760054350 762964129
1723.4 762964129 766020894 769052744 772135377 775034547 778086722 781199098 783712506 786332607
1739.7 786332607 789212465 792097747 795021653 797882318 800631166 803268969 805517673 807541192
1756.1 807541192 809542239 811432540 813269734 814842701 816215038 817705929 819246054 820572615
1772.4 820572615 821651459 822695315 823863328 824997067 825972080 826999843 828162551 829252243
$$ packed form
1658.2E58907628M363000N502105N914510N237102N802989P032752O319344O396711
1674.5F05476141P158577O575525O227970P173479R437501Q194387O675721P128238
1690.8F64047539O738484P541180Q781254Q714676R879410Q138478O776691O880283
1707.1G27497995N865574N158067M870712M675806M781782M101813L102601K909779
1723.4G62964129L056765L031850L082633K899170L052175L112376K513408K620101
1739.7G86332607K879858K885282K923906K860665K748848K637803K248704K023519
1756.1H07541192K001047J890301J837194J572967J372337J490891J540125J326561
1772.4H20572615J078844J043856J168013J133739R75013J027763J162708J089692
$$ plain form
1788.7 829252243 830195963 831169724 832125425 832963586 833705842 834458351 835250318 835961521 836580932 837210655
1809.1 837210655 837882221 838456750 838913858 839375019 839922667 840470970 840976119 841526270 842112720 842585504
1829.5 842585504 842875838 843150735 843537211 843971908 844353855 844738901 845173061 845548093 845768154 845953047
1849.9 845953047 846219838 846539021 846830845 847077370 847374737 847723007 848051012 848325670 848538280 848690689
1870.3 848690689 848789811 848886311 849054754 849289417 849485338 849625409 849810600 850060403 850214243 850216746
1890.7 850216746 850259840 850425482 850571156 850609481 850656092 850805342 850986183 851073086 851090610 851164281 851285517
1913.1 851285517 851342082 851334989 851385653 851440072 851366282 851261556 851279378 851351321 851320505 851210713 851165652
1935.5 851165652 851205707 851201475 851099789 851001799 850929618 850770593 850554824 850421667 850360215 850236773 850023448
$$ packed form
1788.7H29252243R43720R73761R55701Q38161P42256P52509P91967P11203O19411O29723
1809.1H37210655O71566N74529M57108M61161N47648N48303N05149N50151N86450M72784
1829.5H42585504K90334K74897L86476M34697L81947L85046M34160L75032K20061J84893
1849.9H45953047K66791L19183K91824K46525K97367L48270L28005K74658K12610J52409
1870.3H48690689R9122R6500J68443K34663J95921J40071J85191K49803J53840K503
1890.7H50216746M3094J65642J45674L8325M6611J49250J80841Q6903J7524P3671J21236
1913.1H51285517N6565p093N0664N4419p3790j04726J7822P1943l0816j09792m5061
1935.5H51165652M0055m232j01686r7990p2181j59025k15769j33157o1452j23442k13325
$$ plain form
1958 850023448 849865854 849815786 849726379 849507928 849287748 849170625 849053025 848871946 848740280 848709524
1978.4 848709524 848621905 848410010 848237038 848198116 848139226 847928584 847692192 847567677 847448766 847203195
1998.8 847203195 846949518 846831143 846732199 846499681 846242905 846101165 845982432 845755696 845488667 845316231
2019.2 845316231 845161796 844914019 844680369 844589114 844504833 844270766 843993008 843823433 843714178 843531132
2039.6 843531132 843291163 843123078 843030751 842869341 842657268 842554271 842516720 842375219 842166424 842040896
2060 842040896 841989696 841866374 841660023 841553271 841545939 841467023 841314077 841241121 841277480 841283023 841190040
2082.4 841190040 841093361 841074407 841041803 840916574 840826809 840858877 840863943 840759039 840684772 840736389 840817153
2104.8 840817153 840817332 840767264 840758920 840790570 840783834 840760529 840795577 840869486 840921223 840972543 841063976 841160238
$$ packed form
1958H50023448j57594n0068q9407k18451k20180j17123j17600j81079j31666l0756
1978.4H48709524q7619k11895j72972l8922n8890k10642k36392j24515j18911k45571
1998.8H47203195k53677j18375r8944k32518k56776j41740j18733k26736k67029j72436
2019.2H45316231j54435k47777k33650r1255q4281k34067k77758j69575j09255j83046
2039.6H43531132k39969j68085r2327j61410k12073j02997l7551j41501k08795j25528
2060H42040896n1200j23322k06351j06752p332p8916j52946p2956L6359N543r2983
2082.4H41190040r6679j8954l2604j25229q9765L2068N066j04904p4267N1617Q0764
2104.8H40817153J79n0068q344L1650o736k3305L5048P3909N1737N1320R1433R6262
$$ plain form
2129.3 841160238 841220498 841283143 841413617 841559410 841615021 841611505 841693759 841867864 841988921 842018604 842082918
2151.7 842082918 842239738 842384338 842474282 842579663 842733204 842870474 842935622 842994571 843146026 843356967
2172.1 843356967 843510628 843601823 843719184 843879879 844005823 844075859 844162405 844294548 844395101 844416857
2192.5 844416857 844454527 844579041 844717860 844795048 844836652 844903708 844972491 844982028 844993293 845090270 845183194
2215 845183194 845170140 845138907 845209002 845318019 845329762 845278323 845298588 845359981 845328927 845247030 845265329 845357239
2239.4 845357239 845358193 845266283 845254600 845344305 845339715 845205367 845144928 845195711 845196366 845117211 845073938 845105827
2263.9 845105827 845128417 845106423 845146418 845280528 845337749 845246315 845209539 845367372 845534205 845536470 845510542
2286.3 845510542 845619678 845738053 845702112 845636725 845698178 845820308 845850646 845801353 845827818 845896542 845840454
$$ packed form
2129.3H41160238O0260O2645J30474J45793N5611l516Q2254J74105J21057K9683O4314
2151.7H42082918J56820J44600Q9944J05381J53541J37270O5148N8949J51455K10941
2172.1H43356967J53661R1195J17361J60695J25944P0036Q6546J32143J00553K1756
2192.5H44416857L7670J24514J38819P7188M1604O7056O8783R537J1265R6977R2924
2215H45183194j3054l1233P0095J09017J1743n1439K0265O1393l1054q1897J8299R1910
2239.4H45357239R54r1910j1683Q9705m590j34348o0439N0783O55p9155m3273L1889
2263.9H45105827K2590k1994L9995J34110N7221r1434l6776J57833J66833K265k5928
2286.3H45510542J09136J18375l5941o5387O1453J22130L0338m9293K6465O8724n6088
$$ plain form
2308.8 845840454 845747054 845835328 846022666 846042454 845910072 845875919 845987320 846079946 846057951 846022606 846115291
2331.2 846115291 846229196 846236765 846240461 846309245 846323729 846281111 846511245 847025216 847345948 847287059 847062767
2353.6 847062767 846891820 846768439 846724629 846851408 847066939 847260594 847498178 847813427 848165452 848556399
2374 848556399 848930955 849259138 849621058 850000322 850265503 850403845 850537956 850701511 850817025 850839913
2394.4 850839913 850847363 850933075 851046741 851094544 851093888 851117313 851179659 851223111 851194501 851161420 851182401 851176918
2418.9 851176918 851102650 851037264 851034880 851030827 850970268 850919127 850937665 850933135 850809395 850684404 850695848 850745976
2443.4 850745976 850686610 850555301 850473166 850433767 850335479 850219429 850217760 850276232 850199819 849997997 849880934
2465.8 849880934 849866390 849784195 849608302 849497497 849497139 849426925 849212766 849038243 849005342 848962069 848803937
$$ packed form
2308.8H45840454r3400Q8274J87338J9788j32382l4153J11401R2626k1995l5345R2685
2331.2H46115291J13905P569L696O8784J4484m2618K30134N13971L20732n8889k24292
2353.6H47062767j70947j23381m3810J26779K15531J93655K37584L15249L52025L90947
2374H48556399L74556L28183L61920L79264K65181J38342J34111J63555J15514K2888
2394.4H50839913P450Q5712J13666M7803o56K3425O2346M3452k8610l3081K0981n483
2418.9H51176918p4268o5386k384m053o0559n1141J8538m530j23740j24991J1444N0128
2443.4H50745976n9366j31309q2135l9399r8288j16050j669N8472p6413k01822j17063
2465.8H49880934j4544q2195j75893j10805l58p0214k14159j74523l2901m3273j58132
$$ plain form
2488.3 848803937 848666310 848656476 848608196 848381937 848174393 848148465 848102450 847885907 847696424 847681284 847692370
2510.7 847692370 847553790 847367823 847335219 847337484 847176015 846972883 846903265 846883833 846754014 846571267
2531.1 846571267 846515059 846511185 846348882 846099675 845972180 845954716 845875442 845686495 845519781 845456541 845371962
2553.5 845371962 845157802 844945610 844874263 844820023 844626427 844409645 844306827 844202518 843966722 843694508
2573.9 843694508 843515933 843347311 843063116 842766047 842595041 842439234 842140794 841788650 841540396 841328979
2594.3 841328979 840994775 840585113 840270519 840022206 839669645 839213431 838801086 838463247 838094175 837663054
2614.7 837663054 837278783 836986125 836657524 836232185 835835159 835520148 835160673 834696889 834258437 833925962
2635.1 833925962 833578944 833117545 832668245 832349122 832051635 831657529 831230998 830889642 830597937 830231547
$$ packed form
2488.3H48803937j37627r834m8280k26259k07544k5928m6015k16543j89483j5140J1086
2510.7H47692370j38580j85967l2604K265j61469k03132o9618j9432j29819j82747
2531.1H46571267n6208l874j62303k49207j27495j7464p9274j88947j66714o3240q4579
2553.5H45371962k14160k12192p1347n4240j93596k16782j02818j04309k35796k72214
2573.9H43694508j78575j68622k84195k97069j71006j55807k98440l52144k48254k11417
2594.3H41328979l34204m09662l14594k48313l52561m56214m12345l37839l69072m31121
2614.7H37663054l84271k92658l28601m25339l97026l15011l59475m63784m38452l32475
2635.1H33925962l47018m61399m49300l19123k97487l94106m26531l41356k91705l66390
$$ plain form
2655.5 830231547 829819739 829472721 829170227 828825355 828435540 828071475 827730596 827352762 826968491 826631129
2675.9 826631129 826314211 825957954 825548530 825137496 824742734 824323475 823886096 823493361 823146224 822784424
2696.3 822784424 822370648 821912766 821457565 820995808 820493639 820001602 819564164 819130838 818624139 818086624
2716.7 818086624 817633450 817239583 816804647 816341043 815855145 815317988 814790845 814302564 813827455 813366711
2737.1 813366711 812897503 812397063 811926723 811532259 811151803 810716867 810203671 809647620 809127748 808654308
2757.5 808654308 808151662 807585359 807001472 806438148 805883169 805320621 804786444 804252744 803587556 802817702
2777.9 802817702 802103341 801469088 800828695 800157845 799499393 798805237 797993064 797130644 796324790 795534670
2798.3 795534670 794658601 793704093 792748511 791851521 790981710 790020406 788975298 787968040 786966085
$$ packed form
2655.5H30231547m11808l47018l02494l44872l89815l64065l40879l77834l84271l37362
2675.9H26631129l16918l56257m09424m11034l94762m19259m37379l92735l47137l61800
2696.3H22784424m13776m57882m55201m61757n02169m92037m37438m33326n06699n37515
2716.7H18086624m53174l93867m34936m63604m85898n37157n27143m88281m75109m60744
2737.1H13366711m69208n00440m70340l94464l80456m34936n13196n56051n19872m73440
2757.5H08654308n02646n66303n83887n63324n54979n62548n34177n33700o65188p69854
2777.9H02817702p14361o34253o40393o70850o58452o94156q12173q62420q05854p90120
2798.3G95534670q76069r54508r55582q96990q69811r61304j045108j007258j001955
$$ plain form
2816.6 786966085 785875022 784770310 783701539 782560885 781306028 780022740 778770864 777459681
2832.9 777459681 775951564 774222672 772246599 769876420 766962886 763518512 759903908 756744444
2849.3 756744444 754470408 753049731 752188027 751552641 750777364 749642789 748216927 746557057 744600594
2867.6 744600594 742485762 740523219 738822401 737283289 735885501 734694541 733638942 732553899
2883.9 732553899 731346786 730042875 728702426 727329254 725898623 724391222 722826242 721206605
2900.2 721206605 719471872 717595220 715609252 713478804 711022556 708127558 705012381 702053607
2916.6 702053607 699486136 697429180 695961475 695033073 694499552 694283605 694312513 694522500 695034266
2934.9 695034266 696015000 697438717 699169815 701023698 702719808 704048157 705008507 705664635 705971718
$$ packed form
2816.6G86966085j091063j104712j068771j140654j254857j283288j251876j311183
2832.9G77459681j508117j728892j976073k370179k913534l444374l614604l159464
2849.3G56744444k274036j420677q61704o35386p75277j134575j425862j659870j956463
2867.6G44600594k114832j962543j700818j539112j397788j190960j055599j085043
2883.9G32553899j207113j303911j340449j373172j430631j507401j564980j619637
2900.2G21206605j734733j876652j985968k130448k456248k894998l115177k958774
2916.6G02053607k567471k056956j467705r28402n33521k15947K8908K09987N11766
2934.9F95034266R80734J423717J731098J853883J696110J328349R60350O56128L07083
$$ plain form
2953.3 705971718 705987394 705973327 706105649 706387639 706734180 707107663 707560420 708080292 708591700 709078193
2973.7 709078193 709566236 710081160 710610628 711081862 711527467 712035120 712522209 712912083 713185132 713225484
2994.1 713225484 713054061 712712049 712152779 711520255 710878372 710140824 709438264 708892405 708298445 707467437
3014.5 707467437 706456542 705310762 704047680 702832103 701744497 700624704 699416816 698240817
3030.8 698240817 697108865 695855439 694418371 693001688 691716313 690361559 688780487 687113702
3047.1 687113702 685550630 684050381 682453573 680752218 679017425 677314341 675745368 674311280
3063.4 674311280 672912776 671438813 669852197 668252528 666798830 665547609 664297819 662842631
3079.7 662842631 661237240 659624159 658053577 656517982 654988945 653354943 651584327 649846613
$$ packed form
2953.3G05971718J5676j4067J32322K81990L46541L73483M52757N19872N11408M86493
2973.7G09078193M88043N14924N29468M71234M45605N07653M87089L89874K73049M0352
2994.1G13225484j71423l42012n59270o32524o41883p37548p02560n45859n93960q31008
3014.5G07467437j010895j145780j263082j215577j087606j119793j207888j175999
3030.8F98240817j131952j253426j437068j416683j285375j354754j581072j666785
3047.1F87113702j563072j500249j596808j701355j734793j703084j568973j434088
3063.4F74311280j398504j473963j586616j599669j453698j251221j249790j455188
3079.7F62842631j605391j613081j570582j535595j529037j634002j770616j737714
$$ plain form
3096 649846613 648274004 646747351 645046532 643225372 641494215 639828026 638033986 636161625 634434223
3114.4 634434223 632781148 630972743 628901780 626616716 624343216 622247756 620252609 618179321
3130.7 618179321 615978003 613801062 611757517 609690845 607392430 604924262 602509260 600234747
3147 600234747 598074436 595953763 593687117 591182590 588600755 586060584 583542407 581068158 578640163
3165.4 578640163 576187432 573683441 571172655 568689406 566208005 563689709 561153114 558618844
3181.7 558618844 556103468 553646088 551231742 548779964 546251118 543677926 541118205 538615048
3198 538615048 536143064 533690333 531292140 528927565 526540697 524155676 521828473 519547403 517296076
3216.4 517296076 515048802 512754500 510436952 508170903 505960405 503795028 501728177 499729335
$$ packed form
3096F49846613j572609j526653j700819j821160j731157j666189j794040j872361j727402
3114.4F34434223j653075j808405k070963k285064k273500k095460j995147k073288
3130.7F18179321k201318k176941k043545k066672k298415k468168k415002k274513
3147F00234747k160311k120673k266646k504527k581835k540171k518177k474249k427995
3165.4E78640163k452731k503991k510786k483249k481401k518296k536595k534270
3181.7E58618844k515376k457380k414346k451778k528846k573192k559721k503157
3198E38615048k471984k452731k398193k364575k386868k385021k327203k281070k251327
3216.4E17296076k247274k294302k317548k266049k210498k165377k066851j998842
$$ plain form
3232.7 499729335 497637302 495458156 493372023 491396934 489468038 487605929 485763997 483853847
3249 483853847 481950253 480174899 478502393 476806790 475015193 473205686 471474737 469807237 468192399
3267.4 468192399 466645837 465061098 463354945 461586714 459820092 458092183 456405550 454741091
3283.7 454741091 453092635 451461285 449877948 448295057 446566761 444699198 442841083 441067666
3300 441067666 439397484 437800199 436120093 434232891 432184517 430108488 428134471 426271230 424391747
3318.4 424391747 422446519 420537949 418676287 416700751 414593279 412537485 410600305 408726007
3334.7 408726007 406871825 404940009 402872145 400768131 398681492 396670580 394818753 392905444
3351 392905444 390759617 388568044 386533290 384678990 382836133 380942494 379202127 377603769 375848949
$$ packed form
3232.7D99729335k092033k179146k086133j975089j928896j862109j841932j910150
3249D83853847j903594j775354j672506j695603j791597j809507j730949j667500j614838
3267.4D68192399j546562j584739j706153j768231j766622j727909j686633j664459
3283.7D54741091j648456j631350j583337j582891j728296j867563j858115j773417
3300D41067666j670182j597285j680106j887202k048374k076029j974017j863241j879483
3318.4D24391747j945228j908570j861662j975536k107472k055794j937180j874298
3334.7D08726007j854182j931816k067864k104014k086639k010912j851827j913309
3351C92905444k145827k191573k034754j854300j842857j893639j740367j598358j754820
$$ plain form
3369.3 375848949 373852134 371873230 370164007 368700504 367318869 365923584 364599466 363442630
3385.7 363442630 362540305 361965150 361404598 360497415 359524190 358979046 358711988 358152360 357275158 356613517
3406.1 356613517 356304735 356113613 355912596 355631709 355357796 355280966 355359763 355484158 355757207 356276691
3426.5 356276691 356979072 357686728 358448446 359383970 360211015 360741198 361320049 362251997 363460571
3444.8 363460571 364763230 366058528 367450207 368974388 370576859 372362435 374318033 376163632
3461.1 376163632 377963871 380095750 382446289 384479642 386061460 387683451 389673799 392002851
3477.4 392002851 394366533 396435738 398429424 400684327 402994484 405180007 407500476 410028428
3493.8 410028428 412616163 415118963 417574495 420087278 422484905 424699098 427067012 429805964
$$ packed form
3369.3C75848949j996815j978904j709223j463503j381635j395285j324118j156836
3385.7C63442630r02325n75155n60552r07183r73225n45144k67058n59628q77202o61641
3406.1C56613517l08782j91122k01017k80887k73913p6830P8797J24395K73049N19484
3426.5C56276691P02381P07656P61718R35524Q27045N30183N78851R31948J208574
3444.8C63460571J302659J295298J391679J524181J602471J785576J955598J845599
3461.1C76163632J800239K131879K350539K033353J581818J621991J990348K329052
3477.4C92002851K363682K069205J993686K254903K310157K185523K320469K527952
3493.8D10028428K587735K502800K455532K512783K397627K214193K367914K738952
$$ plain form
3510.1 429805964 432749778 435553014 438088894 440657675 443530202 446717888 449825197 452607244
3526.4 452607244 455407262 458445698 461649835 465024948 468433619 471674502 475038171 478666961
3542.7 478666961 482283264 485650241 488891512 492319435 495975703 499677956 503460288 507482409
3559 507482409 511563003 515312791 518947959 523342967 528096974 532338142 536469758 540930986 545585930
3577.4 545585930 550361156 555339694 560300887 565122664 570117474 575232387 580111086 585105002
3593.7 585105002 590418100 595840931 601326883 606835067 612085879 617064416 622350633 627907157
3610 627907157 633435786 639059126 644357204 649647653 655555606 661127329 665885270 670236051 675421655
3628.4 675421655 681514323 686687708 691453755 696247637 700896323 705553174 710120559 714269459
$$ packed form
3510.1D29805964K943814K803236K535880K568781K872527L187686L107309K782047
3526.4D52607244K800018L038436L204137L375113L408671L240883L363669L628790
3542.7D78666961L616303L366977L241271L427923L656268L702253L782332M022121
3559E07482409M080594L749788L635168M395008M754007M241168M131616M461228M654944
3577.4E45585930M775226M978538M961193M821777M994810N114913M878699M993916
3593.7E85105002N313098N422831N485952N508184N250812M978537N286217N556524
3610F27907157N528629N623340N298078N290449N907953N571723M757941M350781N185604
3628.4F75421655O092668N173385M766047M793882M648686M656851M567385M148900
$$ plain form
3644.7 714269459 718183875 722819984 727899551 731710792 734813809 738574207 742414474 745536506
3661 745536506 748332083 751110554 753678262 756323934 759272635 761495471 763464749 765833378 767921329
3679.4 767921329 769864202 771882415 773853898 775855720 777850807 779433668 780742347 782067180
3695.7 782067180 783364177 784528852 785714090 786987424 788162053 789147496 789934933 790812194 791873276
3714 791873276 792792261 793536603 794189453 794815540 795464456 796227157 797007680 797584891 798107207 798768222
3734.4 798768222 799633145 800521314 800930142 800756097 800905287 801692128 801997781 802080989 802667856 803359210
3754.8 803359210 803808749 804227293 804755747 805107117 805323541 805541396 805762589 806119502 806556761 806931555
3775.2 806931555 807225764 807470918 807638347 807761669 807968676 808210194 808500230 808871865 809149504 809428334
$$ packed form
3644.7G14269459L914416M636109N079567L811241L103017L760398L840267L122032
3661G45536506K795577K778471K567708K645672K948701K222836J969278K368629K087951
3679.4G67921329J942873K018213J971483K001822J995087J582861J308679J324833
3695.7G82067180J296997J164675J185238J273334J174629R85443P87437Q77261J061082
3714G91873276R18985P44342O52850O26087O48916P62701P80523N77211N22316O61015
3734.4G98768222Q64923Q88169M08828j74045J49190P86841L05653Q3208N86867O91354
3754.8H03359210M49539M18544N28454L51370K16424K17855K21193L56913M37259L74794
3775.2H06931555K94209K45154J67429J23322K07007K41518K90036L71635K77639K78830
$$ plain form
3795.6 809428334 809735835 809732616 809751391 809994578 810099721 810306489 810632229 810805082 810871303 811188698
3816 811188698 811543703 811480999 811477423 811610937 811720967 811835229 811877072 812044919 812372625 812510490 812417686
3838.4 812417686 812372208 812417865 812581301 812844574 813005626 812742770 812128782 812174559 812708557 812985122
3858.8 812985122 812986493 812945247 813086033 813083589 812817633 812751889 812905490 813146591 813278019 813225865 813301325
3881.3 813301325 813406348 813556552 813711703 813546598 813413739 813561141 813621283 813492537 813324571 813152611
3901.7 813152611 813092291 813240409 813319921 813295484 813348711 813406646 813348055 813271463 813297689 813334048 813380420
3924.1 813380420 813504934 813544333 813462079 813485622 813614786 813654184 813606799 813539743 813559353 813690364 813736975
3946.5 813736975 813670814 813641548 813692868 813780069 813868463 813934445 813910484 813814223 813788474 813868463 813992560
$$ packed form
3795.6H09428334L07501l219J8775K43187J05143K06768L25740J72853O6221L17395
3816H11188698L55005o2704l576J33514J10030J14262M1843J67847L27706J37865r2804
3838.4H12417686m5478M5657J63436K63273J61052k62856o13988M5777N33998K76565
3858.8H12985122J371m1246J40786k444k65956o5744J53601K41101J31428n2154P5460
3881.3H13301325J05023J50204J55151j65105j32859J47402O0142j28746j67966j71960
3901.7H13152611o0320J48118P9512k4437N3227N7935n8591p6592K6226L6359M6372
3924.1H13380420J24514L9399q2254K3543J29164L9398m7385o7056J9610J31011M6611
3946.5H13736975o6161k9266N1320Q7201Q8394O5982k3961r6261k5749P9989J24097
$$ plain form
3969 813992560 814101040 814153790 814198434 814288914 814392328 814509690 814652860 814722300 814682603 814641297 814682126
3991.4 814682126 814781725 814872444 814954817
3997.5 814954817
$$ packed form
3969H13992560J08480N2750M4644R0480J03414J17362J43170O9440l9697m1306M0829
3991.4H14682126R9599R0719Q2373
3997.5H14954817
##END=$$ End of the data block
