##TITLE=$$ Begin of the data block
##JCAMP-DX=5.00 $$ ACD/SpecManager v 10.08
##SPECTROMETER/DATA SYSTEM=Alpha
##DATE=09 Apr 2014 11:14:46
##DATA TYPE=INFRARED SPECTRUM
##DATA CLASS=XYDATA
##ORIGIN=
##OWNER=
##NPOINTS=1765
##FIRSTX=399.75695801
##LASTX=3997.56933594
##MAXX=3997.56933594
##MINX=399.75695801
##MAXY=0.85158944
##MINY=0.35563338
##XFACTOR=1.0000000000
##YFACTOR=1.000000000000000e-9
##FIRSTY=0.64386350
##DELTAX=2.03957629
##XUNITS=1/CM
##YUNITS=ARBITRARY UNITS
##XYDATA=(X++(Y..Y))
399.8F43863499q24630q91566j87159n95629j974225j531124M35114P74324r61841
$$ 643863499 643038869 642147303 641960144 641364515 639390290 637859166 638294280 639068604 638106763
418.1F38106763j551270o4612J61767o60181o38783L54410K11596j087189j126945
$$ 638106763 636555493 636490881 636652648 635992467 635353684 635708094 635919690 634832501 633705556
436.5F33705556o6459L0041o02365m18663K83063R8228n89490l58998L70681j12653
$$ 633705556 633639097 633669138 633066773 632648110 632931173 633029401 632439911 632080913 632451594 632338941
456.9F32338941j261949q99435J23859q0645j192749j298606k72215q8751r82702j086056
$$ 632338941 631076992 630177557 630301416 630220771 629028022 627729416 627457201 627368450 626385748 625299692
477.3F25299692k64406p2718p99954q72314J4961N2452j133442j497090m41253l6657
$$ 625299692 625035286 624962568 624162614 623290300 623305261 623357713 622224271 620727181 620285928 620249271
497.7F20249271q28504j109958l37005k07603j157343j320720k85327p331j066149
$$ 620249271 619420767 618310809 617973804 617766201 616608858 615288138 615002811 614995480 613929331
516F13929331j577675o91295l49343j320481j839578r51946l95357j198292j746893
$$ 613929331 612351656 611660361 611311018 609990537 608150959 607199013 606803656 605605364 603858471
534.4F03858471p88272Q5593n71609j230955m78744J32799p93338j584649p77543l2663
$$ 603858471 603070199 603155792 602584183 601353228 600874484 601007283 600213945 598629296 597851753 597819090
554.8E97819090r79900j971007j275360m43101j127720k150119j890003j209498j589179
$$ 597819090 596839190 594868183 593592823 593149722 592022002 589871883 587981880 586772382 585183203
573.1E85183203k159774j511455p47502j404762k144933j548230o97255j025737j805544
$$ 585183203 583023429 581511974 580764472 579359710 577214777 575666547 574969292 573943555 572138011
591.5E72138011j363992m87387q85845j820147j696527j011669j068771j334548o67036
$$ 572138011 570774019 570286632 569400787 567580640 565884113 564872444 563803673 562469125 561802089
609.8E61802089K44200J32680k39670R81152K969086L498078K967119K946496L513277
$$ 561802089 562046289 562178969 561939299 562920451 565889537 569387615 572354734 575301230 578814507
628.2E78814507L377854K550781K343118K711356K339363J178026N52714J078844J895786
$$ 578814507 582192361 584743142 587086260 589797616 592136979 593315005 593867719 594946563 596842349
646.5E96842349J949191J373946P25985J99318P35581K898156M763067M598797L060460
$$ 596842349 598791540 600165486 600891471 601090789 601826370 604724526 609487593 614086390 617146850
664.9F17146850K350151L351331L066957K201199K144695K466023K550065K000571
$$ 617146850 619497001 622848332 625915289 628116488 630261183 632727206 635277271 637277842
681.2F37277842J497864J661599J890480J555741J046241R52899J172364J060188O68466
$$ 637277842 638775706 640437305 642327785 643883526 644929767 645882666 647055030 648115218 648783684
699.6F48783684P06374J229346J568914J430213J375973J825273K196789J998484J689136
$$ 648783684 649490058 650719404 652288318 653718531 655094504 656919777 659116566 661115050 662804186
717.9F62804186J772166K043545J894891J565814J682222J950026J737058J238525
$$ 662804186 664576352 666619897 668514788 670080602 671762824 673712850 675449908 676688433
734.2F76688433J176834J541316J545668J072466J070679J713812J930833J448214
$$ 676688433 677865267 679406583 680952251 682024717 683095396 684809208 686740041 688188255
750.6F88188255J314342J822471J971841J384676J074374J552760J725972J026034
$$ 688188255 689502597 691325068 693296909 694681585 695755959 697308719 699034691 700060725
766.9G00060725N30005Q95858R98318N1975p71582n31435l44634j089752j518846o17742
$$ 700060725 700590730 701486588 702484906 702536881 701765299 701233864 700889230 699799478 698280632 697662890
787.3F97662890N77450R77278J405179K879202M483283M733980M248917M544258M989385
$$ 697662890 698240340 699217618 700622797 703501999 707985282 712719262 716968179 721512437 726501822
805.6G26501822M179061K828419K502144K717912J879453K64526m17471l95179j464903
$$ 726501822 730680883 733509302 736011446 738729358 740608811 740873337 740455866 740060687 738595784
824G38595784l273666l846169l287971l356337m002452l783047k850175k648831l198743
$$ 738595784 735322118 731475949 728187978 724831641 720829189 717046142 714195967 711547136 708348393
842.3G08348393k967715j532256k03133N99801K109647M619181O555856P018804P195056
$$ 708348393 705380678 703848422 703645289 704245090 706354737 710973918 717529774 724548578 731743634
860.7G31743634P927000Q051813O781876N391538M912555M438639L087759J736045
$$ 731743634 739670634 747722447 754504323 759895861 764808416 769247055 772334814 774070859
877G74070859J356542R84192m00484j727521j872838j662492k134204k471090j468777
$$ 774070859 775427401 776411593 776011109 774283588 772410750 770748258 768614054 766142964 764674187
895.4G64674187R5963P85709R42647J512766K041459J585126M29392l70741q35598
$$ 764674187 764770150 765555859 766498506 768011272 770052731 771637857 772067249 771696508 770860910
913.7G70860910j863479l241301l785789l287792k598643j965404r00805L89874J013279
$$ 770860910 768997431 765756130 761970341 758682549 756083906 754118502 753217697 753607571 754620850
932.1G54620850P66635M00782M13954L49760k05219p30634p92622j007199j913011
$$ 754620850 755387485 755788267 756202221 756551981 756346762 755616128 754823506 753816307 751903296
950.4G51903296k975703l642678m295230n410612o677866p694959q692026r951055
$$ 751903296 748927593 745284915 740989685 735579073 728901207 721206248 712514222 702563167
966.8G02563167j1078954j1416853j0894596r879887q596003p189632n890190m928530
$$ 702563167 691484213 680067360 669172764 659292877 650696874 643507242 637617052 632688522
983.1F32688522m406750m068196l575504k965867k503932k209007j810253j329958
$$ 632688522 628281772 624213576 620638072 617672205 615168273 612959266 611149013 609819055
999.4F09819055j110077j225531j512349k017021k851844l749251m278660m370332
$$ 609819055 608708978 607483447 605971098 603954077 601102233 597352982 593074322 588703990
1015.7E88703990m303038m266739m118621l766299l453552l381193l295958k895415
$$ 588703990 584400952 580134213 576015592 572249293 568795741 565414548 562118590 559223175
1032E59223175k410471k145946j970172j647115j381099j498282j795650j837611j626611
$$ 559223175 556812704 554666758 552696586 551049471 549668372 548170090 546374440 544536829 542910218
1050.4E42910218j419961j067281k48194Q00669J352907J162171O50942j78j048685
$$ 542910218 541490257 540422976 540174782 540975451 542328358 543490529 544141471 544141293 543092608
1068.7E43092608k233088k802729k715111k615988k819061k941967k806901k902627
$$ 543092608 540859520 538056791 535341680 532725692 529906631 526964664 524157763 521255136
1085E21255136l390015l647625l206253k318084j380861m37737N12362J118958J124918
$$ 521255136 517865121 514217496 511011243 508693159 507312298 506874561 507386923 508505881 509630799
1103.4E09630799Q59678P44760N66423k742p63774j497805k475083l802061m460007
$$ 509630799 510490477 511235237 511801660 511798918 511035144 509537339 507062256 503260195 498800188
1121.8D98800188l285289j080065M15056J096815J274079R60321R82880J708031K535105
$$ 498800188 495514899 494434834 494849890 495946705 497220784 498181105 499163985 500872016 503407121
1140.1E03407121K938926K765596K248227J828134J681090J624823J554608J733184
$$ 503407121 506346047 509111643 511359870 513188004 514869094 516493917 518048525 519781709
1156.4E19781709K274871K912163L570855M432499N481899O332100O719768O825685
$$ 519781709 522056580 524968743 528539598 532972097 538453996 544786096 551505864 558331549
1172.7E58331549O826997O629467O162167N560517M980087M274070L181339J890540
$$ 558331549 565158546 571788013 577950180 583510697 588490784 592764854 595946193 597836733
1189.1E97836733P66218r7871o73771q26955m25756L79026J182020J739561J994312
$$ 597836733 598602951 598505080 597831309 597004354 596578598 596957624 598139644 599879205 601873517
1207.4F01873517J895607J474201R18567M75169K48491J89782K15530K86400M20690
$$ 601873517 603769124 605243325 606161892 606637061 606885552 607075334 607290864 607577264 607997954
1225.8F07997954O21199Q50618J064659J258254J464128J629531J665414J571536J410782
$$ 607997954 608619153 609469771 610534430 611792684 613256812 614886343 616551757 618123293 619534075
1244.1F19534075J215875R29952N62668K96950K57194L48509M67777P11381J188159
$$ 619534075 620749950 621679902 622242570 622539520 622796714 623145223 623613000 624324381 625512540
1262.5F25512540J773477K263606K679348L164649L584086L751457L834367M040718
$$ 625512540 627286017 629549623 632228971 635393620 638977706 642729163 646563530 650604248
1278.8F50604248M260063M282594M245043M409730M588843M441678M088342L863335
$$ 650604248 654864311 659146905 663391948 667801678 672390521 676832199 680920541 684783876
1295.1F84783876L715694L326416K782464K464116K350628K039909J509011J237035
$$ 684783876 688499570 691825986 694608450 697072566 699423194 701463103 702972114 704209149
1311.4G04209149J242876J071811P97331Q60751J217842J382172J270115J240611J319051
$$ 704209149 705452025 706523836 707321167 708181918 709399760 710781932 712052047 713292658 714611709
1329.8G14611709J091361N20408J99020K97785L07381Q9765J37388N50449P71583N01096
$$ 714611709 715703070 716223478 716422498 716720283 717027664 717117429 717254817 717805266 718576849 719077945
1350.2G19077945K24948K75612K66194q3387m81367o67214p97272j105249j348734
$$ 719077945 719302893 719578505 719844699 719761312 719279945 718612731 717815459 716710210 715361476
1368.5G15361476j096904q66533j339912j909912k358913l375113m005909k523601
$$ 715361476 714264572 713398039 712058127 710148215 707789302 704414189 700408280 697884679
1384.9F97884679O5923R98973J92285o65307j192451j471221k030611k487183k519190
$$ 697884679 697950602 698949575 699141860 698476553 697284102 695812881 693782270 691295087 688775897
1403.2F88775897k594709k547264k385319k079069j498104j064658j174211j371801
$$ 688775897 686181188 683633924 681248605 679169536 677671432 676606774 675432563 674060762
1419.5F74060762q53658m36783m41134l28421r9957Q8393K27273M45843Q78811J089394
$$ 674060762 673207104 672770321 672329187 672000766 671900809 671989202 672216475 672662318 673541129 674630523
1439.9F74630523J154363J302957J689732K150417K340019K510488L067970M665852
$$ 674630523 675784886 677087843 678777575 680927992 683268011 685778499 688846469 693512321
1456.2F93512321O084084M806757M330635N248845N475104M786729N253077O934762
$$ 693512321 699596405 704403162 708733797 713982642 719457746 724244475 729497552 736432314
1472.6G36432314O653726M858196L958225L427148K725184J842439J214624M37974
$$ 736432314 743086040 747944236 751902461 755329609 758054793 759897232 761111856 761549830
1488.9G61549830o07192j012802j300395k153098k821446k677440k238036k841234
$$ 761549830 760942638 759929836 758629441 756476343 753654897 750977457 748739421 745898187
1505.2G45898187n557418n556524m112482l737926l530800l289104k737522k733529
$$ 745898187 740340769 734784245 730671763 726933837 723403037 720113933 717376411 714642882
1521.5G14642882k730310k532839k581418k059579j835108k218127j719832j003027
$$ 714642882 711912572 709379733 706798315 704738736 702903628 700685501 698965669 697962642
1537.8F97962642j369059j709938r97246l45111J62542N18024Q32617J201451J385033
$$ 697962642 696593583 694883645 693886399 693541288 693703830 694221854 695054471 696255922 697640955
1556.2F97640955R96232J39356j82748m75943r15944j755655k834380k802372l222227
$$ 697640955 698637187 698776543 698593795 698117852 697201908 695446253 692611873 689809501 686587274
1574.5F86587274n131900n219639m563450n097151n603731n847931o022811o185233
$$ 686587274 681455374 676235735 671672285 666575134 660971403 655123472 649100661 642915428
1590.9F42915428o282807o389260o278515o056070o048620o027877n795002n719483
$$ 642915428 636632621 630243361 623964846 617908776 611860156 605832279 600037277 594317794
1607.2E94317794n924046n753696n189955n580604o633878n172849m125655m770815
$$ 594317794 588393748 582640052 577450097 571869493 565235615 560062766 555937111 551166296
1623.5E51166296m604459l984928l464878k410054j714945j700520r41277J53602Q90970
$$ 551166296 546561837 542576909 539112031 536701977 534987032 533286512 532345235 532498837 533389807
1641.8E33389807J495003K441168L191650K605319L156424N137741M100442L524900
$$ 533389807 534884810 537325978 540517628 543122947 546279371 551417112 555517554 559042454
1658.2E59042454M346370N508543N933105N270780N844175P035077O272554O362439
$$ 559042454 563388824 568897367 574830472 580101252 585945427 592980504 599253058 605615497
1674.5F05615497P165253O587028O227374P143259R393096Q219064O729006P156015
$$ 605615497 612780750 619367778 625595152 632738411 642131507 650350571 657079577 664235592
1690.8F64235592O734371P514358Q721709Q634210R843349Q177400O841957O928981
$$ 664235592 670969963 678484321 687206030 695840240 705683589 713860989 720702946 727631927
1707.1G27631927N867660N149662M889488M694522M770875M099726L113449K915680
$$ 727631927 733499587 738649249 743538737 748233259 753004134 757103860 760217309 763132989
1723.4G63132989L066481L037750L075540K871514K998829L101348K538622K630591
$$ 763132989 766199470 769237220 772312760 775184274 778183103 781284451 783823073 786453664
1739.7G86453664K889395K905071K927124K833486K726972K665520K304017K053023
$$ 786453664 789343059 792248130 795175254 798008740 800735712 803401232 805705249 807758272
1756.1H07758272J970648J837552J830936J593172J376808J509547J572013J318157
$$ 807758272 809728920 811566472 813397408 814990580 816367388 817876935 819448948 820767105
1772.4H20767105J048803J040339J175464J152634R89855R96530J129567J098931R65893
$$ 820767105 821815908 822856247 824031711 825184345 826174200 827170730 828300297 829399228 830365121
1790.7H30365121R86517R56893Q33511P48277P70569P91132O86646N95092O22631O93202
$$ 830365121 831351638 832308531 833142042 833890319 834660888 835452020 836138666 836733758 837356389 838049591
1811.1H38049591N97059M57228M60684N59330N62131M93348N26965N94615M82798K83599
$$ 838049591 838646650 839103878 839564562 840123892 840686023 841179371 841706336 842300951 842783749 843067348
1831.5H43067348K73526L69906M20213M08649M07279M20868L63112K20537J97530K94864
$$ 843067348 843340874 843710780 844130993 844539642 844946921 845367789 845730901 845951438 846148968 846443832
1851.9H46443832L32475K76208K26080K90275L52323L20732K53082K11596J75655J00970
$$ 846443832 846776307 847052515 847278595 847568870 847921193 848241925 848495007 848706603 848882258 848983228
1872.3H48983228P9692J65104K42234J82211J11222J78576K56002J71780M9413O6757
$$ 848983228 849062920 849228024 849470258 849652469 849763691 849942267 850198269 850370049 850419462 850486219
1892.7H50486219J15156Q2255N4717J00255J48832J45018P8381M7504J05441J10149
$$ 850486219 850601375 850683630 850738347 850838602 850987434 851132452 851210833 851258337 851363778 851473927
1913.1H51473927J8836k3723N8889O1512o3717q9049K2828P2718j9372q2791j9729
$$ 851473927 851492763 851469040 851527929 851589441 851525724 851436675 851459503 851532221 851512849 851430058 851410329
1935.5H51410329L2008m3154j35004j12474p6294j42574j86265j20103r0063j64568
$$ 851410329 851442337 851399183 851264179 851151705 851075411 850932837 850746572 850626469 850536406 850371838
1955.9H50371838k18749j42813l5227p2777k03490k11597j02996j07468k14219j89244
$$ 850371838 850153089 850010276 849975049 849902272 849698782 849487185 849384189 849276721 849062502 848873258
1976.3H48873258n2572p0214j90735j54912k5749n7817k17199k52068j35362j01805
$$ 848873258 848820686 848750472 848559737 848404825 848379076 848321259 848104060 847851992 847716630 847614825
1996.7H47614825k14935k32815j01567q7022k30253k63572j62244j38402k31325k70546
$$ 847614825 847399890 847167075 847065508 846978486 846748233 846484661 846322417 846184015 845952690 845682144
2017.1H45682144j86920j62661k32935k09570p9930r0360k41697k87652j82271r9957
$$ 845682144 845495224 845332563 845099628 844890058 844810128 844719768 844478071 844190419 844008148 843908191
2037.5H43908191j67728k38061j70946j11699j76728j95801p6234k8253j62542k15292
$$ 843908191 843740463 843502402 843331456 843219757 843043029 842847228 842770994 842742741 842580199 842364907
2057.9H42364907r0837n0843j54436j95503r7394l0279q1003j47581r4116J2517r656
$$ 842364907 842274070 842223227 842068791 841873288 841775894 841745615 841664612 841517031 841422915 841435432 841425776
2080.3H41425776r8884q0525O377j4663j06096q7142J0491j550q0288m7802N1617N2393
$$ 841425776 841326892 841246367 841252744 841238081 841131985 841044843 841055334 841053784 840973496 840925694 840977311 841029704
2104.8H41029704m1962o4373K6643P0691j2636m3273N8711J06752M1484J6809O8605
$$ 841029704 840987742 840923369 840950012 841020703 841008067 840964794 841023505 841130257 841171741 841188550 841257155
2127.3H41257155R2268O2406N4836J04130J27315P9513N1379R6977J38938J23382P5698
$$ 841257155 841349423 841411829 841466665 841570795 841698110 841777623 841829002 841925979 842064917 842188299 842263997
2149.7H42263997Q1062J42097J25766N5075Q0764J73450J63734P6115P9036J72257
$$ 842263997 842345059 842487156 842612922 842667997 842748761 842922211 843085945 843162060 843241096 843413353
2170.1H43413353J93477J20163R8288J48415J73033J19030N4002R5665J78933J22548
$$ 843413353 843606830 843726993 843825281 843973696 844146729 844265759 844319761 844415426 844594359 844716907
2190.5H44716907l398K802R9956J28806P7486M6730P4268P6413J3888J3172R9242Q8871
$$ 844716907 844713509 844716311 844816267 844945073 845022559 845069289 845143557 845219970 845233858 845247030 845346272 845435143
2215H45435143k2710k4676R1553J08063j1087m6074O4194Q8692m5717r7990J3888P0751
$$ 845435143 845412433 845387757 845479310 845587373 845576286 845530212 845594406 845683098 845637381 845539391 845553279 845624030
2239.4H45624030k5034q9050m053Q7559M18j29044n0903P4744J9253q1480m4048M5002
$$ 845624030 845598996 845509946 845505893 845593452 845593870 845464826 845413923 845488667 845507920 845426440 845382392 845427394
2263.9H45427394J1802p3791j6928J15216Q5116m0353J0610J60932J27554m351n483
$$ 845427394 845439196 845365405 845348477 845463693 845548809 845508456 845519066 845679998 845807552 845803201 845797718
2286.3H45797718J06930J16885j6868m0650O8366J17481K7537n3167L0696P3076m8280
$$ 845797718 845904648 846021533 846004665 845964015 846032381 846149862 846177399 846124232 846154928 846228004 846179724
2308.8H46179724p5043P4566J51336J3948j29700l6895J26719J02460m6312q2791Q0466
$$ 846179724 846104681 846179247 846330583 846344531 846214831 846177936 846304655 846407115 846360803 846278012 846358478
2331.2H46358478J62005N7221L6955O0618l7611m3094K51830M85778K82526o4373j92464
$$ 846358478 846520483 846577704 846614659 846675277 846637666 846594572 846846402 847332180 847614706 847550333 847357869
2353.6H47357869j41144j09851o5029N8949K33174K90453K33948K67148L56138L77596
$$ 847357869 847216725 847106874 847041845 847100794 847333968 847624421 847858369 848125517 848481655 848859251
2374H48859251L46899L57389M18365L98159K59578J16110Q0943J33455J44243O8486
$$ 848859251 849206150 849563539 849981904 850380063 850639641 850755751 850836694 850970149 851114392 851182878
2394.4H51182878K0325N0724O4075J8894j430M3332Q1182M2737n3645n7041K6941J1325
$$ 851182878 851203203 851253927 851318002 851336896 851335466 851378798 851459980 851502717 851449072 851392031 851418972 851430297
2418.9H51430297p3195o5565J2279N066o8605o8187J3232K6226q2553j22129k1101
$$ 851430297 851357102 851291537 851303816 851308882 851240277 851172090 851185322 851211548 851128995 851006866 850985765
2441.3H50985765K3544p2479j30892n4776p16p8857j52289o9261K7656n3763j49786
$$ 850985765 851009309 850936830 850805938 850751162 850750446 850671589 850519300 850450039 850477695 850423932 850274146
2463.8H50274146p6414k5868j20938j72794q4161j8359j26898k19345j05143Q643p3373
$$ 850274146 850197732 850171864 850050926 849878132 849793971 849775612 849648714 849429369 849324226 849332869 849259496
2486.2H49259496j98365j47402L58j7822j90616k11179n0366k9981j84059j82510j8358
$$ 849259496 849061131 848913729 848914087 848896265 848705649 848494470 848444104 848414123 848230064 848047554 848029196
2508.7H48029196r596j50502j82390o4969l1710j68323k11299n6386K6584j06812k13384
$$ 848029196 848019600 847869098 847686708 847621739 847590029 847421706 847210407 847154021 847180605 847073793 846860409
2531.1H46860409j10686l0339j59740k41161j01149m77j05857k10226j38640k1279
$$ 846860409 846749723 846719384 846559644 846318483 846217334 846216857 846111000 845900774 845762134 845740855
2551.5H45740855p2897k23815j99914n0187p4685k26855k22504j01626j18554k39014
$$ 845740855 845667958 845444143 845244229 845194042 845119357 844892502 844669998 844568372 844449818 844210804
2571.9H44210804k47062j58727j70708k97606l03328j72317j79290l10481l27289k30134
$$ 844210804 843963742 843805015 843634307 843336701 843033373 842861056 842681766 842371285 842043996 841813862
2592.3H41813862k01463l19899m13537l24428k25663l14235m53890m24147l22401l55303
$$ 841813862 841612399 841292500 840878963 840554535 840328872 840014637 839560747 839136600 838814199 838458896
2612.7H38458896m51327m24146l20614l29792l92258l55900l19421m13775n05865m33803
$$ 838458896 838007569 837583423 837262809 836933017 836540759 836184859 835865438 835451663 834945798 834511995
2633.1H34511995l11315Tm26829m72545l67046l16918l99351m04477l12567l20017
$$ 834511995 834200680 833889365 833462536 832989991 832622945 832306027 831906676 831502199 831189632 830869615
2653.5H30869615m14133m30107l35634k66492l15845l86656l70323l30031l57390l73005
$$ 830869615 830455482 830025375 829689741 829423249 829107404 828720748 828350425 828020394 827663004 827289999
2673.9H27289999l22462l14354l70265m14788m19796l99887m00484m23968m21583l95656
$$ 827289999 826967537 826653183 826282918 825868130 825448334 825048447 824647963 824223995 823802412 823406756
2694.3H23406756l87311m16696m41671m40716m74751n19753n03540m38690m08232m71175
$$ 823406756 823019445 822602749 822161078 821720362 821245611 820725858 820222318 819783628 819375396 818904221
2714.6H18904221n06043m40598m17828m58599m50372m52340n20825n39780m91977m55081
$$ 818904221 818398178 817957580 817539752 817081153 816630781 816178441 815657616 815117836 814625859 814170778
2735H14170778m53949m91917n21660m77612l85702l48151m27603n35906n55873n09262
$$ 814170778 813716829 813224912 812703252 812225640 811839938 811491787 811064184 810528278 809972405 809463143
2755.4H09463143m69327n05864n86689n98073n57542n45859n53191n32150n49138o68704
$$ 809463143 808993816 808487952 807901263 807303190 806745648 806199789 805646598 805114448 804565310 803896606
2775.8H03896606p46787p00056o53386o71089o93440o59466o56724p68304q37267p85529
$$ 803896606 803149819 802449763 801796377 801125288 800431848 799772382 799115658 798347354 797510087 796724558
2796.2G96724558p77960q94487r92894r69708q91149q70526r64820j043439r88066
$$ 796724558 795946598 795052111 794059217 793089509 792198360 791327834 790363014 789319575 788331509
2814.6G88331509r70245j081645j125753j094043j149655j246750j286268j268864
$$ 788331509 787361264 786279619 785153866 784059823 782910168 781663418 780377150 779108286
2830.9G79108286j305580j484394j718045k007961k444506k945303l385902l555357
$$ 779108286 777802706 776318312 774600267 772592306 770147800 767202497 763816595 760261238
2847.2G60261238l157795k287030j433194q98421o78539p70330j091004j412332j674890
$$ 760261238 757103443 754816413 753383219 752484798 751806259 751035929 749944925 748532593 746857703
2865.6G46857703j967252k120256j935482j660287j529932j399100j195133j052380
$$ 746857703 744890451 742770195 740834713 739174426 737644494 736245394 735050261 733997881
2881.9G33997881j072585j228810j347363j345634j347303j420081j523554j586199
$$ 733997881 732925296 731696486 730349123 729003489 727656186 726236105 724712551 723126352
2898.2G23126352j610995j708924j860619j976371k139985k488613k920866l135980
$$ 723126352 721515357 719806433 717945814 715969443 713829458 711340845 708419979 705283999
2914.5G05283999k973854k537489k019584j494587r63807n03659j86801J5497K18868
$$ 705283999 702310145 699772656 697753072 696258485 695294678 694791019 694604218 694619715 694838583
2932.9F94838583N26667R46164J400709J785338J933635J742065J342713R44734O25730
$$ 694838583 695365250 696311414 697712123 699497461 701431096 703173161 704515874 705460608 706086338
2951.2G06086338K98678R597k5809J51277K82824L11136L90053M96089M95851M81963
$$ 706086338 706385016 706394613 706368804 706520081 706802905 707114041 707504094 708000183 708496034 708977997
2971.6G08977997N28157N39243N18978N22911M88222M29332M18902M12524M15921L66926
$$ 708977997 709506154 710045397 710564375 711087286 711575508 712004840 712423742 712836266 713252187 713619113
2992G13619113J24216j63913m00185o01411o48380o46173p11024o72162n37038n63383
$$ 713619113 713743329 713579416 713179231 712577820 711929440 711283267 710572243 709900081 709363043 708799660
3012.4G08799660p99417j011491j098454j182020j226544j192093j188219j204073
$$ 708799660 708000243 706988752 705890298 704708278 703481734 702289641 701101422 699897349
3028.7F99897349j189053j140237j217067j430691j420378j246512j329184j609206
$$ 699897349 698708296 697568059 696350992 694920301 693499923 692253411 690924227 689315021
3045.1F89315021j710236j564801j479089j618326j761317j734734j616537j496375
$$ 689315021 687604785 686039984 684560895 682942569 681181252 679446518 677829981 676333606
3061.4F76333606j432538j441955j480103j560271j610815j503110j327217j295209
$$ 676333606 674901068 673459113 671979010 670418739 668807924 667304814 665977597 664682388
3077.7F64682388j442015j568079j583993j582325j553118j521289j593590j682878
$$ 664682388 663240373 661672294 660088301 658505976 656952858 655431569 653837979 652155101
3094F52155101j675546j624405j653254j753509j755953j659274j641035j782060j849294
$$ 652155101 650479555 648855150 647201896 645448387 643692434 642033160 640392125 638610065 636760771
3112.4F36760771j723468j695514j872599k100766k237022k224206k108396k008140
$$ 636760771 635037303 633341789 631469190 629368424 627131402 624907196 622798800 620790660
3128.7F20790660k064883k175331k113700k014816k114356k315879k422690k408981
$$ 620790660 618725777 616550446 614436746 612421930 610307574 607991695 605569005 603160024
3145F03160024k345085k236665k162814k285361k492666k533138k446413k427578k495408
$$ 603160024 600814939 598578274 596415460 594130099 591637433 589104295 586657882 584230304 581734896
3163.4E81734896k545893k532065k475918k438307k472043k529084k548635k536476
$$ 581734896 579189003 576656938 574181020 571742713 569270670 566741586 564192951 561656475
3179.7E61656475k497673k473652k503932k495825k465129k510726k548576k534866
$$ 561656475 559158802 556685150 554181218 551685393 549220264 546709538 544160962 541626096
3196E41626096k516449k486229k442777k430856k442658k419114k363384k308428k266288
$$ 541626096 539109647 536623418 534180641 531749785 529307127 526888013 524524629 522216201 519949913
3214.3E19949913k248764k258539k275050k271354k251327k246440k197504k053976
$$ 519949913 517701149 515442610 513167560 510896206 508644879 506398439 504200935 502146959
3230.7E02146959j981914k112448k198785k076388j973510j945167j860977j813143
$$ 502146959 500165045 498052597 495853812 493777424 491803914 489858747 487997770 486184627
3247D86184627j887888j896888j770437j708805j758099j787484j768201j722783j681656
$$ 486184627 484296739 482399851 480629414 478920609 477162510 475375026 473606825 471884042 470202386
3265.3D70202386j640886j571715j603663j717448j745939j731426j726180j688897
$$ 470202386 468561500 466989785 465386122 463668674 461922735 460191309 458465129 456776232
3281.6D56776232j657904j657843j639128j592040j580864j679838j807272j860291
$$ 456776232 455118328 453460485 451821357 450229317 448648453 446968615 445161343 443301052
3298D43301052j817137j695097j615524j682430j859189k032667k095669k024472j931638
$$ 443301052 441483915 439788818 438173294 436490864 434631675 432599008 430503339 428478867 426547229
3316.3D26547229j902878j916051j891106j858622j980513k094329j996100j896739
$$ 426547229 424644351 422728300 420837194 418978572 416998059 414903730 412907630 411010891
3332.6D11010891j875281j834273j898408k058834k115548k095133k004921j856268
$$ 411010891 409135610 407301337 405402929 403344095 401228547 399133414 397128493 395272225
3348.9C95272225j941144k202154k247899k040863j834482j824707j857340j716763
$$ 395272225 393331081 391128927 388881028 386840165 385005683 383180976 381323636 379606873
3365.3C79606873j615644j773119k001971j966178j700968j509338j435668j414924
$$ 379606873 377991229 376218110 374216139 372249961 370548993 369039655 367603987 366189063
3381.6C66189063j324296j106084q23766n60164o10441r41515r70632n75334l18676
$$ 366189063 364864767 363758683 362934917 362374753 361764312 360822797 359852165 359276831 358958155
3399.9C58958155n49018q29310o57260l50297k36809j92702j91331k18540r9510O0529
$$ 358958155 358409137 357579827 356922567 356572270 356335461 356142759 355951428 355732888 355633378 355693907
3420.3C55693907R9986K59936N71370P64132P18683P46041R25392Q34108N53161N77688
$$ 355693907 355793893 356053829 356625199 357389331 358108014 358854055 359779447 360613555 361166716 361744404
3440.7C61744404Q95172J186729J321733J300156J339406J486241J656473J854777
$$ 361744404 362639576 363826305 365148038 366448194 367787600 369273841 370930314 372785091
3457C72785091J947463J791775J744449K118081K378524K051949J598448J646131J996755
$$ 372785091 374732554 376524329 378268778 380386859 382765383 384817332 386415780 388061911 390058666
3475.4C90058666K297163K330810K075523K000064K246171K313912K178222K279669
$$ 390058666 392355829 394686639 396762162 398762226 401008397 403322309 405500531 407780200
3491.7D07780200K508164K616256K528131K461642K548069K459615K256513K383441
$$ 407780200 410288364 412904620 415432751 417894393 420442462 422902077 425158590 427542031
3508D27542031K708971K887845K772957K532363K605230K917349L190369L094762K760500
$$ 427542031 430251002 433138847 435911804 438444167 441049397 443966746 447157115 450251877 453012377
3526.4D53012377K761573L016948L222317L413945L450603L277480L374100L627449
$$ 453012377 455773950 458790898 462013215 465427160 468877763 472155243 475529343 479156792
3542.7D79156792L636897L403812L250570L413766L647208L682822L742397L972829
$$ 479156792 482793689 486197501 489448071 492861837 496509045 500191867 503934264 507907093
3559E07907093M064142L790319L676057M410505M785240M255474M092514M411221M658758
$$ 507907093 511971235 515761554 519437611 523848116 528633356 532888830 536981344 541392565 546051323
3577.4E46051323M845083N065620N031049M835129M913569N057811M888535M997313
$$ 546051323 550896406 555962026 560993075 565828204 570741773 575799584 580688119 585685432
3593.7E85685432N316436N420149N474865N498111N226016M968286N300701N578458
$$ 585685432 591001868 596422017 601896882 607394993 612621009 617589295 622889996 628468454
3610F28468454N548775N609870N272806N339026O035805N671441M781485M331112N150020
$$ 628468454 634017229 639627099 644899905 650238931 656274736 661946177 666727662 671058774 676208794
3628.4F76208794O014586N114734M776537M831910M680455M668295M591227M177034
$$ 676208794 682223380 687338114 692114651 696946561 701627016 706295311 710886538 715063572
3644.7G15063572L917158M657685N036950L686190L018260L746390L834546L106654
$$ 715063572 718980730 723638415 728675365 732361555 735379815 739126205 742960751 746067405
3661G46067405K847194K842188K557993K646923K972305K166271J898408K381861K143324
$$ 746067405 748914599 751756787 754314780 756961703 759934008 762100279 763998687 766380548 768523872
3679.4G68523872J988649K025962J941025J957477J982212J628041J349807J324296
$$ 768523872 770512521 772538483 774479508 776436985 778419197 780047238 781397045 782721341
3695.7G82721341J257598J109898J179159J305461J142561R13203P98583R34660J073420
$$ 782721341 783978939 785088837 786267996 787573457 788716018 789629221 790427804 791362464 792435884
3714G92435884R59754Q22902P33018O53088N58853O33598O98745N27382M91321O89805
$$ 792435884 793395638 794218540 794951558 795604646 796163499 796797097 797495842 798023224 798514545 799204350
3734.4G99204350R80436R74179M16815j44780K08378P53880K77161J21057N80251O59526
$$ 799204350 800184786 801158965 801575780 801431000 801639378 802393258 802670419 802791476 803371727 804031253
3754.8H04031253M29928L65138M78149L80337K72274K09749J49369L07619M39168M27365
$$ 804031253 804461181 804826319 805304468 805684805 805957079 806166828 806316197 806623816 807062984 807490349
3775.2H07490349L89933K90692J44065R2685K10166L02255L46363L61144K35319K41340
$$ 807490349 807880282 808170974 808315039 808407724 808617890 808920145 809266508 809627652 809862971 810104311
3795.6H10104311K41696n8770O9738K72393M232J67668M20808K28942m888K15829L44515
$$ 810104311 810346007 810287237 810356975 810629368 810633600 810801268 811222076 811451018 811446130 811661959 812006474
3818H12006474r4116j7643K41875K04921J56045J04726K53617L53515P0274k29656
$$ 812006474 811912358 811894715 812136590 812341511 812497556 812602282 812855899 813209414 813279688 813050032
3838.4H13050032j64509L2067K27869L32474J76728l48747p45773N8711N95629L19838
$$ 813050032 812885523 812917590 813145459 813477933 813654661 813305914 812560141 812618852 813214481 813534319
3858.8H13534319P7129j8716P5698l0160k17855L397J84358K29239J17600r716J60993
$$ 813534319 813611448 813592732 813668430 813638270 813420415 813423812 813608170 813837409 813955009 813945293 814106286
3881.3H14106286J03235O378L8087j35183r9302J10090N0664n2452m8638j52885j68980
$$ 814106286 814209521 814215899 814253986 814118803 814019501 814129591 814180255 814127803 814079165 813926280 813757300
3903.7H13757300R4772J55866L0875K1160K7299m0055l9041L2664q524l6895Q9884
$$ 813757300 813852072 814007938 814038813 814059973 814087272 814047217 814008176 814040840 814032316 813995421 814085305
3926.1H14085305J18732o497k3961N4777M1723j5378o5565k4378R5486Q6069J848j371
$$ 814085305 814204037 814197540 814173579 814228356 814270079 814254701 814189136 814164758 814260244 814346313 814348161 814346790
3950.6H14346790M6492O3717O4135N5492j3113m2439L2068O4790P0155J15513R6262
$$ 814346790 814393282 814456999 814521134 814576626 814563513 814521074 814553142 814617932 814688087 814803600 814899862
3973.1H14899862O0141Q2612P6711N7340J06752J37150P5996K1815K4498M9352J01865
$$ 814899862 814960003 815042615 815119326 815176666 815283418 815420568 815496564 815518379 815542877 815592229 815694094
3995.5H15694094J38163
$$ 815694094 815832257
3997.5H15832257
$$ 815832257
##END=$$ End of the data block
