##TITLE=$$ Begin of the data block
##JCAMP-DX=5.00 $$ ACD/SpecManager v 10.08
##SPECTROMETER/DATA SYSTEM=Alpha
##DATE=09 Apr 2014 11:14:46
##DATA TYPE=INFRARED SPECTRUM
##DATA CLASS=XYDATA
##ORIGIN=
##OWNER=
##NPOINTS=1765
##FIRSTX=399.75695801
##LASTX=3997.56933594
##MAXX=3997.56933594
##MINX=399.75695801
##MAXY=0.85194308
##MINY=0.35616323
##XFACTOR=1.0000000000
##YFACTOR=1.000000000000000e-9
##FIRSTY=0.64355397
##DELTAX=2.03957629
##XUNITS=1/CM
##YUNITS=ARBITRARY UNITS
##XYDATA=(X++(Y..Y))
399.8F43553972j119315j098037N8234l85046j818598j098811N09739l3975j759052
418.1F36809111j297534N45025K26140q24988m37498M00960j91807j172066o73831
436.5F33383512K33651J0371o74665n29707J22011M3214n26429l64124L40819j72854
456.9F31865799j441240r58621J96993j17183j199841j101315j79589j99139r63509
475.2F25902355q88348p1227n0784r36329j019597j02997J03593r07600j378715m64141
495.6F20186210q2970r45806j260221l18528M1306q38160j268268m87327n9367r91940
516F13974929j609206p60913m16875j340270j699627p78436m24803j299142j670301
534.4F03975356p40528j46270q90732j350641m41313K29955n66602j375497q39471
$$ y = [643553972, 642434657, 641336620, 641394854, 641009808, 639191210, 638092399, 638602138, 638568163, 636809111, 635511577, 636056602, 636282742, 635457754, 635020256, 635421216, 635229409, 634057343, 633383512, 633617163, 633627534, 632952869, 632423162, 632545173, 632588387, 632061958, 631697834, 632038653, 631865799, 630424559, 629465938, 629662931, 629545748, 628345907, 627244592, 627065003, 626865864, 625902355, 625014007, 624942780, 624891996, 623955667, 622936070, 622833073, 622936666, 622029066, 620650351, 620186210, 620103240, 619157434, 617897213, 617578685, 617619991, 616781831, 615513563, 615026236, 614966869, 613974929, 612365723, 611604810, 611187935, 609847665, 608148038, 607369602, 606944799, 605645657, 603975356, 603234828, 603088558, 602197826, 600847185, 600405872, 600635827, 600069225, 598693728, 597854257]
552.7E97854257k48075r88364j747310j100958m95135j305521k198696j748622j000583
571.1E87020993j567840k417446j696705o81639j338303k219558j625776p49111j099944
589.4E73624671j764596j179338k62320o98924j770973j773119j127004j150191j312912
607.8E62585294n52118L29674J47640k26616R12547K833068L470421K990603K945721
626.1E75436234L509582L320336K461553K326667K790749K463639J318216O82116J139760
644.5E95448852J864016J900375J369595O57857L0815O37233K927006M867315M755020
662.9F14458084L118694K262533L381908L205895K224982K075016K380073K504886
679.2F35612071K008557J505256J631677J887679J614570J110435R58085J130521J033903
$$ y = [597854257, 597606182, 596617818, 594870508, 593769550, 593274415, 591968894, 589770198, 588021576, 587020993, 585453153, 583035707, 581339002, 580657363, 579319060, 577099502, 575473726, 574724615, 573624671, 571860075, 570680737, 570418417, 569719493, 567948520, 566175401, 565048397, 563898206, 562585294, 562033176, 562362850, 562510490, 562283874, 563196421, 566029489, 569499910, 572490513, 575436234, 578945816, 582266152, 584727705, 587054372, 589845121, 592308760, 593626976, 594309092, 595448852, 597312868, 599213243, 600582838, 601240695, 601271510, 601908743, 604835749, 609703064, 614458084, 617576778, 619839311, 623221219, 626427114, 628652096, 630727112, 633107185, 635612071, 637620628, 639125884, 640757561, 642645240, 644259810, 645370245, 646328330, 647458851, 648492754]
697.5F48492754O46591O70910J222670J610994J507580J438678J800656K127051J943112
715.9F61460996J652717J815141K121925J943052J577675J598895J872301J787603
732.2F75830305J309514J193940J526177J482010J038015J111627J697957J832366
748.5F87021911J362980J271009J843452K024174J383484J074254J609445J758933
764.8F99349642J030981N76616R16481R54330K7835p53701n17726l81648j150668j543820
785.2F98508322n81324O79255J054883J378417K794385M407823M746198M339159M582584
803.6G21909702M966855M157185K788842K479434K750337J872659K22743m20511m34876
821.9G40292370j505017l207982l773927l289402l394544m062533l839553k838552
$$ y = [648492754, 649139345, 649810255, 651032925, 652643919, 654151499, 655590177, 657390833, 659517884, 661460996, 663113713, 664928854, 667050779, 668993831, 670571506, 672170401, 674042702, 675830305, 677139819, 678333759, 679859936, 681341946, 682379961, 683491588, 685189545, 687021911, 688384891, 689655900, 691499352, 693523526, 694907010, 695981264, 697590709, 699349642, 700380623, 700957239, 701873720, 702828050, 702855885, 702102184, 701584458, 701202810, 700052142, 698508322, 697926998, 698606253, 699661136, 701039553, 703833938, 708241761, 712987959, 717327118, 721909702, 726876557, 731033742, 733822584, 736302018, 739052355, 740925014, 741147757, 740727246, 740292370, 738787353, 735579371, 731805444, 728516042, 725121498, 721058965, 717219412, 714380860]
838.3G14380860k543568l100872k969086j587928k85685N31614K161801M737556O566763
856.6G17891455O942987P165909P938683Q074284O816804N390167M865647M383862
872.9G69469798L045857J730084J399457J049936l91721j797915j927197j693249k182603
891.3G68702447k483606j451373J02222Q05855R60588J514495K064585J598120M04656
909.6G72217989l87728q47936j889706l248214l728569l221571k630353k068937r61065
928G53233910M21822J046240P29561L94165M79639L70800k52008p67469q29339j055062
948.4G53772259j916766k943516l643751m328251n406201o640852p682263q701504
964.7G12509155r953320j1074245j1416197j0894060r876728q598804p188618n841434
$$ y = [714380860, 711837292, 708736420, 705767334, 704179406, 703893721, 704425335, 706587136, 711324692, 717891455, 724834442, 732000351, 739939034, 748013318, 754830122, 760220289, 765085936, 769469798, 772515655, 774245739, 775645196, 776695132, 776303411, 774505496, 772578299, 770885050, 768702447, 766218841, 764767468, 764869690, 765675545, 766636133, 768150628, 770215213, 771813333, 772217989, 771830261, 770982325, 769092619, 765844405, 762115836, 758894265, 756263912, 754194975, 753233910, 753655732, 754701972, 755431533, 755825698, 756305337, 756676137, 756424129, 755656660, 754827321, 753772259, 751855493, 748911977, 745268226, 740939975, 735533774, 728892922, 721210659, 712509155, 702555835, 691481590, 680065393, 669171333, 659294605, 650695801, 643507183, 637665749]
981F37665749m862667m414022m101216l537238k925694k566457k300977j840711j317918
999.4F09798849j086116j225710j540005k036691k863944l764033m263163m336416
1015.7E88682771m293382m250467m070401l697575l419995l407776l315270k882600
1032E59345305k402067k161741j983405j640856j360297j452506j730680j791239j635551
1050.4E43186963j480222j146197l04163P91848J386046J223624O84559n5790j106739
1068.7E43179929k195656k756417k746522k684176k828062k893388k789915k915859
1085E21369934l375709l582478l145575k314568j402080m59075N02825J122534J114965
1103.4E09830773Q41439P53402O04034K6464p60078j526475k526462l824949m451514
$$ y = [637665749, 632803082, 628389060, 624287844, 620750606, 617824912, 615258455, 612957478, 611116767, 609798849, 608712733, 607487023, 605947018, 603910327, 601046383, 597282350, 593019187, 588682771, 584389389, 580138922, 576068521, 572370946, 568950951, 565543175, 562227905, 559345305, 556943238, 554781497, 552798092, 551157236, 549796939, 548344433, 546613753, 544822514, 543186963, 541706741, 540560544, 540256381, 541048229, 542434275, 543657899, 544342458, 544286668, 543179929, 540984273, 538227856, 535481334, 532797158, 529969096, 527075708, 524285793, 521369934, 517994225, 514411747, 511266172, 508951604, 507549524, 507090449, 507593274, 508715808, 509830773, 510672212, 511425614, 512029648, 512056112, 511296034, 509769559, 507243097, 503418148, 498966634]
1121.8D98966634l283143j091093L98845J109570J324177R89765R69648J681030K496719
1140.1E03562152K888441K737403K259851J860320J707733J637280J570106J744747
1156.4E19968033K270102K900064L539920M385472N454719O348610O756246O840050
1172.7E58463216O808102O587326O130457N570651M996478M254997L152728J881361
1189.1E97845316P80463q8692p11381q84354m55141L91722J228034J792371K038956
1207.4F01937294J911998J453161Q89182M61340K61068K17319K23935K79784M29690
1225.8F08064771O48439Q63492J052320J267970J471996J599193J668572J627207J452505
1244.1F19716465J208604R15885N78999L06964K37763L09468M38869P19904J220465
$$ y = [498966634, 495683491, 494592398, 494991243, 496100813, 497424990, 498414755, 499384403, 501065433, 503562152, 506450593, 509187996, 511447847, 513308167, 515015900, 516653180, 518223286, 519968033, 522238135, 525138199, 528678119, 533063591, 538518310, 544866920, 551623166, 558463216, 565271318, 571858644, 577989101, 583559752, 588556230, 592811227, 595963955, 597845316, 598625779, 598537087, 597825706, 596941352, 596486211, 596877933, 598105967, 599898338, 601937294, 603849292, 605302453, 606191635, 606652975, 606914043, 607131362, 607355297, 607635081, 608064771, 608713210, 609576702, 610629022, 611896992, 613368988, 614968181, 616636753, 618263960, 619716465, 620925069, 621840954, 622419953, 622726917, 622964680, 623274148, 623713017, 624432921, 625653386]
1262.5F25653386J790345K230167K621651L139019L582656L737510L823697M047454
1278.8F50625885M256606M263520M227459M416049M631340M471362M062951L820955
1295.1F84776127L706873L340721K789736K469420K371431K071976J529336J230657
1311.4G04286277J248002J121819Q32141Q46326J198769J377880J272858J257479J343846
1329.8G14785397J099229N27143K05458K72512K65896P6294J49966N53250P59363M94659
1350.2G19189167K38776K98560K67684q2254m47035o36399q05378j139700j370668
1368.5G15512753j082123q63373j358569j906275k337695l375053m033983k536416
1384.9F98019266P9036J013815K03193o41346j150430j446068k035737k507210k547145
$$ y = [625653386, 627443731, 629673898, 632295549, 635434568, 639017224, 642754734, 646578431, 650625885, 654882491, 659146011, 663373470, 667789519, 672420859, 676892221, 680955172, 684776127, 688483000, 691823721, 694613457, 697082877, 699454308, 701526284, 703055620, 704286277, 705534279, 706656098, 707488239, 708334565, 709533334, 710911214, 712184072, 713441551, 714785397, 715884626, 716411769, 716617227, 716889739, 717155635, 717231929, 717381895, 717935145, 718694508, 719189167, 719427943, 719726503, 719994187, 719911933, 719464898, 718828499, 718023121, 716883421, 715512753, 714430630, 713567257, 712208688, 710302413, 707964718, 704589665, 700555682, 698019266, 698098302, 699112117, 699315310, 698673964, 697523534, 696077466, 694041729, 691534519, 688987374]
1403.2F88987374k630531k573610k383470k071143j500845j050174j140654j341760
1419.5F74295187q30591m48167m96626l64780r1792R3997K18987M64142R16898J064539
1439.9F74821794J087308J269162J687109K142370K346635K539396L085494M671455
1456.2F93650723O072878M765094M297852N254030N500079M781961N231082O951273
1472.6G36504972O713808M915714L982007L379822K647102J824379J254797M78327
1488.9G61700928o14047j051068j326203k148092k804518k674043k237499k829730
1505.2G46015728n549431n542934m082382l736079l575444l324509k707123k664864
1521.5G14832962k693475k524495k580106k064943j826346k189279j711607j014054
$$ y = [688987374, 686356843, 683783233, 681399763, 679328620, 677827775, 676777601, 675636947, 674295187, 673464596, 673016429, 672519803, 672155023, 672063231, 672157228, 672376215, 672840357, 673757255, 674821794, 675909102, 677178264, 678865373, 681007743, 683354378, 685893774, 688979268, 693650723, 699723601, 704488695, 708786547, 714040577, 719540656, 724322617, 729553699, 736504972, 743218780, 748134494, 752116501, 755496323, 758143425, 759967804, 761222601, 761700928, 761086881, 760035813, 758709610, 756561518, 753757000, 751082957, 748845458, 746015728, 740466297, 734923363, 730840981, 727104902, 723529458, 720204949, 717497826, 714832962, 712139487, 709614992, 707034886, 704969943, 703143597, 700954318, 699242711, 698228657]
1537.8F98228657j337707j667082j007855l34442K03729N46992Q32736J183510J372099
1556.2F98020637J017511J36495k16306m74572r13799j775801k823710k778054l215611
1574.5F86976790n128562n231738m576326n096018n605101n851448o028235o197512
1590.9F43261850o296337o411910o309688o075025o046772o015241n798041n762339
1607.2E94546497n968154n742430n163312n592227o667435n187035m119635m778802
1623.5E51327467m639864m020572l488064k419888j727939j707435r31442J68860R40621
1641.8E33501744J546026K436399L179073K613187L133595N123854M152655L587485
1658.2E59274018M397452N536377N926311N256474N849123P045984O292344O393194
$$ y = [698228657, 696890950, 695223868, 694216013, 693881571, 694085300, 694632292, 695465028, 696648538, 698020637, 699038148, 699174643, 698958337, 698483765, 697569966, 695794165, 692970455, 690192401, 686976790, 681848228, 676616490, 672040164, 666944146, 661339045, 655487597, 649459362, 643261850, 636965513, 630553603, 624243915, 618168890, 612122118, 606106877, 600308836, 594546497, 588578343, 582835913, 577672601, 572080374, 565412939, 560225904, 556106269, 551327467, 546687603, 542667031, 539178967, 536759079, 535031140, 533323705, 532392263, 532561123, 533501744, 535047770, 537484169, 540663242, 543276429, 546410024, 551533878, 555686533, 559274018, 563671470, 569207847, 575134158, 580390632, 586239755, 593285739, 599578083, 605971277]
1674.5F05971277P178962O571472O184578P104098R403825Q211494O685376P152736
1690.8F64463818O766379P520020Q720875Q676827R872496Q134007O770730O895781
1707.1G27820933N883217N160272M881322M699409M809380M123628L103852K907932
1723.4G63389945L069937L037751L056288K852022L000498L114343K574682K669692
1739.7G86765158K887428K872944K905130K850652K749681K637625K268374K049267
1756.1H07986259J978159J839817J825750J593411J404881J530588J535714J278698
1772.4H20973277J070678J070559J195193J164674R87590J000285J131356J083553
1788.7H29677165R51111R75013R47952Q38458P50721P66396P98047O95050O01411O35028
$$ y = [605971277, 613150239, 619721711, 625906289, 633010387, 642414212, 650625706, 657311082, 664463818, 671230197, 678750217, 687471092, 696147919, 706020415, 714154422, 720925152, 727820933, 733704150, 738864422, 743745744, 748445153, 753254533, 757378161, 760482013, 763389945, 766459882, 769497633, 772553921, 775405943, 778406441, 781520784, 784095466, 786765158, 789652586, 792525530, 795430660, 798281312, 801030993, 803668618, 805936992, 807986259, 809964418, 811804235, 813629985, 815223396, 816628277, 818158865, 819694579, 820973277, 822043955, 823114514, 824309707, 825474381, 826461971, 827462256, 828593612, 829677165, 830628276, 831603289, 832551241, 833389699, 834140420, 834906816, 835704863, 836399913, 837001324, 837636352]
1809.1H37636352O92427N77390M45604M61579N61177N64754N07296N40375N85437M65274
1829.5H43037665K70128K80082L95775M19557L78013M03464M53770L75152K00331J85430
1849.9H46399367K90751L15965K64823K50697L23713L56674L21508K64585K20954J80006
1870.3H49189043Q9109N6267J63138K57373J96158J32025J92225K47121J31487J133
1890.7H50655079P2777J78218J31846L2186O9380J77502J73688N7757J1027Q3924J10983
1913.1H51754367N1737K5213P4983L6776r1613r5725K9207P5757l3557j23322m9591
1935.5H51654232M4047j7225j08064p2538n1141j57356k08080j21057p9692j78158
1955.9H50704968k49624j20521J5915q2076k50399k28048j15394j26600j85609j39475
$$ y = [837636352, 838328779, 838906169, 839351773, 839813352, 840374529, 840939283, 841446579, 841986954, 842572391, 843037665, 843307793, 843587875, 843983650, 844403207, 844781220, 845184684, 845638454, 846013606, 846213937, 846399367, 846690118, 847006083, 847270906, 847521603, 847845316, 848201990, 848523498, 848788083, 849009037, 849189043, 849278152, 849334419, 849497557, 849754930, 849951088, 850083113, 850275338, 850522459, 850653946, 850655079, 850727856, 850906074, 851037920, 851070106, 851139486, 851316988, 851490676, 851548433, 851559460, 851643384, 851754367, 851806104, 851831317, 851906300, 851943076, 851851463, 851755738, 851784945, 851860702, 851827145, 851703823, 851654232, 851698279, 851681054, 851572990, 851500452, 851449311, 851291955, 851083875, 850962818, 850883126, 850704968, 850455344, 850334823, 850350738, 850268662, 850018263, 849790215, 849674821, 849548221, 849362612, 849223137]
1976.3H49223137n9724j14202k01166j44005k5868n3108k10762k47955j23322j01209
1996.7H47941816k25604k22921j03891j28269k59876k45691j19626j12295k17438k59042
2017.1H46047163j85907j65701k37703k11477r7514j25765k62976k81632j52350r6321
2037.5H44229817j97470k29418j32144j09613k00629j95980o6697l3439j67250k29121
2057.9H42668056j13248m3631j27494j77980p4744j1027q7619j50084q5652l457k9147
2080.3H41763973q5294n8532K504l4690j21713r9957p927j1027o4194k2114O6757N4002
2104.8H41381788m1902o0916K3067O1214k9504o8843L8206J00374M5717L6776J07944
2127.3H41593921J32382Q8871P4327J12891J01983K8849J3053J07170J76072J22368
$$ y = [849223137, 849163413, 849049211, 848848045, 848704040, 848678172, 848625064, 848414302, 848166347, 848043025, 847941816, 847716212, 847493291, 847389400, 847261131, 847001255, 846755564, 846635938, 846523643, 846306205, 846047163, 845861256, 845695555, 845457852, 845246375, 845148861, 845023096, 844760120, 844478488, 844326138, 844229817, 844032347, 843802929, 843670785, 843561172, 843360543, 843164563, 843097866, 843064427, 842897177, 842668056, 842554808, 842511177, 842383683, 842205703, 842130959, 842119932, 842032313, 841882229, 841796577, 841793120, 841763973, 841678679, 841620147, 841622651, 841587961, 841466248, 841366291, 841358364, 841347337, 841283143, 841261029, 841327786, 841381788, 841339886, 841278970, 841302037, 841363251, 841333747, 841264904, 841303110, 841403484, 841449201, 841485977, 841593921, 841726303, 841815174, 841889501, 842002392, 842104375, 842133224, 842146277, 842253447, 842429519, 842551887]
2147.7H42551887N3167Q9884J54972J19448O8307J14441J86443J56403N8949N5611
2168H43609512J61588K01345J22427Q4520J47581J87099J19448N1260Q7857J49310
2188.4H44921947J08778L6836O8128J17898Q0108K2054L8326R6440Q7440J7107K4438
2210.9H45619500J13964J01268k3782m5717P4804J14381l338p3135J7465Q5592k086
2233.3H45978916o7592J2040P2479O378o0320n007O9917j4782j25408m7446N7578O676
2257.8H45883429p9393l9757M9055J6391o3538R954J25944M6730q3446K622J81735
2280.2H46049726J54912Q047J0669J20104Q3625o5565m5836R7215J23143J0252k1279
2302.7H46525013J09971J28031n1856j17600M7445J50442J8954r6380K7537J63257
$$ y = [842551887, 842605054, 842694938, 842849910, 842969358, 843037665, 843152106, 843338549, 843494952, 843553901, 843609512, 843771100, 843972445, 844094872, 844179392, 844326973, 844514072, 844633520, 844684780, 844772637, 844921947, 845030725, 845067561, 845135689, 845253587, 845333695, 845355749, 845394075, 845490515, 845577955, 845595062, 845619500, 845733464, 845834732, 845810950, 845765233, 845840037, 845954418, 845951080, 845877945, 845895410, 845981002, 845978916, 845911324, 845923364, 845995843, 846002221, 845941901, 845936894, 846006811, 845992029, 845866621, 845819175, 845876753, 845883429, 845804036, 845764279, 845813334, 845829725, 845766187, 845776141, 845902085, 845948815, 845865369, 845867991, 846049726, 846204638, 846212685, 846223354, 846343458, 846427083, 846361518, 846315682, 846412897, 846536040, 846546292, 846525013, 846634984, 846763015, 846711159, 846593559, 846641004, 846791446, 846810400, 846714020, 846741557, 846904814]
2323.1H46904814P4208q4281n6148J19389J34885J6570J6272O9678k1339o6816K50339
2345.5H47357571N14329L02493o7711k13742r6798n424k7716O6340K66850K20477J05143
2367.9H48421812K45988L86894L75271L22759L01302L57747L77357K55525J25587R9003
2388.3H51269245J17719J13309O3896L0875O3479P6652K0027k504N4539Q7797K5869
2410.8H51920903n8651k9207N1201J5914q6307p9751J0848M589o1810m5716J0907l2842
2435.2H51620078j23262q7202J8656J2577r3877j26124m2975j1325j07824j38522p629
2457.7H50912571M7147r3996j89960r9957l8743j13309j42038n0366m947j05083j89900
2480.1H49931419j32501n8532r9182j64807j16229q702l7492j91450j85966k5511l7611
$$ y = [846904814, 846979022, 846894741, 846838593, 846957982, 847092867, 847109437, 847125709, 847195387, 847174048, 847107232, 847357571, 847871900, 848174393, 848106682, 847892940, 847796142, 847790718, 847763002, 847829342, 848096192, 848316669, 848421812, 848667800, 849054694, 849429965, 849752724, 850054026, 850411773, 850789130, 851044655, 851170242, 851269245, 851386964, 851500273, 851564169, 851595044, 851658523, 851735175, 851755202, 851752698, 851807237, 851895034, 851920903, 851862252, 851833045, 851884246, 851900160, 851813853, 851734102, 851744950, 851749539, 851687729, 851642013, 851652920, 851620078, 851496816, 851409614, 851428270, 851440847, 851346970, 851220846, 851177871, 851166546, 851058722, 850920200, 850912571, 850959718, 850865722, 850675762, 850575805, 850537062, 850423753, 850281715, 850231349, 850226402, 850121319, 849931419, 849798918, 849740386, 849641204, 849476397, 849360168, 849351466, 849313974, 849122524, 848936558, 848911047, 848873436]
2502.5H48873436k15888j99318P391K8670j53243k14815q0884l6657j74761k16424
2522.9H47617507q0824o020r7811j66714p3612k0802j59383k37405r3222J5974r9718
2545.4H46597970k14518j37269m6611j08719k12192j82689o9558p5221k02298k28346
2565.8H45120549j10268q7023k07007k55525j82808j84238l11672l11911j65344j53958
2586.2H43150795k96355l53873k50756j99139l20852m19021l35038k39908l25740m49240
2606.6H39960873m12404l32416l73184m44591l92258l05832l73065m45545l45111k67625
2626.9H36268842l59595m66883m35173l32475l47555m76360m84824l42667k74003l60370
2647.3H32388937m30643l83198l33369l59714l74794l14236k98261l85821m21167l37779
$$ y = [848873436, 848657548, 848458230, 848465621, 848494291, 848341048, 848126233, 848045349, 848008692, 847833931, 847617507, 847536683, 847530663, 847432852, 847266138, 847192526, 847171724, 847012341, 846774936, 846681714, 846697688, 846597970, 846383452, 846246183, 846199572, 846090853, 845878661, 845695972, 845626414, 845551193, 845348895, 845120549, 845010281, 844923258, 844716251, 844460726, 844277918, 844093680, 843782008, 843470097, 843304753, 843150795, 842854440, 842500567, 842249811, 842050672, 841729820, 841310799, 840975761, 840735853, 840410113, 839960873, 839548469, 839216053, 838842869, 838398278, 838006020, 837700188, 837327123, 836881578, 836536467, 836268842, 835909247, 835442364, 835007191, 834674716, 834327161, 833850801, 833365977, 833023310, 832749307, 832388937, 831958294, 831575096, 831241727, 830882013, 830507219, 830192983, 829894722, 829508901, 829087734, 828749955]
2667.7H28749955k91586l65317m04239l31104k95817l60668m10974l91543l94106m42386
2688.1H25062215m24683l48270l34918l96192m64678m76301m42445m62413n02944m65155
2708.5H20744216m07636m14788m94779n37991m74930m44591m78744m57228m42683m95017
2728.9H16095829n10871m94779m77671m45843m58479n13613m89295l84211l55244m36604
2749.3H11529219n37932n68628n06699m50909m90010n84006o21319n74768n23984n25952
2769.7H06145012n37395n62668o70135p49946p02977o50644o55353o61791o63936o99758
2790.1G99590409p91252q55923q16404p82192q65102r67085r58920q86202q80420r81629
2810.5G90805280j049280r94444r80675j077771j108229j083494j146614j237452j261831
$$ y = [828749955, 828458369, 828093052, 827688813, 827357709, 827061892, 826701224, 826290250, 825898707, 825504601, 825062215, 824637532, 824289262, 823954344, 823558152, 823093474, 822617173, 822174728, 821712315, 821209371, 820744216, 820336580, 819921792, 819427013, 818889022, 818414092, 817969501, 817490757, 817033529, 816590846, 816095829, 815584958, 815090179, 814612508, 814166665, 813708186, 813194573, 812705278, 812321067, 811965823, 811529219, 810991287, 810422659, 809915960, 809465051, 808975041, 808391035, 807769716, 807194948, 806670964, 806145012, 805607617, 805044949, 804374814, 803624868, 802921891, 802271247, 801615894, 800954103, 800290167, 799590409, 798799157, 797943234, 797126830, 796344638, 795479536, 794512451, 793553531, 792667329, 791786909, 790805280, 789756000, 788761556, 787780881, 786703110, 785594881, 784511387, 783364773, 782127321, 780865490]
2828.9G80865490j240015j303613j508057j734316k002061k414643k928496l424227
2845.2G64310062l601790l139972k224684j415133r45092p20262p83026j090825j404584
2863.5G48984694j682162j972139k096116j929462j689434j538456j377701j175046
2879.9G35524178j040936j075268j234710j325726j308859j347244j450240j540125
2896.2G25201070j599133j640677j727939j827895j917780k129793k507031k895653
2912.5G08955169l088177k963960k583444k073526j473844r23574n56350k45631M2081
2930.8F95088744K71022N68867R61721J374066J746893J914740J741349J330734R23633
2949.2G05921769O24240L15606M1247N185J49727K69890L21209L95954M91500N16176
$$ y = [780865490, 779625475, 778321862, 776813805, 775079489, 773077428, 770662785, 767734289, 764310062, 760708272, 757568300, 755343616, 753928483, 752983391, 752263129, 751480103, 750389278, 748984694, 747302532, 745330393, 743234277, 741304815, 739615381, 738076925, 736699224, 735524178, 734483242, 733407974, 732173264, 730847538, 729538679, 728191435, 726741195, 725201070, 723601937, 721961260, 720233321, 718405426, 716487646, 714357853, 711850822, 708955169, 705866992, 702903032, 700319588, 698246062, 696772218, 695848644, 695292294, 695046663, 695088744, 695359766, 695928633, 696890354, 698264420, 700011313, 701926053, 703667402, 704998136, 705921769, 706546009, 706861615, 706902862, 706908047, 707057774, 707327664, 707648873, 708044827, 708536327, 709052503]
2969.6G09052503N09143N34475N32985N18858N34356M80711M16637M50849M81248M77672
2990G13989437L68714L4511k71082m12881n37992o18875o63578o93500o20127n17547
3010.4G10057080o19531r06467j096130j120984j105011j098633j159250j248479j230836
3028.7G00471759j169384j157164j270592j411736j351595j268328j369953j558423
3045.1F89914584j662373j606226j536668j586735j634002j617491j616836j587390
3061.4F77066863j510084j420915j418293j575887j663566j510977j302481j284122
3077.7F65380538j442373j538575j527727j592040j667022j634539j612544j619398
3094F52746320j603902j566588j569093j691103j798451j730859j653194j769126j866877
$$ y = [709052503, 709561646, 710096121, 710629106, 711147964, 711682320, 712163031, 712579668, 713030517, 713511765, 713989437, 714358151, 714392662, 714121580, 713708699, 713170707, 712551832, 711888254, 711194754, 710574627, 710057080, 709437549, 708531082, 707434952, 706313968, 705208957, 704110324, 702951074, 701702595, 700471759, 699302375, 698145211, 696874619, 695462883, 694111288, 692842960, 691473007, 689914584, 688252211, 686645985, 685109317, 683522582, 681888580, 680271089, 678654253, 677066863, 675556779, 674135864, 672717571, 671141684, 669478118, 667967141, 666664660, 665380538, 663938165, 662399590, 660871863, 659279823, 657612801, 655978262, 654365718, 652746320, 651142418, 649575830, 648006737, 646315634, 644517183, 642786324, 641133130, 639364004, 637497127]
3112.4F37497127j781881j722514j797140k009988k240658k255559k114832k027273
3128.7F21547282k085924k161086k087295k037585k169311k344787k404153k383292
3145F03873849k346337k235770k147257k269090k460956k492070k489985k537846k527356
3163.4E82367182k497554k487898k456129k427458k471507k565801k609849k563238
3179.7E62287748k488256k455949k463937k465129k490699k533257k520025k504885
3196E42365611k532244k541304k475679k382159k354324k385139k376199k327859k320052
3214.3E20670652k304792k256572k266407k295554k271295k233564k167702k067924
3230.7E02806842k028644k130091k188861k048254j919389j904637j878261j858086
$$ y = [637497127, 635715246, 633992732, 632195592, 630185604, 627944946, 625689387, 623574555, 621547282, 619461358, 617300272, 615212977, 613175392, 611006081, 608661294, 606257141, 603873849, 601527512, 599291742, 597144485, 594875395, 592414439, 589922369, 587432384, 584894538, 582367182, 579869628, 577381730, 574925601, 572498143, 570026636, 567460835, 564850986, 562287748, 559799492, 557343543, 554879606, 552414477, 549923778, 547390521, 544870496, 542365611, 539833367, 537292063, 534816384, 532434225, 530079901, 527694762, 525318563, 522990704, 520670652, 518365860, 516109288, 513842881, 511547327, 509276032, 507042468, 504874766, 502806842, 500778198, 498648107, 496459246, 494410992, 492491603, 490586966, 488708705, 486850619]
3247D86850619j912504j907110j795978j722812j744986j788765j763344j704246j670092
3265.3D70840782j611412j544833j603126j714111j761526j765936j726985j685530
3281.6D57427323j678914j691014j671761j597851j584977j695901j803846j832068
3298D43870991j771360j654804j590967j653493j865983k085477k119034k003908j906485
3316.3D27219480j927942j976132j900464j822532j946598k104968k068996j959384
3332.6D11512464j883328j815319j867145k033263k114803k119690k038926j879931
3348.9C95760059j937121k147585k174199k022028j889109j894474j891554j714170
3365.3C80089819j593738j741767j992256k007633j731724j493394j412660j404703
$$ y = [486850619, 484938115, 483031005, 481235027, 479512215, 477767229, 475978464, 474215120, 472510874, 470840782, 469229370, 467684537, 466081411, 464367300, 462605774, 460839838, 459112853, 457427323, 455748409, 454057395, 452385634, 450787783, 449202806, 447506905, 445703059, 443870991, 442099631, 440444827, 438853860, 437200367, 435334384, 433248907, 431129873, 429125965, 427219480, 425291538, 423315406, 421414942, 419592410, 417645812, 415540844, 413471848, 411512464, 409629136, 407813817, 405946672, 403913409, 401798606, 399678916, 397639990, 395760059, 393822938, 391675353, 389501154, 387479126, 385590017, 383695543, 381803989, 380089819, 378496081, 376754314, 374762058, 372754425, 371022701, 369529307, 368116647, 366711944]
3381.6C66711944j345962j140594q26210n48542n97328r19461r64612n65260k79874
3399.9C59524101n20736q45462o86497l32415j84297j57595k19017k81334j33514M6640
3420.3C56209874J01447K67655N60582P48604P10219P28250R14007Q63403N94467O00368
3440.7C62298876Q93921J163840J318336J315921J325905J464844J653910J854896
3457C73290449J955808J826435J814365K156049K329201J991659J571954J620084J988589
3475.4C90544593K315700K312959K039164K028853K302467K323956K166807K278358
3491.7D08312857K483696K578795K541691K512932K561182K408325K181977K329648
3508D27911103K706855K934784K843529K617925K633989K840728L132552L124207K776653
$$ y = [366711944, 365365982, 364225388, 363399178, 362850636, 362253308, 361333847, 360369235, 359803975, 359524101, 359003365, 358157903, 357471406, 357138991, 356954694, 356797099, 356578082, 356296748, 356163234, 356209874, 356311321, 356578976, 357139558, 357888162, 358598381, 359326631, 360240638, 361104041, 361698508, 362298876, 363192797, 364356637, 365674973, 366990894, 368316799, 369781643, 371435553, 373290449, 375246257, 377072692, 378887057, 381043106, 383372307, 385363966, 386935920, 388556004, 390544593, 392860293, 395173252, 397212416, 399241269, 401543736, 403867692, 406034499, 408312857, 410796553, 413375348, 415917039, 418429971, 420991153, 423399478, 425581455, 427911103, 430617958, 433552742, 436396271, 439014196, 441648185, 444488913, 447621465, 450745672, 453522325]
3526.4D53522325K752155L028571L237814L439248L464758L266454L377467L659517
3542.7D79748309L691882L440052L254384L398835L630787L684700L733873L955901
3559E08538723M051745L777802L683269M442930M816234M271090M100204M420757M645169
3577.4E46747923M790187N023300N012334M852593N009472N112291M872262M991829
3593.7E86412191N316854N433738N503178N512655N228996N008161N397141N656540
3610F29469454N556345N585969N290031N352497N930484N538582M751504M363477N177796
3628.4F77016139O046772N121172M778444M863739M702926M688263M572809M081785
3644.7G15872049L828764M610598N019248L715873L102064L863156L863632L050745
$$ y = [453522325, 456274480, 459303051, 462540865, 465980113, 469444871, 472711325, 476088792, 479748309, 483440191, 486880243, 490134627, 493533462, 497164249, 500848949, 504582822, 508538723, 512590468, 516368270, 520051539, 524494469, 529310703, 533581793, 537681997, 542102754, 546747923, 551538110, 556561410, 561573744, 566426337, 571435809, 576548100, 581420362, 586412191, 591729045, 597162783, 602665961, 608178616, 613407612, 618415773, 623812914, 629469454, 635025799, 640611768, 645901799, 651254296, 657184780, 662723362, 667474866, 671838343, 677016139, 683062911, 688184083, 692962527, 697826266, 702529192, 707217455, 711790264, 715872049, 719700813, 724311411, 729330659, 733046532, 736148596, 740011752, 743875384, 746926129]
3661G46926129K787173K806663K534688K586424K893209K168000K009988K461195K102673
3679.4G69276142J948536K067804K015710J982689J934945J574397J372695J381576
3695.7G83554494J267970J080751J188398J357436J159728R00328P81774R04620J047909
3714G93243408R27150P86424O98686O32345O27041P38979P37548N44071N17130O47306
3734.4H00100088Q80778R55045M55678j25587J86920P01845J72853M9055O53922P29561
3754.8H04760158M47214L78847M73261L50892K73645K81990K29954L26396M11808L83675
3775.2H08317840L36051K56837J79529J52647J89245K12192K83301L45111K43485K48134
3795.6H10764372K45214m6671O8427K70187J4902J72913M43637K79009M0233K23041
$$ y = [746926129, 749713302, 752519965, 755054653, 757641077, 760534286, 762702286, 764712274, 767173469, 769276142, 771224678, 773292482, 775308192, 777290881, 779225826, 780800223, 782172918, 783554494, 784822464, 785903215, 787091613, 788449049, 789608777, 790509105, 791290879, 792195499, 793243408, 794170558, 794956982, 795655668, 796288013, 796915054, 797654033, 798391581, 798935652, 799452782, 800100088, 800980866, 801935911, 802391589, 802266002, 802452922, 803154767, 803327620, 803376675, 804030597, 804760158, 805207372, 805586219, 806059480, 806410372, 806684017, 806966007, 807195961, 807522357, 807934165, 808317840, 808653891, 808910728, 809090257, 809242904, 809432149, 809644341, 809927642, 810272753, 810516238, 810764372, 811009586, 810962915, 811031342, 811301529, 811316431, 811489344, 811932981, 812211990, 812252223, 812475264]
3816H12475264K99275j48535j5259K51174J71841J34050R2864J99855K80082N1797
3836.4H13792408j12474j4067L5345J31488K72274K00868k64764o68645N5611N57602
3856.8H13985646K69234K3246j908J78814O6519k04682o3241J45316K67983J54257
3877.2H14821184q0884K1458P4565J03534J17838j35362j30713J30653J27733k5570
3897.6H15024436j36137k09809q5115J15335O2823r537N2393M9114n3704o3062L5227
3920H14781964L6597K384Q0347O5029q6248l3736J16229L6478o6757n3227O5803J72675
3944.5H15117538Q3506N722L1889J5080J6272P9035J08958N7220m1425p5698L7789
3966.9H15435886J44899R3758R358K0325N1380M1723P3731J38163J31786O4373J8120
$$ y = [812475264, 812774539, 812626004, 812610745, 812861919, 813033760, 813167810, 813260674, 813460529, 813740611, 813792408, 813679934, 813665867, 813701212, 813832700, 814104974, 814305842, 814041078, 813372433, 813428044, 813985646, 814254880, 814278126, 814276218, 814455032, 814521551, 814316869, 814253628, 814398944, 814666927, 814821184, 814740300, 814761758, 814836323, 814939857, 815057695, 814922333, 814791620, 814922273, 815050006, 815024436, 814888299, 814678490, 814593375, 814708710, 814771533, 814761996, 814814389, 814863503, 814809799, 814746737, 814781964, 814818561, 814820945, 814901292, 814966321, 814880073, 814846337, 814962566, 814999044, 814932287, 814879060, 814944863, 815117538, 815201044, 815206766, 815238655, 815253735, 815270007, 815349042, 815458000, 815515220, 815473795, 815398097, 815435886, 815580785, 815674543, 815683901, 815704226, 815755606, 815797329, 815871060, 816009223, 816141009, 816205382, 816223502]
3989.4H16223502L5942O8307P3909R9719
3997.5H16501379
$$ y = [816223502, 816259444, 816327751, 816401660, 816501379]
##END=$$ End of the data block
