##TITLE=$$ Begin of the data block
##JCAMP-DX=5.00 $$ ACD/SpecManager v 10.08
##SPECTROMETER/DATA SYSTEM=Alpha
##DATE=09 Apr 2014 11:14:46
##DATA TYPE=INFRARED SPECTRUM
##DATA CLASS=XYDATA
##ORIGIN=
##OWNER=
##NPOINTS=1765
##FIRSTX=399.75695801
##LASTX=3997.56933594
##MAXX=3997.56933594
##MINX=399.75695801
##MAXY=0.86793649
##MINY=0.46826792
##XFACTOR=1.0000000000
##YFACTOR=1.000000000000000e-9
##FIRSTY=0.73037994
##DELTAX=2.03957629
##XUNITS=1/CM
##YUNITS=ARBITRARY UNITS
##XYDATA=(X++(Y..Y))
399.8G30379939n07414J66476N71131m52339j528442m24207J032114L49880j023948
418.1G28563190o16253L83854M9055n98312l70264L03805q0228j002490o69361M15922
438.5G26378918M79638m58121p92444L3915N82636k30074j210690n96940N12600J72555
458.9G24871993r36389r35435r0897j38045j033723j012564J24991M70519n71489j072824
479.3G19676137j79708N56767K98p06911l15487K81691j88708r49204p07507j1385
499.7G17455983k1875o90341r75132l55541K22802l62397j210570q57055O7949j99020
520.1G13074803j089811q96513p1407n4478p56264j014054m57466j132k81274n99206
540.5G07853198k48790K08974r2268o82235n39541m6789j12892o41703r27866n49078
$$ plain form
399.8 730379939 729872525 730039001 730610132 730157793 728629351 728205144 729237258 729587138 728563190
418.1 728563190 727946937 728330791 728379846 727781534 727411270 727715075 727634847 726632357 725962996 726378918
438.5 726378918 726858556 726400435 725607991 725641906 726224542 725994468 724783778 724186838 724699438 724871993
458.9 724871993 723935604 723000169 722909272 722771227 721737504 720724940 720849931 721320450 720748961 719676137
479.3 719676137 719496429 720053196 720053494 719346583 719031096 719312787 719124079 718174875 717467368 717455983
499.7 717455983 717434108 716743767 715768635 715413094 715635896 715273499 714062929 713205874 713273823 713074803
520.1 713074803 711984992 711088479 711017072 710962594 710206330 709192276 708734810 708733678 708452404 707853198
540.5 707853198 707604408 707813382 707721114 707038879 706499338 706452549 706339657 705697954 704770088 704221010
560.9G04221010j45435n47469j191318j057446n01454n12182j013518j078367n08070
579.2F97665751k38776o26385r05753m59849J29342L7789n47469o15120p7724j45972
599.6F94215834r41396j325249q81851l92318o38008j024604m93765N09262Q74937
618F89902842P99239J358688K439499K662658J851201J458109K099394K471388J669049
636.3G06712067Q84414J253605J878679J431703N22912P70986J828432J727283M84168
654.7G17494249K51949J720846K757728J910388N39780P07328K689302K328158Q76605
673.1G31276333R15766J942754K163470J049518M51088J282394J815200R21667J02758
691.4G41920948O68585J491607R85741j62124q8096J138568J654863R46880N54680
$$ plain form
560.9 704221010 704075575 703528106 702336788 701279342 700777888 700265706 699252188 698173821 697665751
579.2 697665751 697426975 696800590 695894837 695434988 695564330 695602119 695054650 694439530 694361806 694215834
599.6 694215834 693274438 691949189 691067338 690675020 690037012 689012408 688518643 689027905 689902842
618 689902842 690702081 692060769 694500268 697162926 699014127 700472236 702571630 705043018 706712067
636.3 706712067 707596481 708850086 710728765 712160468 712683380 713454366 715282798 717010081 717494249
654.7 717494249 717746198 719467044 722224772 724135160 724674940 725382268 728071570 730399728 731276333
673.1 731276333 732192099 734134853 736298323 737347841 737798929 739081323 740896523 741818190 741920948
691.4 741920948 742589533 744081140 745066881 744904757 744816661 745955229 747610092 748556972 749111652
709.8G49111652J231194J780331J239419N82814J037717J832843J543164P60853Q44658
728.1G59964645J601577J674354P81476L30031R41217J408696R91762N75006R61304
746.5G69230068J566112J381814O64771N77688J254201J521409R42170N13077P77423
764.8G78428733J094580Q04007K76089K25007M96447L76404k91348p13527m02391k2054
785.2G80271947p9274j5974O64175J567304K066731K146542K353669K885043L159106
803.6G95019269K745569K138257J975298K000749J554131P80583L53694K90513l4154
821.9H06823909q75890j664519j788199j581431j674175j944899j894415j462877j208722
840.3G92728782j443029j533568q77618R1910P58886J404822K505124L708541M299283
$$ plain form
709.8 749111652 750342846 752123177 753362596 753945410 754983127 756815970 758359134 759119987 759964645
728.1 759964645 761566222 763240576 764022052 764352083 765293300 766701996 767693758 768268764 769230068
746.5 769230068 770796180 772177994 772842765 773420453 774674654 776196063 777138233 777651310 778428733
764.8 778428733 779523313 780327320 780603409 780828416 781324863 781701267 781409919 780696392 780294001 780271947
785.2 780271947 780192673 780176699 780840874 782408178 784474909 786621451 788975120 791860163 795019269
803.6 795019269 797764838 799903095 801878393 803879142 805433273 806213856 806567550 806858063 806823909
821.9 806823909 805948019 804283500 802495301 800913870 799239695 797294796 795400381 793937504 792728782
840.3 792728782 791285753 789752185 788874567 788966477 789725363 791130185 793635309 797343850 801643133
858.7H01643133M162133L953278M110277M072368L343165K390325J885474J761972
875H27322125J369417O11961R0838m7565l25024r57072j448333j336932q66354n62727
895.4H23850334m04179Q3863Q36790J161754Q51214M68314K92897m8399p77543j544714
915.8H24770331j895308j820564j645804j524091j160860l51131M24981N73755K46286
934.1H17617595J46330L98993L75569j15037n04673m77969n49615j171052j904190
952.5H13815951k206266k349436k973616m003584m698158m926979n365730o190896
968.8G81101286o618678o136537n268216m709661m327476l612697k782643k499580
985.1G45145798k712012k590298j831711j199185j238168j384198r56774m20571n86628
$$ plain form
858.7 801643133 805805266 809758544 813868821 817941189 821284354 823674679 825560153 827322125
875 827322125 828691542 829303503 829394341 829346776 829021752 828064680 826616347 825279415 824413061 823850334
895.4 823850334 823446155 823530018 824366808 825528562 826379776 826848090 827140987 827092588 826315045 824770331
915.8 824770331 822875023 821054459 819408655 817884564 816723704 816372573 816797554 817371309 817617595
934.1 817617595 817763925 818162918 818538487 818423450 817918777 817440808 816891193 815720141 813815951
952.5 813815951 811609685 809260249 806286633 802283049 797584891 792657912 787292182 781101286
968.8 781101286 774482608 768346071 763077855 758368194 754040718 750428021 747645378 745145798
985.1 745145798 742433786 739843488 738011777 736812592 735574424 734190226 733233452 732812881 732226253
1003.5G32226253j240433j650154j728654k031565k706945l083646k692759k136588
1019.8G14955509k163053k417326k162814j597047j500964j856267j830161j255393
1036.1G00172484q85546j112759j372040j098573p19845q58248j184701r55403k06054
1054.5F91779315L51608M53413N34534Q10802P29025r9898j089513j513898j515687
1072.8F90439701j598895j757204j636386j222014j027465j278043j531184j401424
1089.1F78987086j127958j043201r92298p06256k83777p9513k12908l74138k84672
1107.5F73882365j79529l28481n43535n81860o42121j016796j469493j496851j198352
1125.8F66425347o56426O46234J808107J753449J433671J412928J260757J081705J130224
$$ plain form
1003.5 732226253 730985820 729335666 727607012 725575447 722868502 719784856 717092097 714955509
1019.8 714955509 712792456 710375130 708212316 706615269 705114305 703258038 701427877 700172484
1036.1 700172484 699286938 698174179 696802139 695703566 694983721 694125473 692940772 691985369 691779315
1054.5 691779315 692130923 692584336 693118870 693929672 694658697 694558799 693469286 691955388 690439701
1072.8 690439701 688840806 687083602 685447216 684225202 683197737 681919694 680388510 678987086
1089.1 678987086 677859128 676815927 675823629 675117373 674833596 674754083 674541175 674167037 673882365
1107.5 673882365 673702836 673374355 672830820 672248960 671606839 670590043 669120550 667623699 666425347
1125.8 666425347 665768921 666415155 668223262 669976711 671410382 672823310 674084067 675165772 676295996
1144.2F76295996J144707Q79705O01947P07925J123011J365006J355230J599193K314448
1162.6F87387168K978087L179014L314495L835678M359662M298091L871620L750265
1178.9G16974080L921687L728509L019452K370477K102137J750111R37224J66595N7578
1197.2G35027850L71217M34459K49684L89337Q15332Q78096L97741n0544M77J88887
1217.6G38702536j5140l53455k39373K12372L86715J86085J64926N44966Q07881O50406
1238G41047919N01096P01249Q93235O33299J70291N6505K55704K76446N6982M7148
1258.4G44639874M61697R42051J121998J183808J480699J926780K103984J968562J939536
1276.8G57768989K159535K312184K182305K024293K164900K421319K365411K009392
$$ plain form
1144.2 676295996 677440703 678320408 678922355 679630280 680753291 682118297 683473527 685072720 687387168
1162.6 687387168 690365255 693544269 696858764 700694442 705054104 709352195 713223815 716974080
1178.9 716974080 720895767 724624276 727643728 730014205 732116342 733866453 734803677 734970272 735027850
1197.2 735027850 735399067 735833526 736083210 736472547 737287879 738165975 738563716 738513172 738513649 738702536
1217.6 738702536 738687396 738333941 738094568 738306940 738693655 738879740 739044666 739589632 740397513 741047919
1238 741047919 741549015 742250264 743143499 743776798 743947089 744003594 744259298 744535744 744592726 744639874
1258.4 744639874 745101571 746043622 747165620 748349428 749830127 751756907 753860891 755829453 757768989
1276.8 757768989 759928524 762240708 764423013 766447306 768612206 771033525 773398936 775408328
1293.1G75408328J759350J761377J701057J323521Q95977Q13186R16660P68125L92020
1311.4G85739601K31087M25458N80251L99768K47181M91738P68602O42061K90454J62959
1331.8G89979160K41697J33693k35677m09365j00433J86383N5015j81257r3282J20223
1352.2G89696157j5318m33207n78344l79979m06266q67545j120031r68337p86186j026988
1372.6G83113956j646697k023280k822816n162060o423593k780199L280222M979372
1388.9G70514905K406538N12779j55688m46915r41456j428544j416981j189709j125634
1407.3G66729295j241624j206040q32379m78447m71473o46770m58240o1750K8312r6023
1427.7G61264861p7725J36852L48866N24521O46234P52151R61840R78529R67563J224458
$$ plain form
1293.1 775408328 777167678 778929055 780630112 781953633 782849610 783662796 784579456 785347581 785739601
1311.4 785739601 785970688 786396146 786976397 787376165 787623346 788115084 788883686 789525747 789816201 789979160
1331.8 789979160 790220857 790354550 790118873 789709508 789609075 789795458 789850473 789669216 789575934 789696157
1352.2 789696157 789680839 789247632 788669288 788289309 787883043 787015498 785895467 784927130 784140944 783113956
1372.6 783113956 781467259 779443979 776621163 771459103 765035510 762255311 765535533 770514905
1388.9 770514905 772921443 773434222 773278534 772831619 771890163 770461619 769044638 767854929 766729295
1407.3 766729295 765487671 764281631 763449252 762970805 762499332 761852562 761394322 761332572 761360884 761264861
1427.7 761264861 761187136 761323988 761672854 762197375 762843609 763595760 764557600 765536129 766503692 767728150
1448.1G67728150J450539J413762J450777K351284L521204K826095K330839K743841
1464.4G85816491K994239K734780K981901L902436L928005L127277K510190J958073
1480.7H09953392J435101R64045O57857J78814n55158q41856q82507j258134j755774
1499.1H07895780j866520j690447j976669l423691l401696k561689k346158k259731
1515.4G88369179k222359j888097j689315j681745j643479j736342j467348j208901
1531.7G74831593j441419j453340j061559r18507q90077o39677m30882j09076K02536
1550.1G68089592L00169K58267K84076O24538M20451k91169m80771o03855r58800j625299
1570.5G66017199j828552j883268k628028k907277k767026l023088l292322l549993
$$ plain form
1448.1 767728150 769178689 770592451 772043228 774394512 777915716 780741811 783072650 785816491
1464.4 785816491 788810730 791545510 794527411 798429847 802357852 805485129 807995319 809953392
1480.7 809953392 811388493 812352538 813010395 813189209 812634051 811792195 810909688 809651554 807895780
1499.1 807895780 806029260 804338813 802362144 798938453 795536757 792975068 790628910 788369179
1515.4 788369179 786146820 784258723 782569408 780887663 779244184 777507842 776040494 774831593
1531.7 774831593 773390174 771936834 770875275 769956768 769066691 768427014 767996132 767887056 768089592
1550.1 768089592 768389761 768648028 768932104 769556642 769977093 769685924 769205153 768601298 767642498 766017199
1570.5 766017199 764188647 762305379 759677351 756770074 754003048 750979960 747687638 744137645
1586.8G44137645l819823m040003m122854m250347m398346m435361m449427m482031
1603.1G10139453m489362m544020m686772m625082m326105m557968n181968m064381
1619.4F73663795l169835l513574l426492l008962k645910j850843j048744m10974
1635.7F54588461J92583O72638J165450J673698K804697L509819K508044L328562N545497
1654.1F75989449L697991K747238L316403M150033M226982L479123L951013M791260
1670.4G06349492M100382M264236M786491M073918L670454M505694O336093N252481
1686.7G43339241M096150M339516M021227M680634N530238N693495O692887N261898
1703G83655286M396736M678071L985763L412902L158808L148734L559530L124058K234638
$$ plain form
1586.8 744137645 740317822 736277819 732154965 727904618 723506272 719070911 714621484 710139453
1603.1 710139453 705650091 701106071 696419299 691794217 687468112 682910144 677728176 673663795
1619.4 673663795 670493960 666980386 663553894 660544932 657899022 656048179 654999435 654588461
1635.7 654588461 654781044 655453682 656619132 658292830 661097527 664607346 667115390 670443952 675989449
1654.1 675989449 679687440 682434678 685751081 689901114 694128096 697607219 701558232 706349492
1670.4 706349492 710449874 714714110 719500601 723574519 727244973 731750667 738086760 743339241
1686.7 743339241 747435391 751774907 755796134 760476768 766007006 771700501 778393388 783655286
1703 783655286 788052022 792730093 796715856 800128758 803287566 806436300 809995830 813119888 815354526
1721.4H15354526K059281K064109J894176J836538J740396K030134K031863J483560
1737.7H30494583J607656J805008J708328J651347J669705J734316J619578J254379
1754H43544900J116157J085579R87232J043856R43959P46489P02977P35819Q08656
1772.4H51715624P69794O39379O51479O68883N75304N26548N57542N40793M88102M87685
1792.8H57621133M64738M56512M42564L94941L69548M07160M36842L66032K71738K74241
1813.2H61505449L28839L03745K56717K51949L06129L53873K68161J84775K28166K56539
1833.6H64244342J95026J56820J89841K13384J93477J67608J60397J98662J99139J24514
1854H66043210R1493J49131J99139J36733O9320N5135Q0347J24693R6082P7725J40607
$$ plain form
1721.4 815354526 817413807 819477916 821372092 823208630 824949026 826979160 829011023 830494583
1737.7 830494583 832102239 833907247 835615575 837266922 838936627 840670943 842290521 843544900
1754 843544900 844661057 845746636 846733868 847777724 848721683 849468172 850171149 850906968 851715624
1772.4 851715624 852485418 853124797 853776276 854445159 855020463 855547011 856104553 856645346 857133448 857621133
1792.8 857621133 858085871 858542383 858984947 859379888 859749436 860156596 860593438 860959470 861231208 861505449
1813.2 861505449 861834288 862138033 862394750 862646699 862952828 863306701 863574862 863759637 863987803 864244342
1833.6 864244342 864439368 864596188 864786029 864999413 865192890 865360498 865520895 865719557 865918696 866043210
1854 866043210 866134703 866283834 866482973 866619706 866689026 866744161 866824508 866949201 867045283 867123008 867263615
1876.4H67263615J69754P7605k4676j3530N4478M8221l219L1829J27435J32978L3915
1898.8H67898405j9908K741J2279m0591o9499Q941R6023M8101q4639j04189j3172K9921
1923.3H67764413o258m8280m2498k6047n9068j11223r2148n0903p2300j16945j18613
1945.7H67020130p1883m9114q7202j32024j58906j78576j65105j30236j16110j17063
1966.1H65813911j05977j17481j43111j26302j21534j30534j12057j15811j31488q9407
1986.5H64620209n7280j16706j93358j95920j38939r8764j28806j75238j38044p7605
2006.9H63299549j12653j94192j79231r4116j06931j98960k08676j22607p4625j38044
2027.3H61869514k20478j60455l8684o0379j69575j65642l9875p749j37746k12908
$$ plain form
1876.4 867263615 867433369 867510974 867486298 867472768 867527246 867575467 867572248 867604077 867731512 867864490 867898405
1898.8 867898405 867878497 867881238 867893517 867852926 867783427 867792368 867888391 867936492 867851853 867747664 867734492 867764413
1923.3 867764413 867758155 867709875 867667377 867641330 867582262 867471039 867378891 867327988 867255688 867138743 867020130
1945.7 867020130 866948247 866899133 866811931 866679907 866521001 866342425 866177320 866047084 865930974 865813911
1966.1 865813911 865707934 865590453 865447342 865321040 865199506 865068972 864956915 864841104 864709616 864620209
1986.5 864620209 864562929 864446223 864252865 864056945 863918006 863819242 863690436 863515198 863377154 863299549
2006.9 863299549 863186896 862992704 862813473 862719357 862612426 862413466 862204790 862082183 862007558 861869514
2027.3 861869514 861649036 861488581 861449897 861389518 861219943 861054301 861014426 861006677 860868931 860656023
2047.7H60656023r2983K9683n2393j88946j12713O8844N3703j33931j88291j6511O6340
2070.2H60088825p7069j59442q106J28865K7418j42157r5427R0897Q0168r4890j07467
2092.6H59731615Q1122J69754K920j68562o0856J46866J16467n3167n8830J02162J32025
2115H60141516m6790j20997N6207J96397P2718r3937j6451J76668J58608k4617n7518
2137.5H60441804J02222J78277M4644m1306J08361K31445J01269p5460m5538J27554
2157.9H61173272J73390M4346p689J02281J67907R0658p15K6107J32620J36137K8551
2180.3H62066865p153R4355J63495M8041o4134K6047J45793J03474j0193p927J03593
2202.7H62662256J10090j6988o9380J6988J13904O6757o0916m4643R5546J24097j8478
$$ plain form
2047.7 860656023 860563040 860592723 860540330 860351384 860238671 860307515 860361218 860227287 860038996 860022485 860088825
2070.2 860088825 860011756 859852314 859844208 859973073 860000491 859858334 859762907 859853804 859933972 859839082 859731615
2092.6 859731615 859812737 859982491 859985411 859816849 859755993 859902859 860019326 859966159 859907329 860009491 860141516
2115 860141516 860094726 859973729 860029936 860226333 860299051 860205114 860188663 860365331 860523939 860499322 860441804
2137.5 860441804 860544026 860722303 860766947 860725641 860834002 861065447 861166716 861091256 861045718 861173272
2157.9 861173272 861346662 861391008 861383319 861485600 861653507 861744165 861743450 861769557 861902177 862038314 862066865
2180.3 862066865 862059712 862154067 862317562 862365603 862301469 862327516 862473309 862576783 862566590 862558663 862662256
2202.7 862662256 862772346 862755358 862685978 862702966 862816870 862883627 862822711 862778068 862873614 862997711 862979233
2225.2H62979233j14143l099J28806N8531q0883o1512N7339N7161p8141j21355J8000
2247.6H62839937J07944J4723q3149m8518P2896Q2195q0585j38998P093J21593N6684
2270H62951815n0604p272R9778M8816q7916r1136K3425O2108m6194j43647o4671N6386
2294.5H62750888j7226j54614j14799J5617J7285j42276k74241j89603k0504m9889
2314.9H61820638k42173l23654j94430q8453j77503k80738j83761j4067k4974j63019
2335.3H60127866k19702j05501j0490R4116N48958P53582K15352n04554q60393p13289
2355.7H59325945l69548j44899J1921L32772O68228P08580N58138N29289O69182P09235
2376.1H62998843M97103K86937L25918M21107K48372m6015q0525J15752J70827q285
$$ plain form
2225.2 862979233 862865090 862861991 862990797 863049328 862968445 862906933 862964272 863021433 862943292 862821937 862839937
2247.6 862839937 862947881 862962604 862879455 862830937 862903833 862986028 862905443 862766445 862773538 862895131 862951815
2270 862951815 862901211 862893939 862993717 863042533 862954617 862863481 862886906 862949014 862902820 862759173 862694502 862750888
2294.5 862750888 862733662 862579048 862464249 862479866 862497151 862354875 862080634 861891031 861870527 861820638
2314.9 861820638 861578465 861254811 861060381 860971928 860794425 860513687 860329926 860315859 860290885 860127866
2335.3 860127866 859908164 859802663 859792173 859886289 860435247 861188829 861404181 860899627 860039234 859325945
2355.7 859325945 858956397 858811498 858823419 859156191 859824419 860532999 861091137 861620426 862289608 862998843
2376.1 862998843 863495946 863782883 864108801 864529908 864778280 864732265 864651740 864767492 864938319 864930034
2396.5H64930034r7215L9994J26541o735j41204o3956R3043O7413j03593j31547K4020
2418.9H64736795Q6427r1731k66374j46567J16944J36673n0485r2566M9472Q8334j08599
2441.3H64458323k35677p5281P9036N9j22249p5638L4392k384j24336j35004j6332
2463.8H63784909K9624q7023j60575p4029K6524j9848j47402j52231m1723m77q3387
2486.2H63074362j45793q3625k98m4107j63913j69695n6207j4424p7963q1837j9312
2508.7H62217188k4676j16945j75357r5009J2695l0279j49846j38163k6167j4484j13666
2531.1H61345291j70112p8320L4213l5167j64687j43290m6551m3094j33753j66416
2551.5H60398114q7261k7240p6890j59323j48833p7426p9870j75536k21253j14262
$$ plain form
2396.5 864930034 864832819 864872813 864999354 864992619 864851415 864787459 864880502 864947915 864844322 864712775 864736795
2418.9 864736795 864823222 864731491 864465117 864318550 864435494 864572167 864521682 864429116 864478588 864566922 864458323
2441.3 864458323 864222646 864147365 864226401 864226460 864104211 864028573 864062965 864060581 863936245 863801241 863784909
2463.8 863784909 863814533 863727510 863566935 863492906 863519430 863499582 863352180 863199949 863158226 863157749 863074362
2486.2 863074362 862928569 862844944 862844646 862800539 862636626 862466931 862410724 862396300 862318337 862236500 862217188
2508.7 862217188 862192512 862075567 861900210 861805201 861817896 861787617 861637771 861499608 861473441 861458957 861345291
2531.1 861345291 861175179 861096859 861131072 861095905 860931218 860787928 860741377 860698283 860564530 860398114
2551.5 860398114 860310853 860283613 860206723 860047400 859898567 859821141 859741271 859565735 859344482 859230220
2571.9H59230220l7551j25885k14457j70469p5758r7513k20180k50101j42693q8036
2592.3H57807577j83702k66850k22504j55449j99318l03745k95401j82390j52230k36154
2612.7H55609834k70128k06947j84119k58565l11077k52723j83344k23756k86997k76446
2633.1H53155732k32339j99139k28405l04997k91824k02596k11537k83063k62558j83463
2653.5H50755811j86980k69473l01122k63095k12968k15709k58207k35915j82450k00749
2673.9H48429143k57611k74002k47538k10464k20478k74777k78056k50340k65777l03745
2694.3H45846355l31581k99334k39253k48552k96652k99156k44498k29418l19481l81470
2714.6H42956960l30627k54631k38776k79367k85685k84910l74079m48704m02450k69771
$$ plain form
2571.9 859230220 859192669 859066784 858852327 858681858 858606100 858508587 858288407 858038306 857895613 857807577
2592.3 857807577 857623875 857357025 857134521 856979072 856779754 856476009 856180608 855998218 855845988 855609834
2612.7 855609834 855339706 855132759 854948640 854690075 854378998 854126275 853942931 853719175 853432178 853155732
2633.1 853155732 852923393 852724254 852495849 852190852 851899028 851696432 851484895 851201832 850939274 850755811
2653.5 850755811 850568831 850299358 849998236 849735141 849522173 849306464 849048257 848812342 848629892 848429143
2673.9 848429143 848171532 847897530 847649992 847439528 847219050 846944273 846666217 846415877 846150100 845846355
2694.3 845846355 845514774 845215440 844976187 844727635 844430983 844131827 843887329 843657911 843338430 842956960
2714.6 842956960 842626333 842371702 842132926 841853559 841567874 841282964 840908885 840460181 840057731 839787960
2735H39787960j80423k44737l37064l09348k16306j99854l18110m10795l44813k72751
2755.4H36953759l29315m14789l86119k70963k62201l76224l97205k77639k44558m01437
2775.8H33593309n28455m68612l74138m04715m44770l75390l47436m76122n78999n07653
2796.2H29087019m55141n49078o45757o49750n43952m28677n14388p14063p40707o38426
2816.6H23207080o18636p03395p52568o81400o37174p47561q68440q70824q46028r33409
2837H15547645j269877j718461k001584k189219k279282k011478j380324p46071m38929
2855.4H01512420l84688m02510n45144q02935j040279j191020j168788r99212r65894
2873.7G94011950j077175r48965o53207n67437o69121p48396p74444q36670q86440
$$ plain form
2735 839787960 839607537 839362800 839025736 838716388 838500082 838300228 837982118 837571323 837226510 836953759
2755.4 836953759 836624444 836209655 835823536 835552573 835290372 834914148 834516943 834239304 833994746 833593309
2775.8 833593309 833064854 832596242 832222104 831817389 831372619 830997229 830649793 830173671 829594672 829087019
2796.2 829087019 828631878 828082800 827437043 826787293 826243341 825814664 825300276 824586213 823845506 823207080
2816.6 823207080 822588444 821885049 821132481 820451081 819813907 819066346 818197906 817327082 816481054 815547645
2837 815547645 814277768 812559307 810557723 808368504 806089222 804077744 802697420 801951349 801512420
2855.4 801512420 801127732 800725222 800180078 799377143 798336864 797145844 795977056 794977844 794011950
2873.7 794011950 792934775 791985810 791332603 790765166 790096045 789347649 788573205 787736535 786850095
2892.1G86850095q66056r00387j006544j046777j036942j078784j162649j296937j539052
2910.4G76915967j803815j916647j837551j644493j334726q46386m17173k24054j03235
2928.8G66787887m7624O7055L67760N85556P26760J026451J248777J079798O58810
2947.2G72501230L27528K25544J05381j12653j12712J20937K96593K70128J77205K14577
2967.6G74013758L15129L77775L82006L30925L88503M76539L44634J90318K29954L22879
2987.9G77372420L92258L19481N4896j05143k14696m37677n17130m37498l98934l68952
3008.3G75659025l22581l63290n30362p59780r11296r09805q23081p99596q71420q28564
3028.7G68539250o87659o65724q64327j091361r67562p33793q31604j093745j172901
$$ plain form
2892.1 786850095 785984039 785083652 784077108 783030331 781993389 780914605 779751956 778455019 776915967
2910.4 776915967 775112152 773195505 771357954 769713461 768378735 767532349 767115176 766891122 766787887
2928.8 766787887 766740263 766807318 767175078 767760634 768487394 769513845 770762622 771842420 772501230
2947.2 772501230 772828758 773054302 773159683 773047030 772934318 773055255 773351848 773621976 773799181 774013758
2967.6 774013758 774328887 774706662 775088668 775419593 775808096 776284635 776629269 776819587 777049541 777372420
2987.9 777372420 777764678 778084159 778139055 778033912 777819216 777381539 776864409 776426911 776027977 775659025
3008.3 775659025 775336444 774973154 774442792 773683012 772771716 771861911 771038830 770239234 769367814 768539250
3028.7 768539250 767851591 767185867 766321540 765230179 764262617 763528824 762697220 761603475 760430574
3047.1G60430574j018107r31918j039326j115799j139760j150668j051545r08673q36193
3065.5G51238585r07839j065969j108170j004517q12173o82533q30710j069724j144827
3083.8G42612123j135468j069605j060784j204133j228392j079321r47535r81748j185179
3102.2G32719958j226962j045823j032710j259088j262308r85443r45866j212836j528084
3120.5G22220838j705646j622618j430392j333535j363098j442910j449167j341164
3136.8G10532308j337409j569570j743555j698017j579165j410902j299321j522422
3153.2F98371947j848221j857281j750588j767755j794517j750231j695036j701057
3169.5F84207261j765490j787066j731217j740992j834870j894712j871228j778186
$$ plain form
3047.1 760430574 759412467 758480549 757441223 756325424 755185664 754034996 752983451 752074778 751238585
3065.5 751238585 750330746 749264777 748156607 747152090 746339917 745657384 744826674 743756950 742612123
3083.8 742612123 741476655 740407050 739346266 738142133 736913741 735834420 734886885 733905137 732719958
3102.2 732719958 731492996 730447173 729414463 728155375 726893067 725907624 724961758 723748922 722220838
3120.5 722220838 720515192 718892574 717462182 716128647 714765549 713322639 711873472 710532308
3136.8 710532308 709194899 707625329 705881774 704183757 702604592 701193690 699894369 698371947
3153.2 698371947 696523726 694666445 692915857 691148102 689353585 687603354 685908318 684207261
3169.5 684207261 682441771 680654705 678923488 677182496 675347626 673452914 671581686 669803500
3185.8F69803500j730501j807273j877665j862944j887559j928270j868248j782358
3202.1F55058682j763105j784444j818717j827717j794457j777947j776636j759410
3218.4F40756249j751899j762748j762927j724779j651168j559615j536131j689315
3234.7F27317667j831532j754999j589179j443445j352907j401066j512766j501203
3251.1F14930570j382470j318216j356781j382232j344919j329362j321435j230002
3267.4F04265153j093745j168608j414896j531243j511335j442611j425326j487434
3283.7E93189955j489699j421869j348019j349926j487433j634002j747310j806379
3300E80905318j659214j462162j551807j884401k143263k189160k109527k048910k058089
$$ plain form
3185.8 669803500 668072999 666265726 664388061 662525117 660637558 658709288 656841040 655058682
3202.1 655058682 653295577 651511133 649692416 647864699 646070242 644292295 642515659 640756249
3218.4 640756249 639004350 637241602 635478675 633753896 632102728 630543113 629006982 627317667
3234.7 627317667 625486135 623731136 622141957 620698512 619345605 617944539 616431773 614930570
3251.1 614930570 613548100 612229884 610873103 609490871 608145952 606816590 605495155 604265153
3267.4 604265153 603171408 602002800 600587904 599056661 597545326 596102715 594677389 593189955
3283.7 593189955 591700256 590278387 588930368 587580442 586093009 584459007 582711697 580905318
3300 580905318 579246104 577783942 576232135 574347734 572204471 570015311 567905784 565856874 563798785
3318.4E63798785k062499k019346k031624k224863k412200k391040k296031k205550
3334.7E46155632k144754k263904k452195k522170k592266k540946k297938k364874
3351E26976585k710640k790988k609908k411366k366840k411008k271533k157510k377987
3369.3E04868805k685844k641649k305597k097606k059907k061635j953423j679153
3385.7D87383991j367867j112163j197725j579851j598060j154065q97229j187801
3402D77289230j538992j325906q85307p48903q19921r24826r13382o48230m09961m12941
3422.4D68660861l39299n3644K49147L34233L40074M68970L75509P0661J22845N10306
3442.8D70739663Q27640R95547J014024R83446J031042J189023J456737J683325J615673
$$ plain form
3318.4 563798785 561736286 559716940 557685316 555460453 553048253 550657213 548361182 546155632
3334.7 546155632 544010878 541746974 539294779 536772609 534180343 531639397 529341459 526976585
3351 526976585 524265945 521474957 518865049 516453683 514086843 511675835 509404302 507246792 504868805
3369.3 504868805 502182961 499541312 497235715 495138109 493078202 491016567 489063144 487383991
3385.7 487383991 486016124 484903961 483706236 482126385 480528325 479374260 478477031 477289230
3402 477289230 475750238 474424332 473539025 472790122 471970201 471045375 470131993 469483763 469073802 468660861
3422.4 468660861 468321562 468267918 468517065 468851298 469191372 469660342 470035851 470106512 470229357 470739663
3442.8 470739663 471567303 472562850 473576874 474560320 475591362 476780385 478237122 479920447 481536120
3461.1D81536120J527041J842976K105683J758188J228362J274646J698732J999945
3477.4D94971693K021968J763254J684040J988471K089023J930893J994610K163648
3493.8E10607600K210915K088130K053022K221763K063811J713991J863361K317428
3510.1E27140021K587617K455115K126873K091169K395451K752245K636194K287447
3526.4E46472132K368868K549529K583384K779544K922058K741098K783835L105819
3542.7E68306267L226638K933025K644122K821148L049433L014326L095925L357887
3559E92448771L333986L030479L305733M224300M124940L402233L384650L732025L943801
3577.4F24930918M097879M134059L966689M150629M547656M215777L847539M185975
$$ plain form
3461.1 481536120 483063161 484906137 487011820 488770008 489998370 491273016 492971748 494971693
3477.4 494971693 496993661 498756915 500440955 502429426 504518449 506449342 508443952 510607600
3493.8 510607600 512818515 514906645 516959667 519181430 521245241 522959232 524822593 527140021
3510.1 527140021 529727638 532182753 534309626 536400795 538796246 541548491 544184685 546472132
3526.4 546472132 548841000 551390529 553973913 556753457 559675515 562416613 565200448 568306267
3542.7 568306267 571532905 574465930 577110052 579931200 582980633 585994959 589090884 592448771
3559 592448771 595782757 598813236 602118969 606343269 610468209 613870442 617255092 620987117 624930918
3577.4 624930918 629028797 633162856 637129545 641280174 645827830 650043607 653891146 658077121
3593.7F58077121M495561M506886M544854M339635L933192L986299M515111M610002
3610F93008661M473508M383444M123927M628956N096614M049123L037870L264665M858136
3628.4G30924904N190611L778160L551125L641785L495454L365994K977490K509415
3644.7G59434938K855123M371881M335046K408922K155721L084182K873302K084255
3661G83603370J736760J511276J423299J979769K138376J412809J795828K036691J340687
3679.4G98978865J133204J010418Q89718J329184J843571J383782Q81731Q00431P00533
3697.7H08951437P24972J037359R59158M72546K76565O25968J198650R48607L80874
3716.1H15576136K67863L34561L30329L92139M86314K52307j4126K11536Q17836J138091
$$ plain form
3593.7 658077121 662572682 667079568 671624422 675964057 679897249 683883548 688398659 693008661
3610 693008661 697482169 701865613 705989540 710618496 715715110 719764233 722802103 726066768 730924904
3628.4 730924904 736115515 739893675 743444800 747086585 750582039 753948033 756925523 759434938
3644.7 759434938 762290061 766661942 770996988 773405910 775561631 778645813 781519115 783603370
3661 783603370 785340130 786851406 788274705 790254474 792392850 793805659 795601487 797638178 798978865
3679.4 798978865 800112069 801122487 802012205 803341389 805184960 806568742 807450473 808250904 808951437
3697.7 808951437 809676409 810713768 811672926 812145472 812422037 813048005 814246655 815195262 815576136
3716.1 815576136 815843999 816178560 816508889 816901028 817387342 817639649 817625523 817837059 818654895 819792986
3736.5H19792986N10693m16101n03957M22895N76914P3969O11484R58860K73406o5326
3756.9H22235823K79843M61162J37686J2815Q9050K78771M64856K55525K5154J62601
3777.3H24403286M29809K41339p8737J0788J61588J58668J0371j38581J2636L1829
3797.7H25242996j19507K02596K19703R0837L73960J45554k85327k22027J80542Q2851
3818H25912178j7465L93629K10703k9862n8115j69456j48117r954J43588J77025P9990
3840.5H26484144J74165K70247o8367o04212q83877j71125J094997N76138k22265l76463
3860.9H26273382j82033K1756n2512O4612L47554K31982L2424k22623j90735Q7857
3881.3H26411664L6181J81019J05023k86460k6166J97947j94669l81231k14696m411
$$ plain form
3736.5 819792986 820303679 819887578 819383621 819806516 820383430 820457399 821068883 822027743 822301149 822235823
3756.9 822235823 822515666 822976828 823114514 823127329 823216379 823495150 823960006 824215531 824240685 824403286
3777.3 824403286 824833095 825074434 824995697 825006485 825168073 825326741 825337112 825198531 825211167 825242996
3797.7 825242996 825123489 825326085 825545788 825636625 826010585 826156139 825870812 825648785 825829327 825912178
3818 825912178 825894713 826288342 826499045 826469183 826411068 826241612 826093495 826083541 826227129 826404154 826484144
3840.5 826484144 826658309 826928556 826860189 826255977 825372100 825200975 826295972 826872110 826649845 826273382
3860.9 826273382 826091349 826113105 826060593 826125205 826472759 826704741 826737165 826514542 826323807 826411664
3881.3 826411664 826447845 826628864 826733887 826447427 826421261 826619208 826424539 826043308 825828612 825824201
3901.7H25824201K80678L32714J0967j51336r7692r0361o5625L5107N0903J8894Q2255
3924.1H26230705M6432j35780m2498K70844K27630r2328k03430j19150j9670o318k3245
3946.5H26133192Q3983J28448l696p5579k3305j073p331K6285Q762j5437K1815K4021
3971H26300085K4676O9976L5047k1517Q2552J76728L7492j43528j32919J0789J06334
3993.4H26545715R4951M5299
3997.5H26685965
$$ plain form
3901.7 825824201 826104879 826437593 826448560 826297224 826199532 826109171 826043546 826078653 826129556 826148450 826230705
3924.1 826230705 826277137 826141357 826098859 826369703 826597333 826505005 826301575 826182425 826162755 826156437 826133192
3946.5 826133192 826217175 826345623 826341927 826266348 826243043 826241970 826234639 826260924 826269686 826254249 826276064 826300085
3971 826300085 826324761 826394737 826429784 826408267 826490819 826667547 826705039 826561511 826428592 826439381 826545715
3993.4 826545715 826640666 826685965
3997.5 826685965
##END=$$ End of the data block
