##TITLE=$$ Begin of the data block
##JCAMP-DX=5.00 $$ ACD/SpecManager v 10.08
##SPECTROMETER/DATA SYSTEM=Alpha
##DATE=09 Apr 2014 11:14:46
##DATA TYPE=INFRARED SPECTRUM
##DATA CLASS=XYDATA
##ORIGIN=
##OWNER=
##NPOINTS=1765
##FIRSTX=399.75695801
##LASTX=3997.56933594
##MAXX=3997.56933594
##MINX=399.75695801
##MAXY=0.86848813
##MINY=0.46799347
##XFACTOR=1.0000000000
##YFACTOR=1.000000000000000e-9
##FIRSTY=0.72936094
##DELTAX=2.03957629
##XUNITS=1/CM
##YUNITS=ARBITRARY UNITS
##XYDATA=(X++(Y..Y))
399.8 729360938 729372621 729536295 729763448 729403019 728389263 727934897 728247583 727930248 726773620 726659834
420.2 726659834 727490425 727520525 726742268 726414680 726956010 727192163 726398766 725635827 725800514 726011395
440.5 726011395 725271523 724327743 724531770 725466728 725561440 724576592 723901808 724111795 724100769 723164797
460.9 723164797 722381175 722606301 722670376 721377492 719970703 720077932 720643759 720043957 719014227
479.3 719014227 718912303 719466865 719408631 718659043 718348145 718665719 718548775 717569649 716778934 716915131
499.7 716915131 717024982 716144562 715125978 714987993 715211987 714681625 713496745 712772727 712695479 712275445
520.1 712275445 711255848 710415721 710257292 710235119 709542811 708417535 707893074 708063662 707966864 707514942
540.5 707514942 707326829 707344830 707109213 706414402 705760181 705695868 705767810 705278218 704318225 703679264
560.9 703679264 703536570 702992320 701793730 700766504 700304210 699852049 698872805 697758079 697235465
579.2 697235465 697054505 696466446 695556521 695110261 695188105 695054829 694456279 693921804 693857551 693780482
599.6 693780482 692931652 691544592 690615892 690287828 689664781 688562036 687979877 688470483 689415097
618 689415097 690280139 691626012 694030106 696756601 698712170 700151384 702202916 704737961 706491232
636.3 706491232 707372606 708553195 710372269 711878479 712593794 713389814 715035319 716712296 717302918
654.7 717302918 717601299 719350517 722235322 724243939 724705517 725270450 728011906 730452478 731304228
673.1 731304228 732173085 734116435 736233830 737204969 737659216 739043534 741025984 742086112 742200613
691.4 742200613 742784858 744167089 745154738 745194197 745319068 746460617 747942507 748719454 749178529
709.8 749178529 750361681 752138853 753392994 753967285 754986644 756869078 758531153 759307981 760056555
728.1 760056555 761611640 763268888 764031231 764385223 765381515 766854882 767905533 768505573 769413531
746.5 769413531 770903528 772278309 772973418 773601890 774907053 776423395 777304947 777730048 778485596
764.8 778485596 779653370 780533850 780843437 781049252 781456709 781726420 781460226 780875385 780552566 780560911
785.2 780560911 780446112 780305803 780847907 782359958 784423649 786647677 789156735 792118251 795226336
803.6 795226336 797929287 800119400 802181602 804192841 805715442 806501210 806842625 807078183 807007372
821.9 807007372 806129336 804476917 802689970 801092923 799413919 797470748 795555115 794051886 792820871
840.3 792820871 791423500 789976120 789107025 789135993 789902925 791374683 793923080 797655940 801920235
858.7 801920235 806042910 810048401 814181387 818168998 821394265 823721886 825664520 827504277
875 827504277 828855634 829409182 829490304 829456151 829108477 828149617 826744497 825411141 824500740 823917866
895.4 823917866 823533237 823630452 824455023 825608909 826467574 826926947 827205718 827192008 826472282 824899733
915.8 824899733 822919011 821096778 819505513 817985415 816792846 816443086 816892564 817451894 817685366
934.1 817685366 817872703 818304420 818651617 818455219 817895591 817460597 816974759 815807700 813883960
952.5 813883960 811672091 809305668 806299925 802293420 797631502 792746603 787393689 781184077
968.8 781184077 774528205 768362463 763096154 758406222 754072070 750401378 747596145 745173275
985.1 745173275 742556512 739988446 738117278 736867547 735584497 734178841 733193934 732749283 732190847
1003.5 732190847 730957270 729272544 727528453 725494742 722793996 719730496 717066944 714957118
1019.8 714957118 712800562 710382164 708219767 706613839 705128431 703327119 701530457 700281322
1036.1 700281322 699401438 698285222 696914136 695821524 695097923 694218040 693026841 692125201 691983283
1054.5 691983283 692331731 692721009 693207383 694024384 694773257 694675624 693579733 692082286 690625370
1072.8 690625370 689067543 687302351 685677946 684494317 683488846 682210982 680663824 679242492
1089.1 679242492 678124785 677118599 676129162 675398171 675091505 674973428 674713433 674325168 674094439
1107.5 674094439 674001813 673718214 673143446 672476888 671772122 670761228 669319868 667824447 666610777
1125.8 666610777 665922940 666527689 668328822 670099199 671520650 672882915 674099326 675188899 676368475
1144.2 676368475 677559733 678447247 679034472 679747224 680888832 682254016 683583915 685147107 687429428
1162.6 687429428 690399468 693589389 696905077 700726330 705063343 709321916 713151395 716885746
1178.9 716885746 720818758 724575698 727606058 729961693 732058108 733817041 734755993 734910727 734953105
1197.2 734953105 735299110 735713422 735986710 736440659 737313569 738180399 738529205 738488615 738535523 738728940
1217.6 738728940 738687575 738336086 738148391 738402545 738762975 738898575 739065230 739672959 740546465 741228938
1238 741228938 741732240 742397785 743245006 743875742 744075477 744152367 744414985 744706750 744787574 744853914
1258.4 744853914 745314062 746224284 747303963 748464227 749952316 751874626 753951609 755923688 757908940
1276.8 757908940 760116398 762440562 764594495 766589701 768748224 771163642 773530006 775570393
1293.1 775570393 777365923 779124796 780780554 782077670 783010781 783879936 784815788 785563827 785912812
1311.4 785912812 786118448 786542177 787108600 787510455 787786841 788281739 789040923 789707661 790034115 790200353
1331.8 790200353 790401995 790487587 790236533 789837718 789755583 789971709 790061057 789900661 789824009 789949298
1352.2 789949298 789924622 789494991 788911700 788492978 788063407 787222981 786119819 785156608 784394324 783368349
1372.6 783368349 781708539 779713154 776925266 771770298 765340209 762543559 765811622 770799100
1388.9 770799100 773213804 773733556 773589671 773137629 772174299 770734251 769306958 768111169 766989172
1407.3 766989172 765739083 764526904 763702035 763222635 762729943 762073934 761650801 761632323 761658192 761512041
1427.7 761512041 761398494 761544287 761885405 762361944 762983918 763745606 764721692 765710771 766680360 767901659
1448.1 767901659 769353271 770770073 772195756 774520457 778089046 780953705 783267736 785995305
1464.4 785995305 789012671 791759968 794699550 798542261 802492797 805689454 808223963 810166895
1480.7 810166895 811602831 812576354 813210726 813366473 812851071 812067270 811199665 809905767 808117807
1499.1 808117807 806255162 804546416 802478194 798973978 795639336 793175757 790877938 788584054
1515.4 788584054 786282241 784339190 782658219 781049371 779475987 777780533 776314914 775081754
1531.7 775081754 773632586 772177517 771055579 770056903 769223809 768680036 768303335 768205404 768392444
1550.1 768392444 768672466 768888712 769122779 769730330 770206749 769987464 769559443 768978000 768001914 766369462
1570.5 766369462 764552355 762636304 759974420 757097602 754346013 751300752 747991085 744433343
1586.8 744433343 740585685 736517549 732376873 728096664 723660469 719195485 714720190 710186243
1603.1 710186243 705632091 701061726 696370244 691712558 687349021 682769537 677568078 673496187
1619.4 673496187 670320630 666769564 663296223 660300910 657705903 655855298 654747784 654286623
1635.7 654286623 654522419 655288279 656522632 658215046 661009967 664534867 667077780 670417428 676013529
1654.1 676013529 679796636 682603538 685965002 690136075 694374681 697867930 701821744 706633449
1670.4 706633449 710766613 715028644 719817400 723908067 727554858 731983840 738290012 743609667
1686.7 743609667 747758865 752145290 756181836 760791779 766236246 771903932 778653383 784025609
1703 784025609 788480937 793150544 797115982 800509036 803633869 806752980 810335457 813519955 815791070
1721.4 815791070 817869186 819952905 821860671 823681295 825370610 827348351 829383314 830887735
1737.7 830887735 832501650 834326386 836060882 837706864 839338958 841044366 842683077 843986273
1754 843986273 845142424 846231043 847192228 848227799 849188030 849939167 850622237 851322174 852127910
1772.4 852127910 852940083 853608549 854264021 854940057 855532408 856062233 856598258 857086122 857513607 857984960
1792.8 857984960 858464777 858926296 859367430 859790921 860229969 860688031 861119330 861456335 861729503 862030447
1813.2 862030447 862360716 862641513 862890422 863148868 863450646 863786519 864028752 864199698 864463031 864760935
1833.6 864760935 864953935 865090072 865279496 865501106 865679145 865831792 866001487 866213739 866430461 866580546
1854 866580546 866669178 866771936 866946518 867103159 867187321 867241681 867322385 867454588 867549539 867604613 867734253
1876.4 867734253 867924690 868018508 867996275 867994308 868066013 868120730 868122458 868162096 868278623 868391812 868415356
1898.8 868415356 868379414 868374228 868396819 868370950 868325770 868354201 868448734 868488133 868390203 868262827 868228912
1921.3 868228912 868261576 868278265 868238926 868189096 868162453 868105114 867999315 867919505 867860079 867756724 867631137
1943.7 867631137 867542326 867491066 867419839 867284656 867127120 866998792 866874814 866749346 866639137 866511345
1964.1 866511345 866357446 866240621 866155386 866027176 865868211 865719497 865588605 865480304 865374029 865251005
1984.5 865251005 865145683 865068257 864967287 864813566 864644349 864515126 864409864 864262581 864078760 863945663
2004.9 863945663 863864899 863735318 863520920 863318622 863214970 863131821 862966895 862774551 862653971 862578630
2025.3 862578630 862439632 862220526 862068415 862039447 861971915 861799777 861653209 861613691 861588061 861452520
2045.7 861452520 861258030 861171663 861191094 861143470 860989511 860888660 860917687 860932231 860804200 860646188
2066.1 860646188 860629976 860675573 860607386 860481203 860489488 860605299 860611439 860465348 860387146 860481918 860549450
2088.5 860549450 860460341 860362172 860428333 860581696 860599101 860461056 860412359 860552967 860659242 860602498 860550463
2110.9 860550463 860655010 860785127 860754907 860666811 860738218 860919356 860971808 860865951 860851169 861041665
2131.3 861041665 861195803 861148596 861098051 861235738 861440301 861489415 861424327 861496210 861723721 861866534
2151.7 861866534 861828566 861783862 861902118 862078786 862129867 862109661 862184703 862344682 862433910 862407386 862428308
2174.2 862428308 862597167 862756073 862785935 862789154 862893760 863056421 863124788 863093436 863121390 863246322 863326728
2196.6 863326728 863290191 863237739 863299787 863421559 863440812 863391280 863439143 863578618 863634765 863551080 863504171
2219 863504171 863619089 863752484 863728404 863605380 863599122 863743722 863820553 863745093 863681674 863730013 863780081
2241.5 863780081 863716543 863609254 863615096 863717556 863746822 863675416 863631010 863689899 863743663 863659978 863543868
2263.9 863543868 863556862 863655329 863683105 863632202 863647640 863756955 863814473 863731623 863630950 863663793 863757849
2286.3 863757849 863740623 863622129 863574028 863607109 863542318 863375723 863282681 863319993 863351583 863208055 862943232
2308.8 862943232 862802267 862811506 862729192 862459242 862171173 862002909 861886680 861693144 861429632 861280322
2329.2 861280322 861261606 861159682 860951126 860814989 860834241 860847533 860882163 861355245 862037301 862211406
2349.6 862211406 861690640 860820293 860136569 859878063 859887838 859930933 860218287 860968590 861711621 862104416
2370 862104416 862485468 863149524 863872766 864358187 864666760 865031958 865465879 865695238 865617454 865513086
2390.4 865513086 865610242 865783095 865817904 865759969 865801394 865921438 865913808 865758598 865674019 865766943 865849972
2412.8 865849972 865752935 865620434 865638912 865699351 865581870 865316212 865172863 865278661 865416169 865384459
2433.2 865384459 865309834 865372598 865451217 865330040 865109682 865046442 865116537 865096331 864966512 864912570 864981771
2455.6 864981771 865001917 864874065 864729226 864708960 864726186 864625812 864477992 864448309 864513576 864491463 864316046
2478.1 864316046 864126384 864052534 864051819 863981724 863826811 863725245 863723993 863692343 863556445 863432765 863407433
2500.5 863407433 863365769 863217235 863091409 863075733 863076508 863000274 862855017 862748384 862732410 862696648 862569451
2522.9 862569451 862449348 862415195 862403810 862307787 862128854 862014532 862017691 861981392 861839175 861725450 861702681
2545.4 861702681 861676097 861552715 861379325 861271024 861232042 861157238 860988975 860833228 860788763 860759616
2565.8 860759616 860588074 860321105 860173821 860148430 860049188 859843731 859681904 859610200 859484255 859227359
2586.2 859227359 858981490 858873069 858797193 858595252 858305335 858087480 857964456 857785106 857480407 857185900
2606.6 857185900 857003689 856860042 856656969 856398344 856171787 855969667 855701327 855415404 855195165 854986250
2626.9 854986250 854714692 854415298 854161203 853959620 853750288 853486300 853187323 852938652 852776170 852571726
2647.3 852571726 852258801 851959765 851756632 851572216 851320803 851050794 850827456 850624800 850391865 850128412
2667.7 850128412 849885702 849668801 849438369 849206388 848988473 848763168 848525822 848264813 847976148 847704113
2688.1 847704113 847472727 847234786 846930861 846569777 846247911 846015513 845772922 845465899 845183551 844962478
2708.5 844962478 844718337 844374776 843991578 843674481 843413711 843155503 842885911 842628062 842359245 841998041
2728.9 841998041 841567993 841180146 840913653 840735555 840495646 840137184 839799941 839585125 839379013 839033246
2749.3 839033246 838619411 838305295 838065267 837761939 837353468 836947680 836665094 836399555 836018562 835632443
2769.7 835632443 835377514 835141003 834717929 834189832 833780587 833456039 833035588 832549691 832165062 831830859
2790.1 831830859 831357598 830762982 830237865 829802811 829278767 828608036 827932954 827393591 826942801 826388478
2810.5 826388478 825682580 824985564 824392855 823805988 823105693 822356403 821676373 821022511 820276737 819405198
2830.9 819405198 818510413 817651808 816692650 815401435 813707352 811758339 809608817 807288587 805194080
2849.3 805194080 803817570 803111434 802639246 802213669 801851094 801378191 800584316 799479902 798201799
2867.6 798201799 797021091 796101272 795201361 794171751 793233514 792500019 791858196 791210473 790479481
2886 790479481 789675415 788891375 788121521 787321448 786400557 785295308 784162283 783092201 782010853
2904.3 782010853 780899107 779647589 778110623 776337564 774459064 772629380 770990551 769616485
2920.6 769616485 768650830 768164635 768015444 768004358 767990768 768072605 768424988 768998921 769770324 770824730
2941 770824730 772038937 773105323 773782849 774120212 774377763 774513662 774378419 774213612 774308026 774621129
2961.4 774621129 774909377 775094271 775302947 775597215 775982380 776408195 776763678 777112424 777535975 777865171
2981.8 777865171 778044462 778281331 778672636 779137850 779475689 779517233 779393017 779174089 778750598 778250575
3002.2 778250575 777822733 777426064 777071655 776785553 776437342 775885701 775141835 774272203 773321033 772418976
3022.6 772418976 771608591 770745039 769892037 769193053 768567204 767787158 766774237 765822411 765061378
3041 765061378 764224589 763136029 761913419 760811627 759862185 758870363 757773697 756616294 755483627
3059.3 755483627 754479349 753559351 752666652 751750231 750743806 749704361 748689055 747809589 747103572
3077.7 747103572 746290922 745249927 744148552 743048728 741971433 740892947 739686847 738425136
3094 738425136 737315595 736350656 735300422 734048188 732824206 731841981 730888367 729664683 728398800
3112.4 728398800 727426529 726503015 725285232 723764539 722099185 720488608 718995452 717568696 716179132
3130.7 716179132 714787364 713364303 711984277 710624337 709080160 707365274 705680966 704121828
3147 704121828 702737868 701434910 699894488 698026955 696136236 694379807 692626238 690796256 688972712
3165.4 688972712 687246263 685561836 683814466 682026327 680269539 678514540 676711798 674865305
3181.7 674865305 673007488 671179712 669404805 667642891 665823460 663939953 662013531 660080433
3198 660080433 658211648 656422913 654650986 652855158 651020944 649191916 647446275 645723820 643957734
3216.4 643957734 642183602 640379131 638516665 636669159 634912014 633261025 631696701 630142033
3232.7 630142033 628441930 626632750 624929070 623357475 621883333 620483816 619044781 617509544
3249 617509544 615991235 614632964 613364339 612017572 610606313 609231114 607873142 606511593 605262578
3267.4 605262578 604137778 602915704 601505518 600009203 598500550 597039938 595617354 594163716
3283.7 594163716 592687607 591263294 589938164 588627815 587174654 585523188 583689570 581817389
3300 581817389 580170691 578720272 577142298 575243056 573072493 570848942 568750322 566714346 564637542
3318.4 564637542 562553227 560521483 558484137 556251168 553819716 551412702 549098790 546844900
3334.7 546844900 544645369 542360783 539892137 537320375 534680784 532098591 529750466 527370274
3351 527370274 524658680 521842122 519226074 516817212 514384806 511891246 509607196 507448852 505046964
3369.3 505046964 502358794 499709576 497330546 495152682 493108422 491122246 489185601 487422198
3385.7 487422198 485940337 484770924 483578175 482018560 480415463 479257435 478372157 477151632
3402 477151632 475573480 474234104 473299563 472520441 471730739 470823646 469896168 469203472 468706816 468255430
3422.4 468255430 467993468 468024015 468247890 468514234 468856514 469353080 469730586 469820738 469973862 470481366
3442.8 470481366 471293420 472277462 473284513 474337131 475491315 476713598 478106797 479733020 481317610
3461.1 481317610 482846260 484726340 486847550 488598466 489823878 491088510 492801666 494869053
3477.4 494869053 496950477 498718768 500409663 502438962 504563749 506482720 508423626 510572731
3493.8 510572731 512830317 514975667 517067969 519311190 521417320 523188949 525103927 527458608
3510.1 527458608 530031085 532465160 534637809 536785364 539168119 541875482 544489920 546759129
3526.4 546759129 549129725 551772475 554494262 557326615 560214639 562941194 565724909 568802357
3542.7 568802357 572025836 574989974 577658772 580505431 583624542 586752236 589903414 593230903
3559 593230903 596538603 599587321 602933288 607200325 611380577 614850402 618267655 621963561 625872612
3577.4 625872612 630000710 634207070 638259411 642431438 646958351 651240230 655144513 659329593
3593.7 659329593 663842797 668396056 673005760 677442610 681463778 685473979 689991772 694627106
3610 694627106 699094653 703448653 707578123 712230802 717382431 721510053 724567354 727776587 732591689
3628.4 732591689 737873793 741748989 745323896 748972237 752432108 755748570 758744359 761296630
3644.7 761296630 764156342 768522143 772908270 775386930 777548492 780570388 783417583 785531521
3661 785531521 787272990 788772583 790191948 792100012 794167697 795612276 797413826 799436629 800836504
3679.4 800836504 802057564 803139210 804049730 805365086 807209313 808597863 809484959 810279727 810933292
3697.7 810933292 811610699 812668622 813688278 814186692 814438939 815000772 816171110 817216814 817702115
3716.1 817702115 817963779 818249345 818585873 818985522 819441438 819697201 819705904 819887877 820640028 821773291
3736.5 821773291 822362006 822014570 821507514 821858406 822338521 822320104 822857261 823843002 824258804 824323177
3756.9 824323177 824591517 824931383 824989796 825047195 825252295 825576067 826006949 826228082 826211631 826316535
3777.3 826316535 826690614 826926291 826900780 826970935 827162981 827322423 827330709 827171087 827127934 827128232 827004075
3799.7 827004075 827208281 827486277 827619672 827961326 828081071 827801466 827610373 827834368 827953160 827946484
3820.1 827946484 828282952 828424275 828350306 828291059 828192353 828114033 828069568 828077376 828159451 828296900 828556776
3842.5 828556776 828850150 828796208 828223050 827388287 827212334 828209877 828806937 828679204 828337371 828159273
3862.9 828159273 828223526 828171611 828130245 828345478 828513026 828589857 828495681 828409255 828557134 828639090 828783393
3885.4 828783393 828857183 828650534 828640461 828759491 828568518 828211248 827970624 827997029 828312814 828600109
3905.7 828600109 828580081 828441143 828356028 828264177 828194141 828239381 828291893 828259766 828288078 828369915 828293085
3928.2 828293085 828208327 828395545 828613043 828565061 828378558 828252256 828257024 828254938 828207195 828292131 828420579
3950.6 828420579 828415036 828372777 828409016 828454733 828448176 828444302 828447282 828433216 828445435 828482032 828511953 828561902
3975.1 828561902 828607380 828595817 828624845 828793347 828932703 828847945 828679562 828656077 828758180 828882694
3995.5 828882694 828960061
3997.5 828960061
##END=$$ End of the data block
