##TITLE=$$ Begin of the data block
##JCAMP-DX=5.00 $$ ACD/SpecManager v 10.08
##SPECTROMETER/DATA SYSTEM=Alpha
##DATE=09 Apr 2014 11:14:46
##DATA TYPE=INFRARED SPECTRUM
##DATA CLASS=XYDATA
##ORIGIN=
##OWNER=
##NPOINTS=1765
##FIRSTX=399.75695801
##LASTX=3997.56933594
##MAXX=3997.56933594
##MINX=399.75695801
##MAXY=0.86902988
##MINY=0.46764553
##XFACTOR=1.0000000000
##YFACTOR=1.000000000000000e-9
##FIRSTY=0.72916901
##DELTAX=2.03957629
##XUNITS=1/CM
##YUNITS=ARBITRARY UNITS
##XYDATA=(X++(Y..Y))
$$ plain form
399.8 729169011 729372978 729788423 730261445 729709506 728307307 727865636 728405535 728150785 726900339
418.1 726900339 726719439 727708995 727757812 726801038 726534247 727237999 727397442 726472676 725721061 725936294
438.5 725936294 726271808 725757837 724930882 724959314 725623906 725670755 724646389 723658383 723601043 723723352
458.9 723723352 723096430 722469389 722608507 722524703 721234500 719974101 720225573 720830858 720204294 719106317
479.3 719106317 718901098 719358206 719361126 718739271 718320906 718380392 718208015 717441082 716758728 716730952
499.7 716730952 716724873 715990901 715091586 714838147 714905083 714305699 713110328 712425172 712532103 712331414
520.1 712331414 711292624 710267246 709935009 709857047 709277809 708338141 707881093 708008349 707821965 707085431
540.5 707085431 706667840 706761003 706566870 705912709 705501676 705632329 705679476 705018044 703943551 703355849
$$ packed form
399.8G29169011K03967M15445M73022n51939j402199m41671N39899k54750j250446
418.1G26900339j80900R89556M8817r56774k66791P03752J59443r24766p51615K15233
438.5G25936294L35514n13971q26955K8432O64592M6849j024366r88006n7340J22309
458.9G23723352o26922o27041J39118q3804j290203j260399K51472O05285o26564j097977
479.3G19106317k05219M57108K920o21855m18365N9486j72377p66933o82354k7776
499.7G16730952o079p33972q99315k53439O6936n99384j195371o85156J06931k00689
520.1G12331414j038790j025378l32237p7962n79238r39668m57048J27256j86384p36534
540.5G07085431m17591R3163j94133o54161m11033J30653M7147o61432j074493n87702
$$ plain form
560.9 703355849 703312874 702795148 701599598 700662494 700268090 699754536 698687494 697535992 697012603
579.2 697012603 696848691 696265638 695297956 694784164 694965899 695061684 694564342 694075823 694052458 693774760
599.6 693774760 692649961 691277385 690468431 690112352 689464152 688417554 687920451 688508093 689480960
618 689480960 690314054 691658080 694091201 696824074 698758125 700182259 702186704 704666972 706469417
636.3 706469417 707429588 708607137 710433662 711979926 712701440 713567376 715311050 716924906 717354059
654.7 717354059 717591345 719392896 722315371 724369884 724941194 725593030 728308678 730748892 731671810
673.1 731671810 732546687 734452724 736617208 737646878 738064587 739331186 741224945 742331564 742550671
691.4 742550671 743165910 744539142 745531917 745558739 745643735 746760905 748241484 748989224 749467313 750788033
$$ packed form
560.9G03355849m2975n17726j195550r37104l94404n13554j067042j151502n23389
579.2F97012603j63912n83053r67682n13792J81735R5785m97342m88519k3365k77698
599.6F93774760j124799j372576q08954l56079o48200j046598m97103N87642R72867
618F89480960Q33094J344026K433121K732873J934051J424134K004445K480268J802445
636.3G06469417R60171J177549J826525J546264P21514Q65936J743674J613856M29153
654.7G17354059K37286J801551K922475K054513N71310O51836K715648K440214R22918
673.1G31671810Q74877J906037K164484J029670M17709J266599J893759J106619K19107
691.4G42550671O15239J373232R92775K6822Q4996J117170J480579P47740M78089J320720
$$ plain form
711.8 750788033 752677321 753955066 754511714 755507767 757394731 759019732 759741485 760487795 762050927
730.2 762050927 763736844 764559209 764969707 765975296 767404377 768392146 768923342 769811749 771300673
748.5 771300673 772627711 773322999 774001181 775265694 776690900 777575076 778055608 778808713 779940426
766.9 779940426 780813754 781126022 781337798 781810999 782166898 781900585 781244516 780858755 780849099 780758679
787.3 780758679 780637443 781152844 782613933 784647942 786882401 789415479 792405605 795569718 798317432
805.6 798317432 800463319 802454352 804466844 806001961 806787372 807156444 807415426 807351530 806494117
824 806494117 804856658 803051293 801409304 799662292 797685146 795811832 794384181 793196619 791774631
842.3 791774631 790262759 789356232 789420009 790218532 791636407 794104338 797819078 802148044 806322396
$$ packed form
711.8G50788033J889288J277745N56648R96053J886964J625001P21753P46310J563132
730.2G62050927J685917Q22365M10498J005589J429081R87769N31196Q88407J488924
748.5G71300673J327038O95288O78182J264513J425206Q84176M80532P53105J131713
766.9G79940426Q73328L12268K11776M73201L55899k66313o56069l85761r656r0420
787.3G80758679j21236N15401J461089K034009K234459K533078K990126L164113K747714
805.6G98317432K145887J991033K012492J535117P85411L69072K58982o3896q57413
824H06494117j637459j805365j641989j747012j977146j873314j427651j187562j421988
842.3G91774631j511872r06527O3777P98523J417875K467931L714740M328966M174352
$$ plain form
860.7 806322396 810279489 814355671 818360269 821630538 824002564 825935602 827701449 829035938
877 829035938 829653859 829763412 829680145 829289734 828338683 826963961 825659394 824745297 824122429 823723316
897.4 823723316 823857486 824705482 825834751 826669157 827123761 827393591 827372253 826618314 824991465 823008537
917.8 823008537 821217597 819659412 818182468 817026734 816687703 817109466 817638278 817889869 818104684
936.2 818104684 818500102 818773210 818562150 818041801 817622185 817154348 816020727 814079046 811809599
954.5 811809599 809393406 806365609 802371383 797738373 792883694 787535250 781299710 774621248
970.8 774621248 768456399 763207376 758531153 754222274 750607669 747824192 745347798 742683530
987.1 742683530 740121901 738266170 737024486 735744596 734316230 733308852 732866466 732306957 731067598
$$ packed form
860.7H06322396L957093M076182M004598L270269K372026J933038J765847J334489
877H29035938O17921J09553q3267l90411r51051j374722j304567r14097o22868l99113
897.4H23723316J34170Q47996J129269Q34406M54604K69830k1338p53939j626849j982928
917.8H23008537j790940j558185j476944j155734l39031M21763N28812K51591K14815
936.2H18104684L95418K73108k11060n20349m19616m67837j133621j941681k269447
954.5H11809599k416193l027797l994226m633010m854679n348444o235540o678462
970.8G74621248o164849n249023m676223m308879l614605k783477k476394k664268
987.1G42683530k561629j855731j241684j279890j428366j007378m42386n59509j239359
$$ plain form
1005.5 731067598 729385793 727670074 725660205 722909570 719798625 717171431 715093315 712932169
1021.8 712932169 710521400 708365679 706751704 705238283 703404129 701632023 700451434 699606061
1038.1 699606061 698479831 697114885 696057260 695335686 694438338 693249702 692341983 692194283 692544103
1056.5 692544103 692929864 693430722 694255948 694981337 694865108 693772137 692291379 690854728 689302564
1074.8 689302564 687532365 685915053 684752762 683764696 682502568 680952907 679503083 678372860
1091.2 678372860 677378595 676410019 675699949 675419390 675340295 675110042 674719989 674454808 674327254 674038291
1111.6 674038291 673479795 672833025 672130108 671091020 669615924 668105662 666859925 666126609 666739225
1129.9 666739225 668576598 670362592 671808839 673220634 674461484 675517738 676628172 677755594
$$ packed form
1005.5G31067598j681805j715719k009869k750635l110945k627194k078116k161146
1021.8G12932169k410769k155721j613975j513421j834154j772106j180589q45373
1038.1F99606061j126230j364946j057625p21574q97348j188636r07719j47700L49820
1056.5F92544103L85761N00858Q25226P25389j16229j092971j480758j436651j552164
1074.8F89302564j770199j617312j162291r88066j262128j549661j449824j130223
1091.2F78372860r94265r68576p10070k80559p9095k30253l90053k65181j27554k88963
1111.6F74038291n58496o46770p02917j039088j475096j510262j245737p33316O12616
1129.9F66739225J837373J785994J446247J411795J240850J056254J110434J127422
$$ plain form
1146.2 677755594 678628087 679240525 679965913 681093633 682445645 683777213 685353160 687645316 690590441
1164.6 690590441 693738580 697042406 700866461 705196500 709451377 713278651 716978073 720838964
1180.9 720838964 724548817 727577090 729931295 732020676 733766854 734696329 734886527 734984756 735352635
1199.3 735352635 735761642 736013532 736441672 737336218 738273561 738657832 738595009 738632560 738832057 738772511
1219.7 738772511 738404274 738223195 738485575 738855302 739024401 739229798 739853799 740730107 741405070 741906524
1240.1 741906524 742587924 743432820 744049489 744278908 744409382 744692504 744970024 745016932 745050669 745515108
1260.4 745515108 746460021 747561812 748723924 750204980 752123952 754201770 756154537 758107543
1276.8 758107543 760305703 762650549 764839590 766854405 769004166 771397710 773741186 775759161
$$ packed form
1146.2F77755594Q72493O12438P25388J127720J352012J331568J575947K292156K945125
1164.6F90590441L148139L303826L824055M330039M254877L827274L699422L860891
1180.9G20838964L709853L028273K354205K089381J746178R29475J90198R8229L67879
1199.3G35352635M09007K51890M28140Q94546R37343L84271o2823L7551J99497n9546
1219.7G38772511l68237j81079K62380L69727J69099K05397O24001Q76308O74963N01454
1240.1G41906524O81400Q44896O16669K29419J30474K83122K77520M6908L3737M64439
1260.4G45515108R44913J101791J162112J481056J918972K077818J952767J953006
1276.8G58107543K198160K344846K189041K014815K149761K393544K343476K017975
$$ plain form
1293.1 775759161 777537227 779293299 780965388 782294273 783244073 784109116 785057247 785822988 786193728
1311.4 786193728 786431551 786858797 787413776 787825465 788111031 788603067 789356172 789997756 790295959 790463984
1331.8 790463984 790672541 790740967 790473521 790097237 790056705 790282309 790348232 790168762 790090621 790234923
1352.2 790234923 790238917 789827704 789264143 788860798 788416862 787550271 786448419 785495043 784716904 783668578
1372.6 783668578 782020211 780053854 777266681 772124529 765737116 762949586 766178489 771131933
1388.9 771131933 773538470 774047017 773897767 773463547 772515297 771087587 769661009 768439412 767301857
1407.3 767301857 766065896 764867425 764034152 763527870 763005555 762345314 761932492 761900723 761911929 761768639
1427.7 761768639 761665165 761818528 762155235 762624562 763258517 764026225 764979482 765933156 766857862 768055022
$$ packed form
1293.1G75759161J778066J756072J672089J328885R49800Q65043R48131P65741L70740
1311.4G86193728K37823M27246N54979M11689K85566M92036P53105O41584K98203J68025
1331.8G90463984K08557O8426k67446l76284m0532K25604O5923j79470p8141J44302
1352.2G90234923L994m11213n63561m03345m43936q66591j101852r53376p78139j048326
1372.6G83668578j648367j966357k787173n142152o387413k787530L228903M953444
1388.9G71131933K406537N08547j49250m34220r48250j427710j426578j221597j137555
1407.3G67301857j235961j198471q33273n06282n22315o60241m12822l1769J1206j43290
1427.7G61768639j03474J53363L36707M69327O33955P67708R53257R53674R24706J197160
$$ plain form
1448.1 768055022 769554794 771033287 772462130 774733424 778273582 781166375 783501089 786237538
1464.4 786237538 789295495 792083502 795008123 798798561 802726984 805953026 808539689 810515523
1480.7 810515523 811949134 812897623 813491523 813611746 813104808 812344551 811456323 810112596 808339715
1499.1 808339715 806543648 804870903 802741885 799127042 795837283 793449163 791168869 788865745
1515.4 788865745 786562741 784633100 782955945 781350851 779796898 778124452 776683211 775466084
1531.7 775466084 774038672 772617817 771488428 770394146 769484639 768983185 768692076 768654287 768852115
1550.1 768852115 769122422 769319415 769483387 770002306 770569742 770475745 770072639 769441962 768389344 766721785
1570.5 766721785 764936686 763064563 760412991 757523060 754774392 751731813 748398125 744818926
$$ packed form
1448.1G68055022J499772J478493J428843K271294L540158K892793K334714K736449
1464.4G86237538L057957K788007K924621L790438L928423L226042K586663J975834
1480.7H10515523J433611R48489N93900J20223n06938p60257q88228j343727j772881
1499.1H08339715j796067j672745k129018l614843l289759k388120k280294k303124
1515.4G88865745k303004j929641j677155j605094j553953j672446j441241j217127
1531.7G75466084j427412j420855j129389j094282r09507n01454k91109l7789J97828
1550.1G68852115K70307J96993J63972N18919N67436r3997m03106o30677j052618j667559
1570.5G66721785j785099j872123k651572k889931k748668l042579l333688l579199
$$ plain form
1586.8 744818926 740987122 736934304 732760251 728406966 723927319 719466329 714971840 710397005
1603.1 710397005 705810726 701175809 696412563 691735625 687354028 682711542 677456260 673362017
1619.4 673362017 670137882 666552901 663118720 660159528 657548308 655676663 654567838 654106438
1635.7 654106438 654353678 655152798 656436741 658172607 660983920 664531589 667078614 670363605 676005960
1654.1 676005960 679950953 682859421 686273098 690480947 694749892 698262870 702212512 707016170
1670.4 707016170 711179912 715493500 720320046 724428177 728072524 732471347 738738060 744047761
1686.7 744047761 748210669 752617776 756649435 761219800 766638994 772302389 779041350 784424007
1703 784424007 788916230 793640256 797645032 801038325 804129720 807203054 810763240 813970625 816264272
$$ packed form
1586.8G44818926l831804m052818m174053m353285m479647m460990m494489m574835
1603.1G10397005m586279m634917m763246m676938m381597m642486n255282m094243
1619.4F73362017l224135l584981l434181k959192k611220j871645j108825m61400
1635.7F54106438K47240P99120J283943J735866K811313L547669K547025L284991N642355
1654.1F76005960L944993K908468L413677M207849M268945L512978L949642M803658
1670.4G07016170M163742M313588M826546M108131L644347M398823O266713N309701
1686.7G44047761M162908M407107M031659M570365N419194N663395O738961N382657
1703G84424007M492223M724026M004776L393293L091395L073334L560186L207385K293647
$$ plain form
1721.4 816264272 818360507 820465147 822360039 824147344 825818717 827770174 829801738 831334889
1737.7 831334889 832962751 834787071 836519897 838148594 839744925 841432154 843099892 844445109
1754 844445109 845617294 846714318 847687960 848714292 849663436 850404322 851058364 851727068 852539003
1772.4 852539003 853397906 854094803 854746521 855419576 856028259 856573403 857125342 857635915 858052373 858490705
1792.8 858490705 858988523 859486639 859940886 860357285 860776246 861213982 861626148 861943781 862211406 862532258
1813.2 862532258 862898648 863210618 863462031 863697231 863976657 864305437 864544451 864700913 864955366 865268826
1833.6 865268826 865485609 865645468 865860224 866084397 866246939 866406441 866589248 866804302 867026329 867174089
1854 867174089 867256761 867377043 867561579 867704630 867768705 867779016 867809534 867946565 868089616 868193567 868367016
$$ packed form
1721.4H16264272K096235K104640J894892J787305J671373J951457K031564J533151
1737.7H31334889J627862J824320J732826J628697J596331J687229J667738J345217
1754H44445109J172185J097024R73642J026332R49144P40886O54042O68704Q11935
1772.4H52539003Q58903O96897O51718O73055O08683N45144N51939N10573M16458M38332
1792.8H58490705M97818M98116M54247M16399M18961M37736M12166L17633K67625L20852
1813.2H62532258L66390L11970K51413K35200K79426L28780K39014J56462K54453L13460
1833.6H65268826K16783J59859K14756K24173J62542J59502J82807K15054K22027J47760
1854H67174089Q2672J20282J84536J43051O4075J0311L0518J37031J43051J03951J73449
$$ plain form
1876.4 868367016 868575573 868641078 868575871 868556738 868628025 868683040 868687093 868708670 868802369 868923247 868975520
1898.8 868975520 868964612 868974209 869029880 869019330 868917882 868888795 868975937 869025946 868934870 868805766 868778467
1921.3 868778467 868836701 868881881 868844569 868765116 868719876 868688881 868618250 868533552 868449688 868337393 868203461
1943.7 868203461 868088663 868029892 868001640 867924035 867777407 867615342 867471695 867345870 867216885 867050827
1964.1 867050827 866879344 866789460 866730511 866594493 866433859 866304278 866185904 866083145 865988314 865874529
1984.5 865874529 865751088 865629017 865490615 865325153 865164936 865064859 865000427 864884853 864706337 864549160
2004.9 864549160 864456654 864340544 864143729 863968253 863873363 863758028 863553822 863346815 863224387 863133967
2025.3 863133967 862983882 862776816 862638652 862626076 862572432 862379253 862213135 862194955 862190843 862050772
$$ packed form
1876.4H68367016K08557O5505o5207j9133P1287N5015M053K1577R3699J20878N2273
1898.8H68975520j0908R597N5671j0550j01448k9087Q7142N0009r1076j29104k7299
1921.3H68778467N8234M5180l7312p9453m5240l0995p0631q4698q3864j12295j33932
1943.7H68203461j14798n8771k8252p7605j46628j62065j43647j25825j28985j66058
1964.1H67050827j71483q9884n8949j36018j60634j29581j18374j02759r4831j13785
1984.5H65874529j23441j22071j38402j65462j60217j00077o4432j15574j78516j57177
2004.9H64549160r2506j16110j96815j75476r4890j15335k04206k07007j22428r0420
2025.3H63133967j50085k07066j38164j2576n3644j93179j66118j8180m112j40071
$$ plain form
2045.7 862050772 861849427 861765385 861788154 861730933 861554503 861462593 861529946 861540079 861364305 861191213 861214399
2068.1 861214399 861303568 861253142 861129463 861129701 861233890 861243784 861111343 861037254 861138880 861214578 861103535
2090.5 861103535 860975385 861043930 861212134 861219883 861071527 861061692 861252546 861355543 861255646 861175179 861294329
2113 861294329 861455917 861434758 861331761 861395419 861576438 861624122 861534297 861546040 861723006 861850500 861824274
2135.4 861824274 861801028 861933053 862122893 862161577 862095475 862154663 862365365 862508833 862465322 862408221 862522304
2157.9 862522304 862707376 862785816 862796605 862877488 863017619 863101065 863109708 863166511 863352597 863530040 863556683
2180.3 863556683 863540769 863633811 863771498 863807380 863768935 863816142 863960385 864041388 864006460 863993645 864112854
2202.7 864112854 864267588 864288568 864200652 864187002 864299297 864383459 864338994 864292800 864375591 864483595 864460409
$$ packed form
2045.7H62050772k01345q4042K2769n7221j76430r1910O7353J0133j75774j73092K3186
2068.1H61214399Q9169n0426j23679K38J04189R894j32441p4089J01626P5698j11043
2090.5H61103535j28150O8545J68204P749j48356r835J90854J02997r9897q0467J19150
2113H61294329J61588k1159j02997O3658J81019M7684q9825J1743J76966J27494k6226
2135.4H61824274k3246J32025J89840L8684o6102N9188K10702J43468m3511n7101J14083
2157.9H62522304J85072P8440J0789Q0883J40131Q3446Q643N6803J86086J77443K6643
2180.3H63556683j5914R3042J37687L5882l8445M7207J44243Q1003l4928j2815J19209
2202.7H64112854J54734K0980q7916j3650J12295Q4162m4465m6194Q2791J08004k3186
$$ plain form
2225.2 864460409 864368618 864385903 864506721 864556789 864491820 864462733 864535570 864590526 864534140 864439309 864445686
2247.6 864445686 864516258 864508927 864433169 864394069 864450395 864514589 864459276 864374161 864403546 864474893 864464164 864417672
2272.1 864417672 864454627 864574969 864641428 864576638 864495575 864529550 864597976 864538372 864379704 864309072 864350557
2294.5 864350557 864310145 864156067 864088297 864184916 864266753 864139974 863874316 863703847 863665938 863573194 863341928
2316.9 863341928 863107502 862972379 862826467 862586081 862357438 862278640 862298906 862205386 861964166 861754477
2337.3 861754477 861699045 861716688 861819804 862321734 863028288 863275349 862832367 861996055 861283004 860920370
2357.7 860920370 860812068 860855699 861186862 861845195 862520993 862998903 863446057 864087284 864784598 865285575
2378.1 865285575 865626514 866000354 866403461 866579413 866460383 866364062 866502523 866683662 866695285 866617918
$$ packed form
2225.2H64460409r1791J7285J20818N0068o4969k9087P2837N4956n6386r4831O377
2247.6H64445686P0572p331p5758l9100N6326O4194n5313q5115K9385P1347j0729m6492
2272.1H64417672L6955J20342O6459o4790q1063L3975O8426n9604j58668p0632M1485
2294.5H64350557m0412j54078o7770R6619Q1837j26779k65658j70469l7909r2744k31266
2316.9H63341928k34426j35123j45912k40386k28643p8798K0266r3520k41220k09689
2337.3H61754477n5432J7643J03116N01930P06554K47061m42982q36312p13051l62634
2357.7H60920370j08302M3631L31163O58333O75798M77910M47154O41227O97314N00977
2378.1H65285575L40939L73840M03107J75952j19030r6321J38461J81139J1623p7367
$$ plain form
2398.5 866617918 866640747 866757512 866775870 866658032 866588950 866649628 866690159 866590619 866480231 866531014 866619825
2421 866619825 866500974 866221845 866071463 866191566 866357327 866327226 866238892 866297781 866373718 866249621 866035998
2443.4 866035998 865983546 866057158 866027653 865867794 865789711 865878403 865935743 865813494 865653813 865617275 865610242
2465.8 865610242 865508676 865388274 865362048 865395725 865346849 865176260 865008354 864954650 864973903 864929616 864794314
2488.3 864794314 864674807 864622355 864553273 864420235 864311993 864279747 864248276 864145637 864041328 864038885 864071786
2510.7 864071786 863981009 863768160 863626182 863630354 863598764 863452971 863341033 863336086 863338590 863225639 863028169
2533.1 863028169 862915576 862930179 862907767 862769425 862633169 862586915 862558365 862430632 862257421 862189472
2553.5 862189472 862213135 862155139 861954212 861775637 861730576 861700118 861530602 861285269 861153603 861123323
$$ packed form
2398.5H66617918K2829J16765J8358j17838o9082O0678M0531r9540j10388N0783Q8811
2421H66619825j18851k79129j50382J20103J65761l0101q8334N8889P5937j24097k13623
2443.4H66035998n2452P3612k9505j59859p8083Q8692N7340j22249j59681l6538p033
2465.8H65610242j01566j20402k6226L3677m8876j70589j67906n3704J9253m4287j35302
2488.3H64794314j19507n2452o9082j33038j08242l2246l1471j02639j04309k443L2901
2510.7H64071786r0777k12849j41978M172l1590j45793j11938m947K504j12951j97470
2533.1H63028169j12593J4603k2412j38342j36256m6254k8550j27733j73211o7949
2553.5H62189472K3663n7996k00927j78575m5061l0458j69516k45333j31666l0280
$$ plain form
2573.9 861123323 861023545 860810041 860613763 860523582 860427558 860213935 859980941 859857202 859759629 859547794
2594.3 859547794 859279692 859082282 858944714 858749211 858457446 858191967 858034730 857887030 857651293 857365429
2614.7 857365429 857122064 856921911 856658876 856325209 856053531 855870187 855652750 855377197 855142176 854971290
2635.1 854971290 854780734 854511321 854191244 853901327 853681803 853449702 853152752 852880180 852703214 852544606
2655.5 852544606 852324605 852069139 851819396 851607382 851399064 851133168 850876153 850697219 850511134 850259125
2675.9 850259125 849993765 849747002 849514127 849262297 848983526 848732054 848509014 848260641 847969234 847633600
2696.3 847633600 847310007 847054839 846808493 846518636 846232653 846002996 845753491 845394671 845008433 844696999
2716.7 844696999 844449580 844204724 843920588 843629479 843345284 843001425 842582166 842183709 841925502 841759384
$$ packed form
2573.9H61123323r9778k13504j96278r0181r6024k13623k32994j23739r7573k11835
2594.3H59547794k68102j97410j37568j95503k91765k65479j57237j47700k35737k85864
2614.7H57365429k43365k00153k63035l33667k71678j83344k17437k75553k35021j70886
2635.1H54971290j90556k69413l20077k89917k19524k32101k96950k72572j76966j58608
2655.5H52544606k20001k55466k49743k12014k08318k65896k57015j78934j86085k52009
2675.9H50259125k65360k46763k32875k51830k78771k51472k23040k48373k91407l35634
2696.3H47633600l23593k55168k46346k89857k85983k29657k49505l58820l86238l11434
2716.7H44696999k47419k44856k84136k91109k84195l43859m19259l98457k58207j66118
$$ plain form
2737.1 841759384 841517568 841169298 840832472 840607226 840409279 840094090 839723706 839419901 839134216 838777423
2757.5 838777423 838375568 838033020 837789595 837514639 837111473 836717308 836464643 836211979 835767150 835227013
2777.9 835227013 834803820 834467888 834056437 833604217 833229661 832872629 832387030 831807196 831320822 830896795
2798.3 830896795 830335259 829629600 828940451 828411162 828001201 827483833 826777041 826072037 825502872 824945033
2818.7 824945033 824245811 823469818 822758436 822101593 821373224 820519388 819639146 818791270 817837596 816529512
2839.1 816529512 814794660 812818766 810673416 808375776 806299031 804927409 804263115 803873301 803480148
2857.4 803480148 803039789 802448690 801620305 800575078 799371779 798202872 797236443 796295285 795232296
2875.8 795232296 794286788 793612182 793039203 792378843 791611552 790815890 790003300 789159775 788322568 787445784
$$ packed form
2737.1H41759384k41816l48270l36826k25246j97947l15189l70384l03805k85685l56793
2757.5H38777423m01855l42548k43425k74956m03166l94165k52665k52664m44829n40137
2777.9H35227013m23193l35932m11451m52220l74556l57032m85599n79834m86374m24027
2798.3H30896795n61536p05659o89149n29289m09961n17368p06792p05004n69165n57839
2818.7H24945033o99222p75993p11382o56843p28369q53836q80242q47876r53674j308084
2839.1H16529512j734852j975894k145350k297640k076745j371622o64294l89814l93153
2857.4H03480148m40359n91099q28385j045227j203299j168907r66429r41158j062989
2875.8G95232296r45508o74606n72979o60360p67291p95662q12590q43525q37207q76784
$$ plain form
2896.2 787445784 786449969 785386860 784310222 783197284 782020032 780726433 779238999 777509570
2912.5 777509570 775620282 773780704 772141218 770779312 769854307 769397557 769225717 769190371 769184113
2930.8 769184113 769252360 769581437 770163417 770923197 771972537 773257196 774372637 775013566 775297582
2949.2 775297582 775535345 775697887 775614083 775476456 775552571 775808513 776035130 776198804 776417017 776736200
2969.6 776736200 777149737 777567327 777917564 778345227 778875947 779225171 779356360 779552698 779922962 780381203
2990 780381203 780719876 780766726 780660689 780445158 780007720 779516935 779128909 778777957 778425753 778085828
3010.4 778085828 777707458 777197182 776476860 775562525 774582505 773707449 772944868 772111177 771257997 770553529
3030.8 770553529 769928098 769143224 768123984 767183065 766444683 765624464 764523327 763262630 762161613
$$ packed form
2896.2G87445784r95815j063109j076638j112938j177252j293599j487434j729429
2912.5G77509570j889288j839578j639486j361906r25005m56750j71840l5346o258
2930.8G69184113O8247L29077N81980P59780J049340J284659J115441O40929K84016
2949.2G75297582K37763J62542q3804j37627P6115K55942K26617J63674K18213L19183
2969.6G76736200M13537M17590L50237M27663N30720L49224J31189J96338L70264M58241
2990G80381203L38673M6850j06037k15531m37438m90785l88026l50952l52204l39925
3010.4G78085828l78370n10276p20322r14335r80020q75056p62581q33691q53180p04468
3030.8G70553529o25431p84874j019240r40919p38382q20219j101137j260697j101017
$$ plain form
3049.1 762161613 761245608 760258257 759162664 758030891 756924272 755949557 755077302 754227161 753296256
3067.5 753296256 752194047 751048148 750041902 749247611 748559833 747732580 746707857 745606899 744489431
3085.8 744489431 743419051 742360413 741152763 739873290 738760352 737823069 736827433 735631764 734407365
3104.2 734407365 733334005 732270956 731032491 729825199 728871584 727904320 726636589 725119710 723519981
3122.6 723519981 721968591 720509052 719148695 717809021 716357231 714851081 713457108 712123454
3138.9 712123454 710604191 708873928 707139552 705536127 704147935 702871084 701319039 699423373
3155.2 699423373 697558284 695845962 694126964 692337751 690537035 688787758 687053025 685280859
3171.5 685280859 683494031 681734681 679960370 678118885 676265836 674449086 672646284 670831859
$$ packed form
3049.1G62161613r16005r87351j095593j131773j106619r74715q72255q50141r30905
3067.5G53296256j102209j145899j006246p94291o87778q27253j024723j100958j117468
3085.8G44489431j070380j058638j207650j279473j112938r37283r95636j195669j224399
3104.2G34407365j073360j063049j238465j207292r53615r67264j267731j516879j599729
3122.6G23519981j551390j459539j360357j339674j451790j506150j393973j333654
3138.9G12123454j519263j730263j734376j603425j388192j276851j552045j895666
3155.2F99423373j865089j712322j718998j789213j800716j749277j734733j772166
3171.5F85280859j786828j759350j774311j841485j853049j816750j802802j814425
$$ plain form
3187.8 670831859 668995440 667149663 665298283 663401961 661478281 659593880 657754660 655928314
3204.1 655928314 654098272 652260244 650451362 648705423 646953166 645163834 643385053 641599238
3220.5 641599238 639807642 638030708 636250019 634517848 632918417 631383121 629707515 627898872
3236.8 627898872 626158953 624541640 623035610 621638477 620210230 618635297 617064297 615667582
3253.1 615667582 614376903 613032043 611620307 610238433 608893394 607578635 606363356 605243623
3269.4 605243623 604036570 602624416 601103544 599605083 598173797 596725345 595216632 593730569
3285.7 593730569 592309535 590944946 589585423 588125587 586501062 584717631 582895994 581232846
3302 581232846 579734266 578141570 576214850 573989093 571718991 569589853 567524135 565386355 563243926
$$ packed form
3187.8F70831859j836419j845777j851380j896322j923680j884401j839220j826346
3204.1F55928314j830042j838028j808882j745939j752257j789332j778781j785815
3220.5F41599238j791596j776934j780689j732171j599431j535296j675606j808643
3236.8F27898872j739919j617313j506030j397133j428247j574933j571000j396715
3253.1F15667582j290679j344860j411736j381874j345039j314759j215279j119733
3269.4F05243623j207053j412154j520872j498461j431286j448452j508713j486063
3285.7E93730569j421034j364589j359523j459836j624525j783431j821637j663148
3302E81232846j498580j592696j926720k225757k270102k129138k065718k137780k142429
$$ plain form
3320.4 563243926 561208606 559157014 556879878 554431915 552009583 549674273 547432959 545243263
3336.7 545243263 542912722 540380001 537767112 535109997 532559335 530255914 527871251 525111377
3353 525111377 522213221 519526184 517087162 514636815 512126505 509822726 507644176 505212784 502466559
3371.4 502466559 499786496 497466654 495325536 493173301 491036177 489027381 487270921 485820502
3387.7 485820502 484648347 483424246 481835753 480218321 479054540 478159487 476962626 475427955
3404 475427955 474068612 473059773 472199887 471370608 470494241 469582945 468851715 468348086 467914760 467645526
3424.4 467645526 467693150 467953712 468224585 468559623 469067603 469454259 469507456 469611585 470132411 470987439
3444.8 470987439 471962094 472916782 473947883 475140303 476443976 477927953 479593009 481162667 482687205
$$ packed form
3320.4E63243926k035320k051592k277136k447963k422332k335310k241314k189696
3336.7E45243263k330541k532721k612889k657115k550662k303421k384663k759874
3353E25111377k898156k687037k439022k450347k510310k303779k178550k431392k746225
3371.4E02466559k680063k319842k141118k152235k137124k008796j756460j450419
3387.7D85820502j172155j224101j588493j617432j163781q95053j196861j534671
3404D75427955j359343j008839q59886q29279q76367r11296p31230n03629m33326k69234
3424.4D67645526M7624K60562K70873L35038N07980L86656N3197J04129N20826Q55028
3444.8D70987439R74655R54688J031101J192420J303673J483977J665056J569658J524538
$$ plain form
3463.2 482687205 484580874 486722499 488508821 489756405 491020888 492719859 494762301 496849716
3479.5 496849716 498663276 500382364 502399683 504506946 506436050 508430898 510658443 512963235
3495.8 512963235 515103996 517193556 519471467 521597743 523370981 525297999 527659178 530235589
3512.1 530235589 532663226 534822762 536999583 539450228 542194605 544824541 547125578 549505234
3528.4 549505234 552124083 554823756 557675064 560612142 563347161 566129029 569277406 572576761
3544.7 572576761 575521231 578151703 581047773 584254384 587411940 590572059 593939841 597283125
3561.1 597283125 600303471 603581905 607849896 612100005 615627527 619099021 622893631 626881599
3577.4 626881599 630986631 635145009 639179647 643367410 647979140 652388692 656406581 660661042
$$ packed form
3463.2D82687205J893669K141625J786322J247584J264483J698971K042442K087415
3479.5D96849716J813560J719088K017319K107263J929104J994848K227545K304792
3495.8E12963235K140761K089560K277911K126276J773238J927018K361179K576411
3512.1E30235589K427637K159536K176821K450645K744377K629936K301037K379656
3528.4E49505234K618849K699673K851308K937078K735019K781868L148377L299355
3544.7E72576761K944470K630472K896070L206611L157556L160119L367782L343284
3561.1E97283125L020346L278434M267991M250109L527522L471494L794610L987968
3577.4F26881599M105032M158378M034638M187763M611730M409552M017889M254461
$$ plain form
3593.7 660661042 665208578 669798255 674430907 678870916 682889283 686861336 691330373 695993423
3610 695993423 700553417 704964638 709085941 713751614 718966067 723137021 726200700 729381084 734141231
3628.4 734141231 739473164 743511915 747196019 750860631 754346192 757710218 760697067 763202906
3644.7 763202906 765991151 770206988 774525404 777115345 779348552 782345057 785241365 787435293
3661 787435293 789166808 790619433 791994095 793855071 795931816 797396541 799148917 801203609 802718461
3679.4 802718461 803994656 805052936 805889964 807096362 808877528 810366213 811394393 812273443 812984943
3697.7 812984943 813644111 814577520 815528512 816077590 816381574 816923320 818031073 819027126 819468856
3716.1 819468856 819695175 819973707 820302010 820707381 821237206 821542263 821489751 821598709 822345197 823469877
$$ packed form
3593.7F60661042M547536M589677M632652M440009M018367L972053M469037M663050
3610F95993423M559994M411221M121303M665673N214453M170954L063679L180384M760147
3628.4G34141231N331933M038751L684104L664612L485561L364026K986849K505839
3644.7G63202906K788245M215837M318416K589941K233207K996505K896308K193928
3661G87435293J731515J452625J374662J860976K076745J464725J752376K054692J514852
3679.4H02718461J276195J058280Q37028J206398J781166J488685J028180Q79050P11500
3697.7H12984943O59168R33409R50992N49078L03984N41746J107753R96053M41730
3716.1H19468856K26319K78532L28303M05371N29825L05057n2512J08958P46488J124680
$$ plain form
3736.5 823469877 824108243 823886037 823424578 823703587 824193656 824216485 824660003 825548470 825966895 826051295
3756.9 826051295 826386690 826898456 827067554 827040553 827119887 827389657 827816784 828127146 828230083 828372955
3777.3 828372955 828695238 828863800 828796268 828863621 829090834 829276502 829299986 829117060 828981638 828947723
3797.7 828947723 828859925 829038024 829292834 829451263 829889715 830165923 829931319 829621613 829697549 829749584
3818 829749584 829695940 830068707 830354214 830373347 830331326 830199182 830076635 829999387 829926491 829951942 830127895
3840.5 830127895 830441296 830798328 830821872 830302954 829412460 829010010 829889774 830592930 830592215 830330253
3860.9 830330253 830122948 830076516 829967976 829913735 830129027 830355346 830513299 830478430 830367684 830431700
3881.3 830431700 830516398 830707788 830750287 830455959 830415070 830608428 830492139 830120742 829791963 829745412
$$ packed form
3736.5H23469877O38366k22206m61459K79009M90069K2829M43518Q88467M18425Q4400
3756.9H26051295L35395N11766J69098k7001P9334K69770M27127L10362J02937J42872
3777.3H28372955L22283J68562o7532O7353K27213J85668K3484j82926j35422l3915
3797.7H28947723q7798J78099K54810J58429M38452K76208k34604l09706P5936N2035
3818H29749584n3644L72767K85507J9133m2021j32144j22547p7248p2896K5451J75953
3840.5H30127895L13401L57032K3544n18918q90494m02450Q79764P03156p15k61962
3860.9H30330253k07305m6432j08540n4241K15292K26319J57953l4869j10746O4016
3881.3H30431700Q4698J91390M2499k94328m0889J93358j16289l71397l28779m6551
$$ plain form
3901.7 829745412 830032468 830353618 830429554 830360651 830283523 830159187 830059409 830135107 830232382 830191851 830158174
3924.1 830158174 830192029 830178857 830186009 830363691 830572963 830603182 830485463 830353498 830318213 830333591 830319524
3946.5 830319524 830354273 830442488 830448091 830383003 830385566 830411196 830390334 830398619 830410838 830383122 830370486 830412328
3971 830412328 830506146 830606103 830637991 830591440 830604076 830749214 830843866 830747962 830610752 830628455 830766141
3993.4 830766141 830879867 830923438
3997.5 830923438
$$ packed form
3901.7H29745412K87056L21150P5936o8903p7128j24336r9778P5698R7275m0531l3677
3924.1H30158174L3855j3172P152J77682K09272L0219j17719j31965l5285J5378j4067
3946.5H30319524L4749Q8215N603o5088K563K5630k0862Q285J2219k7716j2636M1842
3971H30412328R3818R9957L1888m6551J2636J45138R4652r5904j37210J7703J37686
3993.4H30766141J13726M3571
3997.5H30923438
##END=$$ End of the data block
