##TITLE=$$ Begin of the data block
##JCAMP-DX=5.00 $$ ACD/SpecManager v 10.08
##SPECTROMETER/DATA SYSTEM=Alpha
##DATE=09 Apr 2014 11:14:46
##DATA TYPE=INFRARED SPECTRUM
##DATA CLASS=XYDATA
##ORIGIN=
##OWNER=
##NPOINTS=1765
##FIRSTX=399.75695801
##LASTX=3997.56933594
##MAXX=3997.56933594
##MINX=399.75695801
##MAXY=0.86957598
##MINY=0.46757662
##XFACTOR=1.0000000000
##YFACTOR=1.000000000000000e-9
##FIRSTY=0.72835690
##DELTAX=2.03957629
##XUNITS=1/CM
##YUNITS=ARBITRARY UNITS
##XYDATA=(X++(Y..Y))
399.8 728356898 728375077 728727758 729480684 729424298 728398085 728130162 728832126 728803217 727530122 726662159
420.2 726662159 727083027 727032185 726012409 725833833 727043450 727561414 726374447 725228310 725239277
438.5 725239277 725420773 724999785 724515140 724838972 725501597 725113988 723758280 723065078 723314583 723258018
458.9 723258018 722604096 722185671 722365439 722213745 720896721 719664097 719959378 720547616 719845951
477.3 719845951 718508780 717954874 718392015 718601286 717995882 717657447 718071282 718170702 717383862 716602683
497.7 716602683 716515005 716472626 715669811 714678407 714499414 714808524 714387417 713137567 712240577 712117434
518.1 712117434 711747408 710699320 709773421 709597588 709585726 708769083 707532585 707059324 707336724 707367659
538.4 707367659 706962109 706684291 706621826 706318974 705637634 705126703 705110610 705082178 704572260 703810453
558.8 703810453 703340948 703063309 702213764 700877964 700007558 699671626 699130118 698157370 697232485 696849525
579.2 696849525 696709394 696088195 695123851 694689333 694862664 694847703 694256902 693659604 693598390 693492591
599.6 693492591 692539871 691187024 690394163 690122962 689523935 688413501 687792480 688292444 689208865
618 689208865 689943433 691260338 693817258 696664095 698652864 700183809 702320695 704872131 706703722
636.3 706703722 707660079 708865881 710742116 712224960 712830842 713628411 715409696 717139423 717638910
654.7 717638910 717942238 719781756 722608328 724534392 725109041 725936055 728730679 731011212 731883407
673.1 731883407 732897758 734909296 737011790 737983048 738450408 739822388 741785824 742796838 742818952
691.4 742818952 743386507 744866788 745869637 745773792 745830595 747054994 748615324 749382079 749863744
709.8 749863744 751203060 753114223 754339337 754834116 755848169 757753491 759386599 760158062 760975718
728.1 760975718 762592852 764248788 764975011 765286624 766178668 767551541 768597782 769228935 770185709
746.5 770185709 771684527 773008645 773731589 774424314 775715888 777185082 778017581 778411090 779152334
764.8 779152334 780275762 781119347 781447053 781663239 782086134 782433033 782198608 781588316 781267405 781272948
785.2 781272948 781164348 781069815 781662643 783211410 785280704 787468314 789933026 792905152 796057522
803.6 796057522 798756838 800913095 802944064 804906964 806369960 807126880 807472050 807715416 807671547
821.9 807671547 806835949 805199206 803383648 801744759 800017416 798018754 796087325 794591308 793370366
840.3 793370366 792015731 790604174 789742887 789795339 790579021 792020142 794518888 798231304 802509069
858.7 802509069 806627810 810574234 814649224 818659306 821936071 824266613 826169789 827970743
875 827970743 829373062 830040872 830130935 829989254 829555213 828587592 827210069 825883865 824930370 824293911
895.4 824293911 823914587 824047267 824873447 825996935 826835275 827309310 827609539 827580512 826812923 825243831
915.8 825243831 823327303 821539700 819926322 818360567 817152321 816820085 817257345 817779660 817995667
934.1 817995667 818183661 818616033 818928361 818693042 818155408 817753434 817261219 816060960 814088821
952.5 814088821 811840296 809476256 806490421 802497745 797852278 792957962 787553310 781310201
968.8 781310201 774670959 768542767 763312817 758647323 754323840 750659823 747848153 745393932
985.1 745393932 742749333 740181625 738308311 737026930 735719740 734317005 733337045 732894242 732338727
1003.5 732338727 731121719 729471266 727756143 725716710 722965062 719872773 717263579 715217829
1019.8 715217829 713076711 710657537 708485544 706879556 705384135 703538060 701764107 700601399
1036.1 700601399 699750245 698632121 697299182 696257651 695539057 694624901 693425477 692533493 692382634
1054.5 692382634 692731261 693145514 693663657 694486320 695201218 695076704 693986475 692509770 691091061
1072.8 691091061 689578354 687824488 686186194 685043931 684111953 682848036 681285381 679859936
1089.1 679859936 678735852 677728891 676758647 676041901 675735235 675617635 675361872 674980998 674734950
1107.5 674734950 674605429 674311101 673768401 673130870 672428668 671400249 669909120 668349624 667068541
1125.8 667068541 666303635 666868985 668713093 670563757 672037303 673427999 674669206 675751448 676867545
1144.2 676867545 677979231 678823948 679405391 680112958 681246459 682616889 683960676 685540795 687825501
1162.6 687825501 690758765 693886518 697147667 700945437 705281913 709518552 713294804 716970980
1178.9 716970980 720852494 724576771 727597654 729959190 732064188 733816385 734742105 734894574 734950840
1197.2 734950840 735331357 735781252 736059189 736483634 737335205 738228559 738627434 738615811 738663137 738834083
1217.6 738834083 738764942 738429129 738294780 738591492 738993108 739182949 739384174 739992201 740861893 741542757
1238 741542757 742049336 742740214 743620336 744280338 744515538 744631469 744917989 745217323 745289981 745333552
1258.4 745333552 745786250 746703684 747786701 748944104 750398993 752286196 754359961 756313205 758267105
1276.8 758267105 760479987 762821257 764979720 766982079 769142389 771552384 773904800 775913894
1293.1 775913894 777706444 779509127 781202972 782517612 783467412 784355462 785322547 786107957 786475122
1311.4 786475122 786672175 787086308 787664831 788078606 788348377 788848102 789637089 790306985 790585756 790717125
1331.8 790717125 790937006 791034639 790760696 790378988 790351629 790577054 790629625 790437639 790368736 790538728
1352.2 790538728 790544510 790123403 789570034 789182901 788748503 787881613 786772192 785826802 785069823 784025311
1372.6 784025311 782358408 780366480 777570426 772429407 766045332 763269603 766495526 771428883
1388.9 771428883 773832381 774358988 774224699 773802459 772880733 771472454 770031214 768788815 767677724
1407.3 767677724 766473413 765271068 764419496 763891757 763342977 762663662 762275815 762296736 762347043 762209952
1427.7 762209952 762070179 762181938 762505352 762940645 763522208 764298201 765291870 766258597 767158628 768323421
1448.1 768323421 769785583 771217585 772619903 774890900 778476775 781438172 783795476 786502600
1464.4 786502600 789525568 792304695 795242310 799052298 802997053 806245029 808842063 810821593
1480.7 810821593 812272787 813235581 813832641 813945234 813414097 812635422 811737716 810393095 808621466
1499.1 808621466 806812525 805105686 802911758 799247384 796003103 793685675 791447520 789150834
1515.4 789150834 786848068 784907520 783209920 781632841 780124784 778483510 777058601 775822878
1531.7 775822878 774353027 772915721 771786571 770694375 769816160 769349158 769080341 769069672 769317806
1550.1 769317806 769627094 769815087 769942999 770387411 770926654 770867348 770471990 769856930 768848360 767227650
1570.5 767227650 765459418 763548672 760852158 757982969 755248487 752206445 748902738 745312512
1586.8 745312512 741390109 737253785 733048260 728690386 724187613 719673574 715142250 710557163
1603.1 710557163 705958545 701304257 696518779 691814065 687389374 682679772 677369773 673272729
1619.4 673272729 670069158 666492224 663020253 660008848 657385349 655521929 654397428 653932512
1635.7 653932512 654231429 655082881 656409860 658153117 660917938 664476514 667110503 670467377 676167905
1654.1 676167905 680172145 683120549 686553836 690786839 695088685 698609352 702551365 707372189
1670.4 707372189 711570144 715912104 720773578 724912822 728557050 732901692 739103138 744438887
1686.7 744438887 748651862 753082395 757126808 761685371 767039955 772631049 779361606 784792602
1703 784792602 789324284 794080257 798114657 801521480 804622769 807692945 811205268 814397931 816735864
1721.4 816735864 818849862 820933521 822818816 824605942 826269388 828239620 830312550 831855536
1737.7 831855536 833476007 835310638 837074041 838710904 840261519 841914296 843615413 844979525
1754 844979525 846131980 847218156 848201275 849252045 850218296 850940108 851570666 852240324 853043675
1772.4 853043675 853885949 854584992 855250835 855927825 856523216 857053936 857591987 858100712 858531296 858989358
1792.8 858989358 859516561 860027313 860455871 860855758 861297667 861753762 862162769 862469971 862722754 863031089
1813.2 863031089 863389850 863688529 863933623 864191592 864512146 864861786 865085721 865202248 865426660 865761399
1833.6 865761399 866026461 866190135 866366625 866582036 866746247 866874993 867051303 867305279 867560327 867718637
1854 867718637 867817760 867945254 868132055 868280172 868325531 868313611 868350446 868513405 868674278 868770719 868915975
1876.4 868915975 869098723 869156897 869112849 869138658 869231164 869257390 869245231 869284272 869381905 869504154 869564354
1898.8 869564354 869552553 869542420 869556069 869530499 869462729 869460642 869542003 869575977 869493008 869395733 869368792 869397640
1923.3 869397640 869426429 869396448 869332492 869287848 869229615 869126678 869053423 868994772 868866324 868726254 868647575
1945.7 868647575 868604422 868553340 868458688 868317366 868168890 868023932 867883205 867762923 867627501 867460012
1966.1 867460012 867333114 867257595 867138386 866969943 866838992 866753399 866657138 866533279 866405249 866295338
1986.5 866295338 866188824 866047502 865871668 865708172 865600288 865521312 865385056 865215182 865103662 865014970
2006.9 865014970 864872754 864674032 864495456 864397228 864308000 864130795 863923848 863807321 863756299 863639176
2027.3 863639176 863412380 863224685 863163412 863093972 862943172 862832129 862834156 862822592 862664402 862441897
2047.7 862441897 862344325 862358987 862304986 862154543 862078071 862133622 862132788 861950815 861772180 861796379 861883461
2070.2 861883461 861822903 861691236 861705542 861851156 861887872 861734748 861630023 861719906 861791849 861694276 861595392
2092.6 861595392 861682534 861848652 861850679 861693323 861664414 861858845 861998022 861938536 861870825 861965537 862098694
2115 862098694 862063110 861962676 862047732 862245858 862294197 862186968 862158835 862323761 862487376 862467885 862428069
2137.5 862428069 862577617 862785518 862822592 862764657 862861991 863099992 863218665 863150656 863118947 863265038
2157.9 863265038 863433599 863476455 863475084 863570035 863747597 863847017 863830388 863868833 864049554 864216328 864241719
2180.3 864241719 864231110 864334762 864509523 864574015 864518583 864545524 864688575 864775062 864755094 864753067 864865541
2202.7 864865541 864999890 864999115 864911675 864926398 865060627 865132630 865072370 865028143 865121305 865249038 865244508
2225.2 865244508 865148902 865144789 865242898 865263164 865175962 865146816 865232289 865304708 865262091 865185618 865222633 865317941
2249.6 865317941 865309715 865231335 865208089 865283668 865353227 865257263 865108967 865119517 865219057 865248740 865225673
2272.1 865225673 865266383 865384340 865441501 865365744 865286231 865326226 865403354 865371883 865243018 865169048 865186036
2294.5 865186036 865144670 865011632 864936709 864990592 865034759 864900947 864657938 864537001 864549577 864480078 864252329
2316.9 864252329 863999009 863834739 863692462 863462329 863190472 863065183 863077819 862979949 862760007 862643540
2337.3 862643540 862699986 862733841 862798572 863268375 863918066 864151835 863768458 862957120 862178445 861774683
2357.7 861774683 861679018 861718178 862057388 862769306 863473177 863905013 864281118 864880800 865582943 866099536
2378.1 866099536 866428018 866796196 867229223 867444694 867363989 867295980 867421150 867554843 867528319 867462039
2398.5 867462039 867537200 867677331 867680490 867563605 867509484 867578566 867621362 867516577 867394924 867439210 867537737
2421 867537737 867403567 867069721 866911590 867059588 867204607 867150843 867078602 867146075 867224634 867117107 866902173
2443.4 866902173 866836548 866909623 866890430 866759360 866705596 866760790 866757274 866641819 866528511 866500139 866487324
2465.8 866487324 866386771 866262376 866232812 866271794 866244018 866106570 865950584 865867853 865847409 865774393 865643620
2488.3 865643620 865581512 865580261 865521550 865381777 865263939 865259707 865281165 865165889 864985585 864919960 864924908
2510.7 864924908 864842594 864673436 864571691 864589393 864574432 864431560 864291131 864268780 864263356 864139378 863937080
2533.1 863937080 863835871 863879025 863874495 863730729 863565743 863480806 863460600 863386214 863235593 863158345 863158286
2555.6 863158286 863075078 862881124 862714231 862675130 862648249 862461746 862214983 862126708 862124383 861994267 861752391
2578 861752391 861570477 861492753 861403942 861210406 860965908 860807836 860719204 860539675 860240459 859989464
2598.4 859989464 859890223 859750330 859417439 859081745 858916879 858809292 858578205 858245313 857995868 857852459
2618.8 857852459 857642591 857342005 857096195 856922865 856696665 856400311 856126845 855920911 855734587 855480790
2639.2 855480790 855152071 854848862 854639649 854447722 854204416 853948116 853726745 853515208 853262365 852996588
2659.6 852996588 852774262 852603555 852407813 852128863 851873457 851708055 851506889 851225019 850964248 850743175
2680 850743175 850524783 850264847 849953890 849676549 849467516 849253118 848967314 848620713 848303020 848062038
2700.4 848062038 847828746 847560585 847285986 847027302 846752465 846398652 846018016 845714092 845488310 845258951
2720.8 845258951 844972432 844686806 844417274 844082832 843679130 843290210 843026698 842862189 842605233 842226207
2741.2 842226207 841904402 841711819 841502428 841147900 840737224 840422094 840179026 839864016 839430571 839008868
2761.6 839008868 838722229 838464260 838106513 837760925 837546825 837329566 836903274 836350501 835916698 835584819
2782 835584819 835176051 834724486 834356964 833995461 833494782 832919240 832444608 832019806 831463397 830785990
2802.3 830785990 830119431 829577982 829132617 828583360 827884257 827202618 826616049 826031327 825328350 824561119
2822.7 824561119 823875725 823234141 822492301 821627975 820756912 819920063 818955898 817635596 815926611
2841.1 815926611 813983202 811828673 809511125 807436228 806073248 805417597 805022538 804603100 804143667
2859.5 804143667 803557873 802750170 801708817 800493717 799326718 798380852 797480404 796457827 795529187
2877.8 795529187 794836521 794210434 793518484 792762876 791998327 791217029 790351629 789466739 788592160 787610948
2898.2 787610948 786541879 785466611 784354270 783191621 781923652 780407667 778625309 776744187
2914.5 776744187 774962604 773352683 771973789 771013856 770514190 770332456 770322978 770330250 770421684 770789027
2934.9 770789027 771396160 772199869 773285627 774537206 775593281 776217341 776546955 776822984 776945770
2953.3 776945770 776823223 776710749 776811659 777081668 777338445 777521431 777751863 778083086 778509438 778959751
2973.7 778959751 779336274 779729664 780188203 780511379 780673504 780904770 781291306 781747460 782089472 782165885
2994.1 782165885 782081068 781858444 781404138 780901253 780478776 780057847 779688776 779418707 779100716 778583646
3014.5 778583646 777852178 776978016 776068449 775228918 774422348 773526847 772666454 771995544 771382332 770570815
3034.9 770570815 769523680 768557727 767800808 766999006 765956104 764770269 763726711 762830615 761826634
3053.2 761826634 760688663 759522915 758401692 757410586 756509006 755643368 754753172 753714323 752602398
3071.6 752602398 751586080 750753224 750052631 749229550 748180985 747078717 746004939 744944155 743843436
3089.9 743843436 742610276 741369188 740305066 739368975 738353670 737144113 735928178 734888732
3106.2 734888732 733868778 732636571 731373012 730374217 729419768 728192687 726685464 725033760 723435938
3124.6 723435938 721987844 720635712 719261765 717784703 716290891 714932799 713615417 712094784
3140.9 712094784 710404456 708726525 707147539 705748796 704446614 702888191 700997651 699119925
3157.2 699119925 697372913 695618451 693824530 692032576 690279603 688544750 686774969 685000479
3173.5 685000479 683260143 681478083 679611683 677745342 675926983 674119711 672306180 670468271
3189.9 670468271 668590486 666701376 664796889 662876785 660992861 659170985 657350659 655493557
3206.2 655493557 653638780 651819110 650040090 648273528 646509588 644750535 642951667 641094625
3222.5 641094625 639234185 637448668 635771334 634164870 632568300 630872488 629051626 627272069
3238.8 627272069 625667393 624233603 622866213 621426642 619877100 618303776 616825640 615474403
3255.1 615474403 614151299 612788498 611425161 610068202 608716249 607457578 606338799 605164170
3271.4 605164170 603754580 602211654 600684762 599196374 597691536 596182942 594727218 593303502
3287.8 593303502 591919243 590551376 589076638 587433875 585628986 583792925 582150042 580654442
3304.1 580654442 579013824 577070892 574903786 572683573 570515931 568388522 566278338 564204812
3320.4 564204812 562183917 560116589 557802737 555276096 552783608 550424755 548167586 545951307
3336.7 545951307 543610156 541067779 538446128 535794735 533209443 530825496 528380215 525586843
3353 525586843 522670746 519965410 517484009 514998972 512466550 510128796 507936478 505524993 502776682
3371.4 502776682 500008285 497556716 495377392 493285477 491192728 489182502 487384468 485868961
3387.7 485868961 484662712 483430147 481822431 480177194 478987068 478067219 476831824 475261718
3404 475261718 473940730 473041654 472252041 471404672 470462441 469485909 468744725 468270242 467849135 467576623
3424.4 467576623 467625767 467900574 468149275 468403339 468847573 469261318 469404846 469536990 469992250 470791131
3444.8 470791131 471792251 472824097 473882258 475045383 476340622 477848321 479550660 481148809
3461.1 481148809 482672513 484580964 486740351 488501340 489753574 491063654 492778540 494833738
3477.4 494833738 496960312 498792440 500484228 502478838 504594564 506544530 508562565 510798335
3493.8 510798335 513114274 515296996 517407298 519661367 521780729 523583889 525573373 528015018
3510.1 528015018 530630767 533079386 535277486 537438631 539829850 542575717 545238316 547548413
3526.4 547548413 549964547 552652895 555415988 558315217 561266899 563999832 566778839 569911778
3542.7 569911778 573230565 576274931 579019189 581930578 585075140 588190615 591340065 594719052
3559 594719052 598099232 601206124 604575694 608851850 613116562 616694510 620167017 623941958 627982080
3577.4 627982080 632201076 636429131 640493870 644723117 649315000 653668642 657687604 661949754
3593.7 661949754 666502833 671142757 675875187 680441260 684543073 688550532 693053365 697709739
3610 697709739 702209175 706613779 710816562 715527713 720736086 724968493 728121281 731337368 736096144
3628.4 736096144 741390049 745378077 749075472 752804041 756345809 759752989 762778044 765288353
3644.7 765288353 767998993 772086263 776389539 779073775 781385303 784416854 787316680 789517879
3661 789517879 791302264 792806506 794168770 795944214 797945440 799412787 801144183 803154707 804669976
3679.4 804669976 805960298 807078838 808015108 809245825 810954273 812401354 813429713 814321578 815054834
3697.7 815054834 815709352 816612422 817565918 818134069 818428695 818958700 820046842 821023464 821504414
3716.1 821504414 821809590 822127521 822474360 822943330 823485851 823756874 823711395 823768914 824381173 825465977
3736.5 825465977 826154947 825970531 825440347 825526059 825921357 825964093 826489449 827530980 828054130 828182280
3756.9 828182280 828511238 828987420 829169512 829169273 829238236 829493523 829892516 830163538 830253065 830410957
3777.3 830410957 830763340 830933988 830847621 830913305 831160605 831399679 831460953 831288218 831191540 831182420 831044972
3799.7 831044972 831164241 831436336 831581950 831917524 832125247 831931353 831709325 831801832 831842363 831767082
3820.1 831767082 832066596 832354307 832428873 832417130 832289934 832139432 832048833 832013547 832036734 832171440
3840.5 832171440 832508266 832943439 832998455 832430065 831513703 831153929 832011998 832667828 832674265 832429767
3860.9 832429767 832232833 832247257 832211554 832122087 832279623 832559526 832764745 832715988 832562625 832564354 832601547
3883.3 832601547 832759678 832823634 832609594 832609892 832788467 832667649 832332194 832041204 831930339 832139015
3903.7 832139015 832524717 832696021 832669735 832624197 832527280 832414389 832399845 832390189 832331359 832371175 832492113
3926.1 832492113 832473218 832400203 832541764 832730293 832692802 832530737 832426608 832484782 832609355 832642317
3946.5 832642317 832650185 832642674 832555830 832521737 832618356 832700551 832695901 832683861 832680821 832653403 832658648 832717955
3971 832717955 832781732 832860827 832906842 832883298 832927585 833075523 833147764 833059490 832958937 832988441 833088279
3993.4 833088279 833174825 833246171
3997.5 833246171
##END=$$ End of the data block
