##TITLE=$$ Begin of the data block
##JCAMP-DX=5.00 $$ ACD/SpecManager v 10.08
##SPECTROMETER/DATA SYSTEM=Alpha
##DATE=09 Apr 2014 11:14:46
##DATA TYPE=INFRARED SPECTRUM
##DATA CLASS=XYDATA
##ORIGIN=
##OWNER=
##NPOINTS=1765
##FIRSTX=399.75695801
##LASTX=3997.56933594
##MAXX=3997.56933594
##MINX=399.75695801
##MAXY=0.87009627
##MINY=0.46751189
##XFACTOR=1.0000000000
##YFACTOR=1.000000000000000e-9
##FIRSTY=0.72737634
##DELTAX=2.03957629
##XUNITS=1/CM
##YUNITS=ARBITRARY UNITS
##XYDATA=(X++(Y..Y))
399.8G27376342O18100M73022M07398m31359j155197k89619Q19742K67923j233399
418.1G26852953j026511M69029R1374q57413l50892P04527L98695q43882r74179k5391
438.5G24438310M17292n7817n66661J19N39780l25620j187683o11126K87712R8228
458.9G23032534p90775p31229J64687m77j275062j393140J8120M84884n42820r73880
479.3G17992842q3387O24478l1829p69198l10242L61085k6166r48608q58009M2796
499.7G15993762Q0049q12590j001954k11895J32382n96106j152932o93441m8458l30210
520.1G11358607r88662q17478j34885j56105q94427j101792l02434K86460k41578o85572
540.5G06322134j94312M9293m23610p05123k87533K29180L9697o58989j054764o66499
$$ plain form
399.8 727376342 727994442 728467464 728874862 728443503 727288306 726998687 727818429 728086352 726852953
418.1 726852953 725826442 726295471 726386845 725529432 725178540 725883067 726281762 725437880 724463701 724438310
438.5 724438310 724855602 724797785 724231124 724231243 724771023 724445403 723257720 722646594 722934306 723032534
458.9 723032534 722241759 721510530 721675217 721674740 720399678 719006538 719024658 719509542 718966722 717992842
479.3 717992842 717909455 718533933 718502104 717732906 717422664 717783749 717757583 716808975 715950966 715993762
499.7 715993762 716073811 715261221 714259267 714047372 714179754 713583648 712430716 711737275 711688817 711358607
520.1 711358607 710369945 709552467 709417582 709261477 708367050 707265258 706962824 707249284 707007706 706322134
540.5 706322134 706127822 706177115 705753505 705048382 704760849 704990029 705029726 704370737 703315973 702649474
560.9G02649474j21355m09365j177013j196086n22017l72887r15408j053572m89890
579.2F96391881k43068o65367r35972l78489K41101j9491o42002n71191l040j09851
599.6F93064511r59993j369953q38279k46943m83930r82880n03898N74052R88067Q88705
620F90129459J346946K442956K821028J957238J403391K056897K486288J733422R74477
638.4G07352102J277566J868725J493454O85334R12905J857936J725435M87566K39372
656.7G17900395J759708K871335J992524N59568P66993K832412K420366R18090R71079
675.1G32992470K019048K159834R57131M84169J504004J988649Q86262j6272O33597
693.5G43608892J506269J010776r716J44064J199842J491725P57277N23806J329243
$$ plain form
560.9 702649474 702528119 702118754 700941741 699745655 699223638 698850751 697935343 696881771 696391881
579.2 696391881 696148813 695483446 694547474 694168985 694410086 694390595 693748593 693177402 693174362 693064511
599.6 693064511 692104518 690734565 689896286 689649343 689165413 688182533 687678635 688252687 689240754 690129459
620 690129459 691476405 693919361 696740389 698697627 700101018 702157915 704644203 706377625 707352102
638.4 707352102 708629668 710498393 711991847 712677181 713590086 715448022 717173457 717661023 717900395
656.7 717900395 719660103 722531438 724523962 725083530 725850523 728682935 731103301 732021391 732992470
675.1 732992470 735011518 737171352 738128483 738612652 740116656 742105305 742991567 742975295 743608892
693.5 743608892 745115161 746125937 746116221 746260285 747460127 748951852 749709129 750232935 751562178
711.8G51562178J822829J179934N50568J086295J888036J532495O67572P94590J710117
730.2G62794614J788854P92146L00467R27866J462280J060427O01411R63807J521170
748.5G72213042J294255O05464N92113J260340J442492Q54909N05209Q08895J066863
766.9G80643582P73430L43621K69115M02689K78830k37405n89847m01199j05858j06335
787.3G81270623l0160O64234J627207K094865K161086K422750K918958L142834K789795
805.6G99062192K224446J967668J893521J473486P85112L86596K74480j07825r45151
824H07014525j669526j765251j583577j670897j936912j937211j519084j209020j382768
842.3G92340279j416266p81417R2745P46965J404762K478719L669381M211486M106581
$$ plain form
711.8 751562178 753385007 754564941 755115509 756201804 758089840 759622335 760289907 761084497 762794614
730.2 762794614 764583468 765375614 765676081 766603947 768066227 769126654 769728065 770691872 772213042
748.5 772213042 773507297 774112761 774704874 775965214 777407706 778262615 778767824 779576719 780643582
766.9 780643582 781417012 781760633 782029748 782432437 782711267 782473862 781884015 781482816 781376958 781270623
787.3 781270623 781240463 781904697 783531904 785626769 787787855 790210605 793129563 796272397 799062192
805.6 799062192 801286638 803254306 805147827 806621313 807406425 807793021 808067501 807959676 807014525
824 807014525 805344999 803579748 801996171 800325274 798388362 796451151 794932067 793723047 792340279
842.3 792340279 790924013 790142596 790235341 790982306 792387068 794865787 798535168 802746654 806853235
860.7H06853235M013121M121900L963351L233492K356470J910090J758456J323283
877H29533398N90205Q2791o9678l45766r74357j447082j323521q82447o10053m45009
897.4H24108481P7725Q51571J142979P99477M32551K79844n2095p83622j558959j900554
917.8H23397398j767159j552402j521409j253843m00484M26769N45919K26319J88589
936.2H18289697M23193K85149k55764n48541m19557m96805j167596j935720k242029
954.5H11932027k390861l048778m056096m658341m842580n338788o230652o666958
970.8G74698973o138146n179942m571617m276871l685653k843142k485692k673746
987.1G42844164k568900j847506j261949j324475j443982r91166m33445n99921j289546
$$ plain form
860.7 806853235 810866356 814988256 818951607 822185099 824541569 826451659 828210115 829533398
877 829533398 830123603 830206394 830136716 829790950 828816593 827369511 826045990 825163543 824553490 824108481
897.4 824108481 824186206 825037777 826180756 826980233 827412784 827692628 827640533 826856911 825297952 823397398
917.8 823397398 821630239 820077837 818556428 817302585 816902101 817328870 817874789 818101108 818289697
936.2 818289697 818712890 818998039 818742275 818193734 817774177 817277372 816109776 814174056 811932027
954.5 811932027 809541166 806492388 802436292 797777951 792935371 787596583 781365931 774698973
970.8 774698973 768560827 763380885 758809268 754532397 750846744 748003602 745517910 742844164
987.1 742844164 740275264 738427758 737165809 735841334 734397352 733406186 732972741 732372820 731083274
1005.5G31083274j680136j701891k006769k698184l028690k585411k064348k174139
1021.8G13143706k423227k109587j570999j530350j853585j742899j136720q48353
1038.1F99927986j163662j395047j051127o77109q70168j191080r02772j57177L10301
1056.5F92830145L71278N28156Q52108P37012j09673j074850j437962j402080j545072
1074.8F89749062j754582j583934j127481r66609j232743j471639j374423j139939
1091.2F79097712j049757r74178o79076k92182j43647k72274l80099k64585j50979
1109.5F74890935l06725n72682o39975o71029j037240j530230j601219j339853q19206
1127.9F66372776N82278J923203J904071J486778J387238J214505J048445J113415
$$ plain form
1005.5 731083274 729403138 727701247 725694478 722996294 719967604 717382193 715317845 713143706
1021.8 713143706 710720479 708610892 707039893 705509543 703655958 701913059 700776339 699927986
1038.1 699927986 698764324 697369277 696318150 695641041 694770873 693579793 692677021 692519844 692830145
1056.5 692830145 693201423 693729579 694581687 695318699 695209026 694134176 692696214 691294134 689749062
1074.8 689749062 687994480 686410546 685283065 684316456 683083713 681612074 680237651 679097712
1091.2 679097712 678047955 677073777 676394701 676102519 675958872 675686598 675306499 675041914 674890935
1109.5 674890935 674584210 674011528 673371553 672700524 671663284 670133054 668531835 667191982 666372776
1127.9 666372776 666955054 668878257 670782328 672269106 673656344 674870849 675919294 677032709
1144.2F77032709J128614Q39233N68033P13110J128554J337290J306772J556695K262592
1162.6F87873602K893329L110528L302276L821671M286289M177630L769040L690958
1178.9G16925323L865421L683090L000915K376556K129853J753152R01878J62541J21057
1197.2G34919786M09961L95119K22981M40359Q98719R04441L75390j1503J10447K49267
1217.6G38914967m9174l77119j56939L24011M02272J49011J79530O23941R00507P14540
1238G41625547N41449P31647R10282O36280J94132J33753L30925K92241L8803M0829
1258.4G45475888M71890R32336J083613J153111J467526J888573K043426J941383J946986
1276.8G58404732K174556K320945K173305K009213K156138K417684K376377K046347
$$ plain form
1144.2 677032709 678161323 679000556 679568589 680281699 681410253 682747543 684054315 685611010 687873602
1162.6 687873602 690766931 693877459 697179735 701001406 705287695 709465325 713234365 716925323
1178.9 716925323 720790744 724473834 727474749 729851305 731981158 733734310 734636188 734798729 734919786
1197.2 734919786 735329747 735724866 735947847 736388206 737286925 738191366 738566756 738555253 738665700 738914967
1217.6 738914967 738865793 738488674 738331735 738655746 739058018 739207029 739386559 740010500 740911007 741625547
1238 741625547 742166996 742898643 743808925 744445205 744639337 744773090 745104015 745396256 745435059 745475888
1258.4 745475888 745947778 746880114 747963727 749116838 750584364 752472937 754516363 756457746 758404732
1276.8 758404732 760579288 762900233 765073538 767082751 769238889 771656573 774032950 776079297
1293.1G76079297J822352J804233J671612J306892R76681R04263R34660P42435L79324
1311.4G86621749K63930M64439N68330L80517K55882M94361P65085O38009K83896J75715
1331.8G90911913K48909Q5711k97188l73721J6450K46108L6657j85728l4333J84536
1352.2G90839314m291m39465n78404m21464m61817q37385j066268r38356p59780j050592
1372.6G84281492j653552j936793k769649n181909o438434k808154L237248M997432
1388.9G71727681K450764N20110j65760m43697r26614j398444j405418j198411j131177
1407.3G68029034j265347j230478q44956n37872n96523o86526l53516K4557L2485j53661
1427.7G62417197j30117J37627L05891L80397N93245Q36552R88960Q94308Q48353J165032
$$ plain form
1293.1 776079297 777901649 779705882 781377494 782684386 783661067 784565330 785499990 786242425 786621749
1311.4 786621749 786885679 787350118 787918448 788298965 788554847 789049208 789814293 790452302 790736198 790911913
1331.8 790911913 791160822 791246533 790949345 790575624 790592074 790838182 790874839 790689111 790654778 790839314
1352.2 790839314 790835023 790395558 789817154 789395690 788933873 788096488 787030220 786091864 785332084 784281492
1372.6 784281492 782627940 780691147 777921498 772739589 766301155 763493001 766730249 771727681
1388.9 771727681 774178445 774698555 774532795 774089098 773162484 771764040 770358622 769160211 768029034
1407.3 768029034 766763687 765533209 764688253 764150381 763553858 762867332 762513816 762538373 762570858 762417197
1427.7 762417197 762287080 762424707 762730598 763110995 763704240 764540792 765529752 766424060 767272413 768437445
1448.1G68437445J475036J419962J339137K226830L685772L043890K355695K712190
1464.4G86695957L066361K805650K915919L782630L980041L293395K618015J995563
1480.7H11153531J455307R35733N31197M6730m95493o99819q87632j377046j768529
1499.1H08893979j787007j698673k213240l694534l232121k303720k247155k323389
1515.4G89394140k332806j951933j674414j535237j480520j604735j392723j242697
1531.7G76179075j476884j433253j176894j147389q16345l73662k00689J9551K17557
1550.1G69791067K51472J61469J00255L86715N79536M0292l17394o02127j068234j647830
1570.5G67675221j739502j904488k716481k861381k704501l044724l360153l639698
$$ plain form
1448.1 768437445 769912481 771332443 772671580 774898410 778584182 781628072 783983767 786695957
1464.4 786695957 789762318 792567968 795483887 799266517 803246558 806539953 809157968 811153531
1480.7 811153531 812608838 813544571 814075768 814122498 813627005 812927186 812039554 810662508 808893979
1499.1 808893979 807106972 805408299 803195059 799500525 796268404 793964684 791717529 789394140
1515.4 789394140 787061334 785109401 783434987 781899750 780419230 778814495 777421772 776179075
1531.7 776179075 774702191 773268938 772092044 770944655 770128310 769754648 769553959 769573510 769791067
1550.1 769791067 770042539 770204008 770304263 770690978 771270514 771310806 770993412 770391285 769323051 767675221
1570.5 767675221 765935719 764031231 761314750 758453369 755748868 752704144 749343991 745704293
1586.8G45704293l920197m117787m230023m428863m573703m556656m551351m603565
1603.1G10722148m625737m693449m838288m748821m444480m719674n317569m109800
1619.4F73224330l247321l626644l475607k986848k591372j856684j170397m89354
1635.7F53780103L70681Q97467J307190J718640K787292L629684K675355L352940N758882
1654.1F76278234M098713L008366L474652M262150M336536L545999L939390M832387
1670.4G07776427M229367M338861M847407M150033L653765M339277O241441N408049
1686.7G44984627M231095M406273L989220M477501N332887N681098O802201N384386
1703G85289288M465282M750132M073978L436207L068805K982497L497124L286183K398193
$$ plain form
1586.8 745704293 741784096 737666309 733436286 729007423 724433720 719877064 715325713 710722148
1603.1 710722148 706096411 701402962 696564674 691815853 687371373 682651699 677334130 673224330
1619.4 673224330 669977009 666350365 662874758 659887910 657296538 655439854 654269457 653780103
1635.7 653780103 654150784 655048251 656355441 658074081 660861373 664491057 667166412 670519352 676278234
1654.1 676278234 680376947 683385313 686859965 691122115 695458651 699004650 702944040 707776427
1670.4 707776427 712005794 716344655 721192062 725342095 728995860 733335137 739576578 744984627
1686.7 744984627 749215722 753621995 757611215 762088716 767421603 773102701 779904902 785289288
1703 785289288 789754570 794504702 798578680 802014887 805083692 808066189 811563313 814849496 817247689
1721.4H17247689K130091K087951J870036J757860J620769J908482K071142J576602
1737.7H32270622J611769J813531J774133J660764J564622J635909J678467J377284
1754H45387101J184583J115262R85146J034260R73403P48933O47068O46054P51913
1772.4H53473723Q32200P26640O66619O60777O18755N71788N56409M79400L69907M51743
1792.8H59407961N63026N22196M19855L85046M41849M82619M37200L05534K45094L27468
1813.2H63537848L82364L12686K52902K30551K57254L06368K00867J20521K84254L72172
1833.6H66257787K56240J78933K15411K15650J29342J20700K02357K54870K15173J28030
1854H68174493J06395J55806J95742J28925L9279k563L5763J64330J75178J15752J46210
$$ plain form
1721.4 817247689 819377780 821465731 823335767 825093627 826714396 828622878 830694020 832270622
1737.7 832270622 833882391 835695922 837470055 839130819 840695441 842331350 844009817 845387101
1754 845387101 846571684 847686946 848672092 849706352 850679755 851428688 852075756 852721810 853473723
1772.4 853473723 854305923 855032563 855699182 856359959 856978714 857550502 858106911 858586311 858956218 859407961
1792.8 859407961 859970987 860493183 860913038 861298084 861739933 862222552 862659752 862965286 863210380 863537848
1813.2 863537848 863920212 864232898 864485800 864716351 864973605 865279973 865480840 865601361 865885615 866257787
1833.6 866257787 866514027 866692960 866908371 867124021 867253363 867374063 867576420 867831290 868046463 868174493
1854 868174493 868280888 868436694 868632436 868761361 868800640 868798077 868833840 868998170 869173348 869289100 869435310
1876.4H69435310J67132O7234k9266N960N7340l576k4617O7473J36911J27554N1558
1898.8H70059013k026J4663K4616l5464q6904k2173Q2791M7505r5666j19209k1636
1921.3H69845510M7683M1545j7166l4214j6033n1975j12892j07348r2685j18315j13130
1943.7H69270980q3565p1228p8440r4413j10746j28865j40667j45912j53303j72019
1964.1H68091822j66416r9123o1452j04487j44959j30951r2507q9466j22249j44422
1984.5H66935790j19090j00136j43111j67787j24693q1956j01626j73331j98185j26064
2004.9H65599811p2777j08719j64568j61350j10567j15752j90735k14398j29819o5982
2025.3H64265144j34766k17736j33693j8180q1896j81437j25468q166k9683j75297
$$ plain form
1876.4 869435310 869602442 869669676 869640410 869646370 869703710 869700134 869675517 869742990 869879901 870007455 870059013
1898.8 870059013 870056987 870071650 870096266 870060802 869973898 869951725 870034516 870082021 869986355 869867146 869845510
1921.3 869845510 869893193 869934738 869917572 869883358 869867325 869815350 869702458 869595110 869502425 869384110 869270980
1943.7 869270980 869187415 869116187 869037747 868943334 868832588 868703723 868563056 868417144 868263841 868091822
1964.1 868091822 867925406 867826283 867764831 867660344 867515385 867384434 867291927 867202461 867080212 866935790
1984.5 866935790 866816700 866716564 866573453 866405666 866280973 866199017 866097391 865924060 865725875 865599811
2004.9 865599811 865527034 865418315 865253747 865092397 864981830 864866078 864675343 864460945 864331126 864265144
2025.3 864265144 864130378 863912642 863778949 863760769 863678873 863497436 863371968 863363802 863334119 863158822
2045.7H63158822k15650p4565L5465l2902j42157q1658N7399J252j71900j43767L7671
2068.1H62428010O9618n8830j32203k2173R8944J3828j23441l9041J32322N7816j34706
2090.5H62290144j06394R5963J60873K980j28805m77J87993J17779o7532o3539R8467
2113H62587452J32024j9073o6102J09673K05338L0935j24753k444J86622J27733n3525
2135.4H63113880k7835J57654J89781K2471n6565J11640K60889J40489o2466m4763
2155.8H63805175J49071J92106M1365o973J18255J72437N5849k6941P2896K14637J60575
2178.2H64948452j7167k8073J14977J52826L3140l5047O9916J65463R5248j5259m649
2200.7H65479827R2804R5666k9743p4506M3035J44183P6831m8399k5690J09613J22786
$$ plain form
2045.7 863158822 862943172 862868607 862904072 862871170 862729013 862647355 862704754 862706006 862534106 862390339 862428010
2068.1 862428010 862497628 862438798 862306595 862284422 862383366 862397194 862273753 862234712 862367034 862424850 862290144
2090.5 862290144 862183750 862279713 862440586 862443566 862314761 862314284 862502277 862620056 862552524 862488985 862587452
2113 862587452 862719476 862700403 862634301 862743974 862949312 862980247 862855494 862853050 863039672 863167405 863113880
2135.4 863113880 863086045 863243699 863433480 863455951 863399386 863511026 863771915 863912404 863849938 863805175
2155.8 863805175 863954246 864146352 864187717 864180744 864298999 864471436 864527285 864500344 864573240 864787877 864948452
2178.2 864948452 864931285 864903212 865018189 865171015 865204155 865169108 865239024 865404487 865499735 865484476 865479827
2200.7 865479827 865572631 865668297 865638554 865564048 865607083 865751266 865828097 865779698 865754008 865863621 865986407
2223.1H65986407l4571j16646J5437J40429N2571p4744k5511Q1659N1260o9499q3805
2245.6H65922987L9340R6499j4185r8050l1233Q7023Q5354o3479r9480L3974R5427
2268H66054177L0697k4796J2517Q4937M9650q0823q1599O6042J04904k4915j17421
2290.4H66073370l6836N6565l4571j52647j05202O437J7464r9361j86741j03772j848
2312.9H65432858o9320k09450k39075j56462r7513j33514k01643j51396o9916j28448
2333.3H63976121j94490j62661o5684j2339Q0347M95792P09176K47002m51565q42989
2353.6H63778710o68704l12269j50680k7240L21985O92129O84559M56214M45187O49929
2374H65869820O66201M33803L05354L86179M22597K05397p2121p0989J27554J53839
$$ plain form
2223.1 865986407 865951836 865835190 865850627 865991056 866043627 865968883 865943372 866025031 866076291 866006792 865922987
2245.6 865922987 865962327 866058826 866044641 865946591 865915358 866002381 866087735 866024256 865924776 865958750 866054177
2268 866054177 866084874 866060078 866072595 866157532 866207182 866126359 866044760 866110802 866215706 866190791 866073370
2290.4 866073370 866036534 866093099 866058528 865905881 865800679 865807116 865824580 865725219 865538478 865434706 865432858
2312.9 865432858 865363538 865154088 864915013 864758551 864661038 864527524 864325881 864174485 864104569 863976121
2333.3 863976121 863781631 863618970 863553286 863540947 863621294 864117086 864826262 865073264 864621699 863778710
2353.6 863778710 863110006 862797737 862647057 862619817 862941802 863633931 864318490 864774704 865219891 865869820
2374 865869820 866536021 866969824 867275178 867661357 868083954 868289351 868217230 868146241 868273795 868427634
2394.4H68427634k1040q5771N5730J50859K3127j19448o1214N0247J2457q5830n8711
2416.9H68288040N0008L4929j38760k44140j09196J07348J13070m3810o1869P4744
2437.3H68070364Q1480j17124k12013n0962P3015l3319j51753r2387K6822J7106r4115
2459.7H67517114j01149J4841K2471j13368j54555l5584M2200m4346j57892j29521
2480.1H66860211j7464m17j03474j70708j00374o0k8431j15335j09792n9306o1334
2502.5H66093516j10030r8169j1503J0073q1718j78993j51515m0412j3888q3863r6322
2525H65237176q940Q404j14679j99259r4533N4539m292j67549j78694p0870l1531j08481
2549.4H64321291j41501o1274j2159r4771j94788j44482k4199l4094j79947k53975
$$ plain form
2394.4 868427634 868406594 868320823 868376553 868527412 868550539 868431091 868369877 868420124 868432581 868346751 868288040
2416.9 868288040 868338048 868372977 868234217 867990077 867880881 867988229 868101299 868057489 867995620 868070364
2437.3 868070364 868151844 868034720 867822707 867771745 867844760 867811441 867659688 867567301 867594123 867611229 867517114
2459.7 867517114 867415965 867430806 867453277 867339909 867185354 867149770 867191970 867147624 866989732 866860211
2480.1 866860211 866842747 866842330 866738856 866568148 866467774 866467714 866439283 866323948 866214156 866154850 866093516
2502.5 866093516 865983486 865885317 865873814 865883887 865802169 865623176 865471661 865431249 865417361 865333498 865237176
2525 865237176 865228236 865236640 865121961 864922702 864828169 864882708 864878416 864710867 864532173 864461303 864429772 864321291
2549.4 864321291 864179790 864118516 864106357 864011586 863816798 863672316 863648117 863614023 863434076 863180101
2569.8H63180101j32084k6226j21713k05397r9778k6644j56164l03984k63512j05083
2590.2H61739516o6221j92999k63632j82807j06335j77204l22879l32474k04206j34289
2610.6H59756470j99020k68340k15948j62542k47657l19362k32160j70112k51650l00289
2631H57389390k42590j75953j86622k61784l26574l15368k18690j90138k69950k63572
2651.4H54938149j74343j79887k49386k68042k40564k09153k29120k63214j99557j40309
2671.8H52784574k15113k80500k42710k04086k20537k66969k96116k77400k24710k16424
2692.2H50340009k85447l44932l05295k36809k52187k96891k90156k41518k47061l42011
2712.6H47497702l73543k99513k45452k56360k74956k52962k62558l64662m33683l66688
$$ plain form
2569.8 863180101 863048017 863021791 862900078 862694681 862594903 862568259 862412095 862108111 861844599 861739516
2590.2 861739516 861673295 861480296 861216664 861033857 860927522 860750318 860427439 860094965 859890759 859756470
2610.6 859756470 859557450 859289110 859073162 858910620 858662963 858343601 858111441 857941329 857689679 857389390
2631 857389390 857146800 856970847 856784225 856522441 856195867 855880499 855661809 855471671 855201721 854938149
2651.4 854938149 854763806 854583919 854334533 854066491 853825927 853616774 853387654 853124440 852924883 852784574
2671.8 852784574 852569461 852288961 852046251 851842165 851621628 851354659 851058543 850781143 850556433 850340009
2692.2 850340009 850054562 849709630 849404335 849167526 848915339 848618448 848328292 848086774 847839713 847497702
2712.6 847497702 847124159 846824646 846579194 846322834 846047878 845794916 845532358 845167696 844734013 844367325
2733H44367325k19702j54436k58982l82662l48449k11716j84059l09765l90708l20197
2753.4H41586649k57134l31402m15146l61502k50101k71142l95596m08173k57790k15530
2773.8H38423133m21524n40614m13060l39509m55617m85540l45528l13461m58956n63263
2794.2H34086061m85123m11272n41270p13050o98328n10573l90291n25833p17878o91772
2814.6H28400671n78284o06537p38561p78913o89090o38544p17342q24153q47698q59320
2835H21122229r97782j312554j670062j915515k142310k310812k079904j382709o75857
2853.3H06634724l89218m00007m51803n95689q35001j046896j182497j127481r22442
2871.7G99683690r15885j077711r84908p18712o10352o56307p37846p67290p75576
$$ plain form
2733 844367325 844147623 843993187 843734205 843351543 843003094 842791378 842607319 842297554 841906846 841586649
2753.4 841586649 841329515 840998113 840582967 840221465 839971364 839700222 839304626 838896453 838638663 838423133
2773.8 838423133 838001609 837460995 837047935 836708426 836252809 835767269 835421741 835108280 834649324 834086061
2794.2 834086061 833600938 833189666 832648396 831935346 831237018 830726445 830336154 829810321 829092443 828400671
2814.6 828400671 827822387 827215850 826477289 825698376 825009286 824370742 823653400 822829247 821981549 821122229
2835 821122229 820124447 818811893 817141831 815226316 813084006 810773194 808693290 807310581 806634724
2853.3 806634724 806245506 805845499 805393696 804798007 803963006 802916110 801733613 800606132 799683690
2871.7 799683690 798767805 797690094 796705186 795986474 795376122 794719815 793981969 793214679 792439103
2890.1G92439103q34763q72731q94725r74358j038968j064181j109481j186192j301408
2908.4G83162296j485110j734852j898468j842320j651525j377881r28402m52697j71185
2926.8G71619856m1544K0504J54912L85702N60880P39157J046121J266718J095951
2945.1G76848257O48617L32952K71141J39833r5070j32858N6147K66850K68102J76847
2965.5G78780818K45392L79861M36186L89934L29793M22954N19931L72708K08974K70486
2985.9G82357037L79562M15683L44754J11222p7665k32101m69386n30243m17292l62694
3006.3G81518877l50476l23891l44038m78268p05421q98242r53615q55148p68423q27431
3026.7G75013924q00491o62029o30438q11398j036763r40204p42495q45015j107395
$$ plain form
2890.1 792439103 791604340 790731609 789836884 788862526 787823558 786759377 785649896 784463704 783162296
2908.4 783162296 781677186 779942334 778043866 776201546 774550021 773172140 772243738 771791041 771619856
2926.8 771619856 771578312 771598816 771753728 772139430 772700310 773439467 774485588 775752306 776848257
2945.1 776848257 777496874 777829826 778100967 778240800 778145730 778012872 778069019 778335869 778603971 778780818
2965.5 778780818 779026210 779406071 779842257 780232191 780561984 780984938 781504869 781877577 782086551 782357037
2985.9 782357037 782736599 783152282 783497036 783608258 783530593 783298492 782829106 782298863 781881571 781518877
3006.3 781518877 781168401 780844510 780500472 780022204 779316783 778418541 777464926 776609778 775841355 775013924
3026.7 775013924 774213433 773551404 772920966 772109568 771072805 770132601 769390106 768545091 767437696
3045.1G67437696j212060j055896r02653r59396j067341j132726j131893j022577r18865
3063.4G58034289q47399q69632j028836j114607j037061q20756o42776p79212j050532
3081.8G49843478j138329j110375j060605j049519j171827j240552j113712r83596
3098.1G40974963j032651j183748j186132j025439j018703j233875j239717r84550
3114.4G32070148r63151j233101j492262j618564j596988j483976j386106j379610
3130.7G20916390j460433j495301j367688j293719j492024j700580j707017j612544
3147G08787084j422286j274825j498460j877845j918077j782417j783550j807153j756430
3165.4F93666041j710415j734674j803279j797497j714230j755237j890183j894653
$$ plain form
3045.1 767437696 766225636 765169740 764267087 763307691 762240350 761107624 759975731 758953154 758034289
3063.4 758034289 757186890 756317258 755288422 754173815 753136754 752315998 751673222 750894010 749843478
3081.8 749843478 748705149 747594774 746534169 745484650 744312823 743072271 741958559 740974963
3098.1 740974963 739942312 738758564 737572432 736546993 735528290 734294415 733054698 732070148
3114.4 732070148 731106997 729873896 728381634 726763070 725166082 723682106 722296000 720916390
3130.7 720916390 719455957 717960656 716592968 715299249 713807225 712106645 710399628 708787084
3147 708787084 707364798 706089973 704591513 702713668 700795591 699013174 697229624 695422471 693666041
3165.4 693666041 691955626 690220952 688417673 686620176 684905946 683150709 681260526 679365873
3181.7F79365873j810431j767934j783430j855433j919925j926482j925826j922786
3198F64453626j891852j856982j835645j838267j854062j833319j793802j794875j800716
3216.4F47954106j785218j803518j832902j823962j793980j697839j569688j578748
3232.7F34068251j744628j846671j770318j633048j498222j399696j435161j567960
3249F21172547j571655j421153j341403j398623j444578j391232j340330j323700j223445
3267.4F08716428j123249j244366j446188j508653j491189j458228j454353j484573
3283.7E97505629j490712j455665j395523j412988j534462j661479j803101j853942
3300E84897757j694322j539230j615584j911462k198636k239108k109051k076924k171934
$$ plain form
3181.7 679365873 677555442 675787508 674004078 672148645 670228720 668302238 666376412 664453626
3198 664453626 662561774 660704792 658869147 657030880 655176818 653343499 651549697 649754822 647954106
3216.4 647954106 646168888 644365370 642532468 640708506 638914526 637216687 635646999 634068251
3232.7 634068251 632323623 630476952 628706634 627073586 625575364 624175668 622740507 621172547
3249 621172547 619600892 618179739 616838336 615439713 613995135 612603903 611263573 609939873 608716428
3267.4 608716428 607593179 606348813 604902625 603393972 601902783 600444555 598990202 597505629
3283.7 597505629 596014917 594559252 593163729 591750741 590216279 588554800 586751699 584897757
3300 584897757 583203435 581664205 580048621 578137159 575938523 573699415 571590364 569513440 567341506
3318.4E67341506k189219k101242k120912k306581k444982k426684k354384k298057
3334.7E49099445k275526k369166k544880k642154k682209k627254k451122k520084
3351E28987050k820075k871036k673745k529383k577305k607405k367496k195776k420366
3369.3E05924463k780735k792478k448767k206594k144188k095341j992137j828104
3385.7D87636119j579046j265884j243501j583428j671165j244217r17673j208067
3402D76923138j596600j397639r76116q18670q14855q90940r44585p32869m72665m29511
3422.4D67848688l17156j9640K19673K59310L29346N06997M06027R5963J46479N36441
3442.8D70012128Q54791R92775R95397J057655J201778J343638J526564J659155J543135
$$ plain form
3318.4 567341506 565152287 563051045 560930133 558623552 556178570 553751886 551397502 549099445
3334.7 549099445 546823919 544454753 541909873 539267719 536585510 533958256 531507134 528987050
3351 528987050 526166975 523295939 520622194 518092811 515515506 512908101 510540605 508344829 505924463
3369.3 505924463 503143728 500351250 497902483 495695889 493551701 491456360 489464223 487636119
3385.7 487636119 486057073 484791189 483547688 481964260 480293095 479048878 478131205 476923138
3402 476923138 475326538 473928899 472952783 472134113 471319258 470428318 469483733 468750864 468278199 467848688
3422.4 467848688 467531532 467511892 467731565 467990875 468320221 468827218 469233245 469329208 469475687 470012128
3442.8 470012128 470866919 471859694 472855091 473912746 475114524 476458162 477984726 479643881 481187016
3461.1D81187016J513421J929999K177745J791268J298756J324594J732766K097398
3477.4D95052963K106190J794547J739204K061665K166748K014160K042294K226174
3493.8E11203945K326727K172410K086043K260387K128840J789033J940728K397477
3510.1E28305590K662301K547324K232373K149760K424002K809286K707064K353967
3526.4E48191667K448320K670944K736211K901077K992511K796232K817750L134072
3542.7E70688784L328979L067792K727329K897442L177404L179312L238261L455996
3559E95761299L400266L056109L277123M239321M309952L661990L582597L849387M032851
3577.4F29170895M182577M254222M133463M262805M614949M406273M089475M333198
$$ plain form
3461.1 481187016 482700437 484630436 486808181 488599449 489898205 491222799 492955565 495052963
3477.4 495052963 497159153 498953700 500692904 502754569 504921317 506935477 508977771 511203945
3493.8 511203945 513530672 515703082 517789125 520049512 522178352 523967385 525908113 528305590
3510.1 528305590 530967891 533515215 535747588 537897348 540321350 543130636 545837700 548191667
3526.4 548191667 550639987 553310931 556047142 558948219 561940730 564736962 567554712 570688784
3542.7 570688784 574017763 577085555 579812884 582710326 585887730 589067042 592305303 595761299
3559 595761299 599161565 602217674 605494797 609734118 614044070 617706060 621288657 625138044 629170895
3577.4 629170895 633353472 637607694 641741157 646003962 650618911 655025184 659114659 663447857
3593.7F63447857M588842M638493M723549M576326M147708M056931M581570M807770
3610F99569046M598201M389047M159809M677295N193234M256904L213763L258169M684925
3628.4G38000393N230427M051447L768384L766120L556013L395080K981425K461373
3644.7G67210662K700806M115105M351854K728105K333819L043354K897143K191008
3661G91571856J780509J459063J284182J738786J986027J418829J664281K009332J588822
3679.4H06501687J374065J162887R04560J150489J659036J490056J132429R60708P24613
3697.7H17060530O26266R16660R95517N86271K77758M83751J048446J007437N28813
3716.1H23531449K96593L02612L80040M27901M45664K95222M4465R5189N57422R91285
$$ plain form
3593.7 663447857 668036699 672675192 677398741 681975067 686122775 690179706 694761276 699569046
3610 699569046 704167247 708556294 712716103 717393398 722586632 726843536 730057299 733315468 738000393
3628.4 738000393 743230820 747282267 751050651 754816771 758372784 761767864 764749289 767210662
3644.7 767210662 769911468 774026573 778378427 781106532 783440351 786483705 789380848 791571856
3661 791571856 793352365 794811428 796095610 797834396 799820423 801239252 802903533 804912865 806501687
3679.4 806501687 807875752 809038639 809943199 811093688 812752724 814242780 815375209 816335917 817060530
3697.7 817060530 817686796 818603456 819598973 820185244 820463002 820946753 821995199 823002636 823531449
3716.1 823531449 823828042 824130654 824510694 824938595 825384259 825679481 825723946 825819135 826376557 827367842
3736.5H27367842O48260j50859m24266J98722M56750K7359L80695R22560N38350J63495
3756.9H30128908L21329M64678K10762M5478R0003K67625M10974K50578P3910J65760
3777.3H32430005L46780K27272Q464O5744K04265K05100L8564j62303j29819j02699
3797.7H33131373j77085J46448L02792J40965L19659K90990q3089k46524l2306l934
3818H33789289k4557L51727K84731M6552k0981j35243j39773m3810j2517N961J01924
3840.5H34203303L07679M40776Q6785n59151r78589n27323Q09193Q27193J26064k33412
3860.9H34502518k11060l7193j16110j35005J62781L12984K41220k3425j75476l4213
3881.3H34487021P2956K28047J12355k12312m8160J66178q9169l48329l26038p7069
$$ plain form
3736.5 827367842 828016102 827865243 827440977 827639699 828096449 828123808 828504503 829427063 829965413 830128908
3756.9 830128908 830450237 830914915 831125677 831171155 831261158 831528783 831939757 832190335 832264245 832430005
3777.3 832430005 832776785 833004057 833012521 833078265 833282530 833487630 833526194 833363891 833234072 833131373
3797.7 833131373 832954288 833100736 833403528 833544493 833864152 834155142 834072053 833825529 833793223 833789289
3818 833789289 833764732 834116459 834401190 834447742 834426761 834291518 834151745 834107935 834095418 834101379 834203303
3840.5 834203303 834510982 834951758 835038543 834479392 833500803 832973480 833782673 834609866 834735930 834502518
3860.9 834502518 834291458 834254265 834138155 834003150 834165931 834478915 834720135 834696710 834521234 834487021
3881.3 834487021 834559977 834788024 834900379 834688067 834639907 834806085 834716916 834368587 834042549 833965480
3901.7H33965480K63036L72529J49905l934k0027r3877j10209j7047m1962p8320L1769
3924.1H34417343Q9586Q166J3172J51635J62720J669j32978j32739J2695J05262N3525
3946.5H34750056M2260M3809m0769o6698M4048R2506K325l8266j1265k6465q047Q3745
3971H34867239J21295Q4758M053o5505O4671K60472J29700j55985j53482M2438R7752
3993.4H35297406K1577K6524
3997.5H35345507
$$ plain form
3901.7 833965480 834228516 834601045 834750950 834747016 834726989 834633112 834522903 834505856 834463894 834385574 834417343
3924.1 834417343 834506929 834515095 834528267 834679902 834842622 834844291 834711313 834578574 834591269 834696531 834750056
3946.5 834750056 834792316 834836125 834795356 834728658 834772706 834865212 834867537 834829271 834818006 834791541 834783494 834867239
3971 834867239 834988534 835073292 835077345 835011840 835076511 835336983 835466683 835310698 835157216 835199654 835297406
3993.4 835297406 835318983 835345507
3997.5 835345507
##END=$$ End of the data block
