##TITLE=$$ Begin of the data block
##JCAMP-DX=5.00 $$ ACD/SpecManager v 10.08
##SPECTROMETER/DATA SYSTEM=Alpha
##DATE=09 Apr 2014 11:14:46
##DATA TYPE=INFRARED SPECTRUM
##DATA CLASS=XYDATA
##ORIGIN=
##OWNER=
##NPOINTS=1765
##FIRSTX=399.75695801
##LASTX=3997.56933594
##MAXX=3997.56933594
##MINX=399.75695801
##MAXY=0.85150576
##MINY=0.21608219
##XFACTOR=1.0000000000
##YFACTOR=1.000000000000000e-9
##FIRSTY=0.58315998
##DELTAX=2.03957629
##XUNITS=1/CM
##YUNITS=ARBITRARY UNITS
##XYDATA=(X++(Y..Y))
399.8E83159983m188835m276038K69533R56416l558457l346324K022981K989829j571774
418.1E72457314k813399O38187r21667l711104q42810K325356o35386l482997k19583
436.5E62793911K051472j188934k605438J102388J776218k463936k907277J443625
452.8E60002029J999736k317488k823294R96888O7771l445745j796663J879275k63274
471.1E54299235m216373j618862J668155j021683l442824l25262J756727j621186l164828
489.5E42313099L48985J322210k530813l264129M63724R59217k742409k649785R05216
507.9E35125315L36886l149927k463102O73592n39840l739357k120912P61986j209318
526.2E23675323l954590j771748O90222j398802l533542j021206J270830j085281l040433
$$ y = [583159983, 578971148, 574695110, 574964643, 575921059, 572362602, 569016278, 571039259, 574029088, 572457314, 569643915, 570282102, 569360435, 565649331, 564806521, 567131877, 566496491, 563013494, 562793911, 564845383, 563656449, 561051011, 562153399, 563929617, 561465681, 558558404, 560002029, 562001765, 559684277, 556860983, 557857871, 557925642, 554479897, 552683234, 554562509, 554299235, 550082862, 548464000, 550132155, 549110472, 545667648, 545342386, 547099113, 545477927, 542313099, 542662084, 543984294, 541453481, 538189352, 538653076, 539612293, 536869884, 534220099, 535125315, 535462201, 532312274, 529849172, 530522764, 529982924, 526243567, 524122655, 524884641, 523675323, 519720733, 517948985, 518639207, 517240405, 513706863, 512685657, 513956487, 512871206, 509830773]
544.6E09830773n97119J012623j650810l027022l85404N33462k498448l539622q06719
562.9D98871714l17246l391832l983378j191676j023710l841936l772617r25362j177579
581.3D79246378l695995l143847o73055j202911l638536l076047q01474j617491l956139
599.6D57440883l344685j487166k065479l006071j201272O43343n51522j534701J423538
618D46316868M693329L836781K260268L886461N530536L762007K108216L698826M817397
636.3D80910689K338200P3046J153201K440989J613885J325041K767593K080708j063466
654.7D93639886k22772N475432P941603M797757J996875L000438N479157L502786K568424
673.1E28179586M447162M457831J829088J506984L818989L559232P63297Q43227L401220
$$ y = [509830773, 509233654, 510246277, 508595467, 505568445, 505183041, 505716503, 503218055, 499678433, 498871714, 498554468, 495162636, 491179258, 489987582, 488963872, 485121936, 481349319, 480423957, 479246378, 475550383, 472406536, 471733481, 470530570, 466892034, 463815987, 463014513, 461397022, 457440883, 454096198, 452609032, 450543553, 447537482, 446336210, 446979553, 446428031, 444893330, 446316868, 451010197, 454846978, 457107246, 460993707, 466524243, 470286250, 472394466, 476093292, 480910689, 483248889, 483321935, 484475136, 486916125, 488530010, 489855051, 492622644, 494703352, 493639886, 493417114, 498892546, 506834149, 511631906, 513628781, 516629219, 522108376, 525611162, 528179586, 532626748, 537084579, 538913667, 540420651, 544239640, 547798872, 548562169, 549405396, 552806616]
691.4E52806616K824306r5546J76907K713740K251505K4617J094401L877819L155708
709.8E68830073P73251J912296M392981L220022Q94427K346456M651606L084898P03276
728.1E90809286K148509M205823K340257P7724J798511L847420J957119L3617K175509
746.5F09393775M223347K170623L12984K415418M088044J885832L48627K690196M059911
764.8F31588757J423061j92225K054751K881169k69413j893401K92897Q53181k038896
783.2F34699881k797127L30270J872837K96116J017928N026400O602228M701197M880607
801.6F56630337P789195P570743L927231L032208N156040M256308N19276r6083J682877
819.9F90468132j03890m215360m518151k387405l578961o404340n496800k882838l623307
$$ y = [552806616, 555630922, 555535376, 555712283, 558426023, 560677528, 560702145, 561796546, 565674365, 568830073, 569603324, 571515620, 575908601, 579128623, 580023050, 582369506, 587021112, 590106010, 590809286, 592957795, 597163618, 599503875, 599581599, 601380110, 605227530, 607184649, 607218266, 609393775, 613617122, 615787745, 616100729, 618516147, 622604191, 624490023, 624838650, 627528846, 631588757, 633011818, 632819593, 634874344, 637755513, 637486100, 635592699, 635885596, 636738777, 634699881, 631902754, 632233024, 634105861, 634401977, 635419905, 640446305, 647048533, 651749730, 656630337, 664419532, 671990275, 675917506, 678949714, 684105754, 688362062, 688881338, 688785255, 690468132, 690364242, 686148882, 681630731, 679243326, 675664365, 669260025, 663763225, 660880387, 657257080]
838.3F57257080n576253m123270j518906j908481k734959L52621M940391O322026O307066
856.6F59317315Q989811J1934816J0756374Q168101Q743465R618044O560087L312051
872.9G27400064M312575N502403K460599q54134k22743N35965k270222m486918k590299
891.3G29787290o64592j815855k076626J073599L259182J681149N29706K307654K627372
909.6G36708879o91592k988994k036691k185345n049824n871773k982795j029313j731873
928G12140679j084566J762688K413094J41025m92096J313567J259923j137614j696408
946.4G14620292k69651j123727m282295n484701m794657o270051r591400j0922790
962.7F71881020j0845780j2900055j6072571j6582370j4903307j4078259j3639689
$$ y = [657257080, 651680827, 647557557, 646038651, 644130170, 641395211, 641747832, 646688223, 653010249, 659317315, 668307126, 680241942, 690998316, 699166417, 707909882, 717527926, 724088013, 727400064, 731712639, 737215042, 739675641, 738821507, 738598764, 739134729, 736864507, 732377589, 729787290, 729122698, 727306843, 725230217, 726303816, 729562998, 731244147, 731773853, 734081507, 736708879, 736017287, 733028293, 730991602, 728806257, 723756433, 717884660, 714901865, 713872552, 712140679, 711056113, 712818801, 715231895, 715372920, 714880824, 716194391, 717454314, 716316700, 714620292, 714350641, 713226914, 708944619, 703459918, 698665261, 692395210, 682803810, 671881020, 661035240, 648135185, 632062614, 615480244, 600576937, 586498678, 572858989]
977E72858989j1322975q350193p465721p846593o870747n095303m739285n036652l876447
995.3E12255073k129913j915395k496958j995742j436889k840758n005598n639106
1011.6D88794714n465299o225586p005691o224513n054325n248636n823433n198449
1027.9D42548782m238904m325867m592686l673822k540916k608091k967298k368778
1044.3D15232420j764923k279133k789885j970917o66588q6040M62681J670897K229602
1062.6D10038114R63807r28223j970083k745986l982425m691451m136980l521621l869146
1081C85156006m408360m409134m649431n589992n989045m915922l222526j873940n92112
1099.3C49505544Q28474J587689J248956P24167O61105L32355q78185k380162l763974
$$ y = [572858989, 561536014, 553185821, 545720100, 537873507, 531002760, 525907457, 521168172, 516131520, 512255073, 510125160, 508209765, 505712807, 503717065, 502280176, 499439418, 494433820, 488794714, 483329415, 477103829, 470098138, 463873625, 458819300, 453570664, 447747231, 442548782, 438309878, 433984011, 429391325, 425717503, 423176587, 420568496, 417601198, 415232420, 413467497, 411188364, 408398479, 406427562, 405760974, 405674934, 406137615, 407808512, 410038114, 411001921, 410073698, 408103615, 405357629, 401375204, 396683753, 392546773, 389025152, 385156006, 380747646, 376338512, 371689081, 366099089, 360110044, 355194122, 351971596, 350097656, 349505544, 350334018, 351921707, 353170663, 353894830, 354555935, 354888290, 354010105, 351629943, 347865969]
1117.7C47865969n476117o559044m734189o74337J899570J614392L11733j06454Q68857
1136C35010380K387762L571540M178345L949553K949089K138853K094358K181321J956344
1154.4C60417545K095193L069847M218370N099326O319374Q094311R417236R654790
1170.7D08385992R559482R803623R703726Q752048P841319P460832O530792M452944
1187D72490758K429336J229733L1770j291574j384139J40101J823098K742439L555089
1205.4D81766611M372329M067868K618998J594186J584172J460254P85917O75351J443982
1223.7E00369668J816094J477301J683354K614856K973259K573251K645135L290534
1240.1E19443452L206730K285183J855314J988828J475453M59671L16501J016676J262069
$$ y = [347865969, 342389852, 335830808, 331096619, 330422282, 332321852, 333936244, 334247977, 334141523, 335010380, 337398142, 340969682, 345148027, 349097580, 352046669, 354185522, 356279880, 358461201, 360417545, 362512738, 365582585, 369800955, 374900281, 381219655, 389313966, 398731202, 408385992, 417945474, 427749097, 437452823, 446204871, 454046190, 461507022, 468037814, 472490758, 474920094, 476149827, 476181597, 474890023, 473505884, 473645985, 475469083, 478211522, 481766611, 486138940, 490206808, 492825806, 494419992, 496004164, 497464418, 498250335, 498925686, 500369668, 502185762, 503663063, 505346417, 507961273, 510934532, 513507783, 516152918, 519443452, 522650182, 524935365, 526790679, 528779507, 530254960, 530714631, 531031132, 532047808, 533309877]
1258.4E33309877J134694J892864L289283L919780L910482M580140N713403N909205
1274.7E63659728N436360N692900O439209O322741N707741O043553O830216O469845
1291F12602293N427838N257130N447566M590750L369093L184676L351688K502144J361727
1309.4F47094905J292766J589834R28998J73331O32882J381755J110732O78599J143396
1327.8F56027198J459181N56171m75824m07398k05993r53973j374900n82754L1352
1346.1F54073060m41373r58681n88775l72052j159251j725256j504481j815080k920986
1364.5F42587125l350138l218472l442169m875362o992936q543253j3250470k3173749
1380.8E75740576k6057840r111583J6300261K4172008J4732003P448912L785551N78820
$$ y = [533309877, 534444571, 536337435, 539626718, 543546498, 547456980, 552037120, 557750523, 563659728, 569096088, 574788988, 581228197, 587550938, 593258679, 599302232, 606132448, 612602293, 618030131, 623287261, 628734827, 633325577, 636694670, 639879346, 643231034, 645733178, 647094905, 648387671, 649977505, 650906503, 651079834, 651712716, 653094471, 654205203, 654883802, 656027198, 657486379, 658042550, 657566726, 657159328, 656953335, 655999362, 654624462, 654041708, 654073060, 653631687, 652673006, 652084231, 651712179, 650552928, 648827672, 647323191, 645508111, 642587125, 639236987, 636018515, 632576346, 627700984, 620708048, 612164795, 598914325, 575740576, 549682736, 540571153, 556871414, 581043422, 595775425, 603224337, 607009888, 607588708]
1397.1F07588708j512706j993596k257467l242731l375590k425909j960039j950860
1413.4E88869810j480758q77261q94785r22680m49717O5327J80482k74419j74582P33375
1433.8E84774792J142800R02116J155675J925111K245187K299965K932548L938973
1450.1F01317167M438222M847049P126809R763896P678032O403625P710993Q558691
1466.4F57844484P578254P714033R893357R941936P357538N486965M662752M180312
1482.8G14659631L013790J598060L91185n59866j185060j996457l209949l737926l623307
1501.1G05350101l382206m193723p653654p628023n717934n044162m514754m345059
1517.4F62870586l928125l962636l780842l487468l807246l014446k458870l289044
$$ y = [607588708, 606076002, 604082406, 601824939, 598582208, 595206618, 592780709, 590820670, 588869810, 587389052, 586511791, 585617006, 584694326, 584244609, 584309936, 584490418, 584215999, 584041417, 584774792, 585917592, 586819708, 587975383, 589900494, 592145681, 594445646, 597378194, 601317167, 605755389, 610602438, 617729247, 627493143, 635171175, 641574800, 649285793, 657844484, 665422738, 673136771, 683030128, 692972064, 700329602, 705816567, 710479319, 714659631, 717673421, 719271481, 719662666, 719102800, 717917740, 715921283, 712711334, 708973408, 705350101, 701967895, 697774172, 690120518, 682492495, 676774561, 671730399, 667215645, 662870586, 658942461, 654979825, 651198983, 647711515, 643904269, 640889823, 638430953, 635141909]
1533.7F35141909k879381j561403j821697k490759j578331n15223K39492L80099N17428
1552.1F25432134J153886J656353Q03352j114845q37505q52287j668573k939820m230141
1570.5F17402554l926874m511952p310450p182777o000280o830335p590175p695138
1586.8E66354573p857025q332729q506179q325219q039058p898926p881522p644594
1603.1E01869321p261008p276952p547468p072479o161511o765663q366883o442964
1619.4D44974393n035907o095380n958676n008251m435807l295988k550691k759636
1635.7D09834057j788318k73049O89715J540244K545416L236383K972335L939599O150603
1654.1D28846985N048722M596502N700469P095098P529438O882936Q008986R787411
$$ y = [635141909, 632262528, 630701125, 628879428, 626388669, 624810338, 624295115, 624534607, 624914706, 625432134, 626586020, 628242373, 629045725, 627930880, 627093375, 626241088, 624572515, 621632695, 617402554, 613475680, 608963728, 601653278, 594470501, 588470221, 581639886, 574049711, 566354573, 558497548, 550164819, 541658640, 533333421, 525294363, 517395437, 509513915, 501869321, 494608313, 487331361, 479783893, 472711414, 466549903, 459784240, 451417357, 444974393, 439938486, 433843106, 427884430, 422876179, 418440372, 415144384, 412593693, 409834057, 408045739, 407772690, 408462405, 410002649, 412548065, 415784448, 418756783, 422696382, 428846985, 433895707, 438492209, 444192678, 451287776, 458817214, 465700150, 473709136, 483496547]
1670.4D83496547Q874237R287298J0582924R723365R133518J0657370J4314234J2459994
1686.7E68529487J0117888J0787010J0377407J1566401J3066530J3038635J4846087
1701F52329445J2110472J0131716J0371924R028494P945597P304132P051051P409513
1717.3G23682344O259322M655481M453122M692257M429102M130601L896594M337669
1733.6G60536492M191875L323555L614247L997803L816485L581703L606677L704786
1749.9G90373623L279031K600193K578973K680481K302885J926780J774251J875043
1766.3H09391260J914740J824319J763344J568079J262426J200855J335383J386463
1782.6H21646869J208604J065611J242161J366317J063586P61866R46224J093984R27865
$$ y = [483496547, 492370784, 501658082, 512241006, 521964371, 531097889, 541755259, 556069493, 568529487, 578647375, 589434385, 599811792, 611378193, 624444723, 637483358, 652329445, 664439917, 674571633, 684943557, 693972051, 701917648, 709221780, 716272831, 723682344, 729941666, 734597147, 739050269, 743742526, 748171628, 752302229, 756198823, 760536492, 764728367, 768051922, 771666169, 775663972, 779480457, 783062160, 786668837, 790373623, 793652654, 796252847, 798831820, 801512301, 803815186, 805741966, 807516217, 809391260, 811306000, 813130319, 814893663, 816461742, 817724168, 818925023, 820260406, 821646869, 822855473, 823921084, 825163245, 826529562, 827593148, 828355014, 829301238, 830395222, 831323087]
1800.9H31323087P14183P93874R26376P58052N19573N65529P38621O59346N53966O62208
1821.3H38214815P29680N65290N11229N86212M43995L16203L85344N33104N63681N09381
1841.7H43358934M29869L85761L33965K47895K97785M16577L69966K06411K44856M33743
1862.1H46725762N03719M18126K69831J34289R4294J01030J67966K90990K55048J49250
1882.5H49110305K21551L49700K03073m1723N6863K32220J60515P3671J68443K28226
1902.9H50762844J12414N007N3644J23501J04189J03831J39833J00493l4153j15991
1923.3H51355612k6583N0246k0206l7193K5392k7061j31369q5711K7180m6313k10941
1945.7H50873053k15948r7632q2493k10881k31564j16766j15096k17140j67370n9426
$$ y = [831323087, 832037270, 832831144, 833757520, 834515572, 835035145, 835600674, 836339295, 836998641, 837552607, 838214815, 838944495, 839509785, 840021014, 840607226, 841051221, 841367424, 841752768, 842285872, 842849553, 843358934, 843788803, 844174564, 844508529, 844756424, 845054209, 845470786, 845840752, 846047163, 846292019, 846725762, 847229481, 847647607, 847917438, 848051727, 848146021, 848247051, 848415017, 848706007, 848961055, 849110305, 849331856, 849681556, 849884629, 849842906, 849899769, 850131989, 850292504, 850366175, 850534618, 850762844, 850875258, 850880265, 850933909, 851057410, 851161599, 851265430, 851405263, 851505756, 851471603, 851355612, 851329029, 851379275, 851359069, 851321876, 851347268, 851320207, 851188838, 851103127, 851130307, 851083994, 850873053, 850657105, 850559473, 850476980, 850266099, 850034535, 849917769, 849802673, 849585533, 849418163, 849358737]
1966.1H49358737j37805k85984k45988q0526r2625k28286j92404o2466j35839k84671
1986.5H47612143k06054o4373j71482l26455k27511q5294j62900l17990k55883j24276
2006.9H45669925k08854l22819k06292j07050k79009m20809k74897j26779k35617l33547
2027.3H43154252k01405j12831k93672m21882k33710o7591j83404l07321j96338j03653
2047.7H41032445k36213l37004j83285o0618j69694k29180p2837j9967k43664l07560
2068.1H39172423p7903J3411j62304k11894j5259K6822j83225k43365n0426K265j81973
2090.5H38088572j99139M4942J01745j06037j40547Q3684J18256j14560j29044R9540
2110.9H37847412J12652j20639j48178J07110J88112j1384m3094J47402J40309o2108
$$ y = [849358737, 849220932, 848934948, 848688960, 848608434, 848515809, 848287523, 848095119, 848032653, 847896814, 847612143, 847406089, 847341716, 847170234, 846843779, 846616268, 846530974, 846368074, 846050084, 845794201, 845669925, 845461071, 845138252, 844931960, 844824910, 844545901, 844125092, 843850195, 843723416, 843487799, 843154252, 842952847, 842840016, 842546344, 842124462, 841890752, 841823161, 841639757, 841332436, 841136098, 841032445, 840796232, 840459228, 840275943, 840215325, 840045631, 839816451, 839743614, 839723647, 839479983, 839172423, 839094520, 839107931, 838945627, 838733733, 838718474, 838745296, 838562071, 838318706, 838268280, 838270545, 838088572, 837889433, 837934375, 838036120, 837930083, 837789536, 837873220, 837991476, 837876916, 837747872, 837847412, 837960064, 837839425, 837691247, 837798357, 837986469, 837975085, 837931991, 838079393, 838219702, 838157594]
2131.3H38157594m5121J94908J87039l4571J0372K46882K13504j1385J5855K45691
2151.7H39180768K35736l159R954K52902K30909n067L5584K67327K20955N781P9036
2174.2H40510726L00467J94490l8564Q2731L18408J83761q3923j4067K12073J47582
2194.6H41813684n8592M4227K42531Q0049j65701k8908K31147J35362r4354j014K03670
2217H42402101R5903j06394N245J88411L0636j80065k6167J72198L696j92345j1205
2239.4H42382014J98602K385k35856p3433J02461o0738k03967k6405J48952n0842k63632
2261.9H41919541n3167J75536p749j69694O4909K53856P3314n9545J46151K52187K801
2284.3H42598140j88350m8936M9472j86980l42428j66476o5088k41340l52800k61545
$$ y = [838157594, 838112473, 838307381, 838494420, 838459849, 838470221, 838717103, 838930607, 838919222, 838935077, 839180768, 839416504, 839413345, 839423299, 839676201, 839907110, 839902043, 839937627, 840204954, 840425909, 840431690, 840510726, 840811193, 841005683, 840967119, 841049850, 841368258, 841552019, 841468096, 841454029, 841666102, 841813684, 841755092, 841799319, 842041850, 842121899, 841956198, 841927290, 842158437, 842293799, 842199445, 842198431, 842402101, 842498004, 842391610, 842396855, 842585266, 842615902, 842435837, 842409670, 842581868, 842585564, 842393219, 842382014, 842580616, 842583001, 842347145, 842273712, 842376173, 842315435, 842111468, 842085063, 842234015, 842183173, 841919541, 841866374, 842041910, 842034161, 841864467, 841929376, 842183232, 842256546, 842197001, 842343152, 842595339, 842598140, 842409790, 842360854, 842410326, 842223346, 841880918, 841714442, 841649354, 841408014, 841055214, 840793669]
2304.7H40793669l06308n57184n82218k55168j61886o29306j000643p42674l91304
2323.1H36166978m62592o09040m52578k34544l02494l94463k01524p7307j40071L90470
2343.5H33682835J640618J819432L63826j221597j837194j732289j515985p77543L35634
2361.8H30757737J059652J362204J724243K062917K027929J749337J670658J818836
2378.1H44233513J729369J341045J044154Q53598N12421J18912M4345K05458J61707
2396.5H50244522l4273O259K18093J72854r1195j00136J13308Q4997j30535j31547
2416.9H50352347P689j38342n26190n61059o3062L38018L00646K62439L50833K04623
2437.3H50527942r9003j18077R0241N0724j55806p5818J34409M4405k09689j87158
$$ y = [840793669, 840487361, 839930177, 839347959, 839092791, 838930905, 838301599, 837300956, 836558282, 836166978, 835704386, 835095346, 834642768, 834408224, 834105730, 833711267, 833509743, 833432436, 833292365, 833682835, 835323453, 837142885, 837506711, 836285114, 834447920, 832715631, 831199646, 830422103, 830757737, 831817389, 833179593, 834903836, 836966753, 838994682, 840744019, 842414677, 844233513, 845962882, 847303927, 848348081, 849201679, 849714100, 849833012, 849877357, 850082815, 850244522, 850210249, 850216508, 850434601, 850607455, 850516260, 850416124, 850529432, 850614429, 850483894, 850352347, 850360036, 850221694, 849695504, 849134445, 849071383, 849409401, 849710047, 849972486, 850323319, 850527942, 850428939, 850310862, 850401103, 850451827, 850296021, 850220203, 850354612, 850399017, 850189328, 850002170]
2457.7H50002170N1438L7909j80423j49131O7472K9028k08080k01762j5437m6075k16484
2480.1H49170625j45316P0810o139k43962j89364P332n5373k31445j60098J79r3877
2502.5H48123372k64764j61231K0266o7830k24591j38282K2292p5579k82645k01881
2522.9H46749127L755p7426k59698j54614K0682q9049k65300j64569k265j34766l05056
2545.4H45320821j45793M8578q9765k93732k10285n2512j68085l41355k00630k920
2565.8H43864322j40310l64780k97248j53125k77638m23968k77519j26183k93732m98772
2586.2H41011047l84092k18809l41415m59492l13223k36868m48823o12557m66645l18468
2606.6H37210655m68373o00755m25816l01480m98176o41703m94242l83556n16117n93960
$$ y = [850002170, 850053608, 850091517, 849911094, 849761963, 849829435, 849858463, 849650383, 849448621, 849433184, 849387109, 849170625, 849025309, 849096119, 849089980, 848846018, 848656654, 848663986, 848608613, 848377168, 848217070, 848217249, 848123372, 847858608, 847697377, 847717643, 847649813, 847425222, 847286940, 847309232, 847233653, 846951008, 846749127, 846752882, 846675456, 846415758, 846261144, 846281826, 846192777, 845927477, 845762908, 845760643, 845625877, 845320821, 845175028, 845223606, 845133841, 844840109, 844629824, 844577312, 844409227, 844067872, 843867242, 843864322, 843724012, 843359232, 843061984, 842908859, 842631221, 842207253, 841929734, 841803551, 841509819, 841011047, 840626955, 840408146, 840066731, 839607239, 839294016, 839057148, 838608325, 837995768, 837529123, 837210655, 836742282, 836141527, 835715711, 835414231, 834916055, 834274352, 833780110, 833396554, 832880437, 832286477]
2626.9H32286477m16994l23594n38826o77287m90725l56794n03242n83887l94821l20315
2647.3H27679992n63264o82533m71532l57271n15878n33879l12745l13580n82338o36398
2667.7H22710574m32194l88920n55277n46217l13222l08216n85794o67870m90904m58300
2688.1H17963660o12438o06120m12702m36247p01427p21514n04613m98057o64293o32465
2708.5H12173784m69268n46753p67648p27535n07056n12243o84261o44684m76658n56052
2728.9H06281626p99894p98822n58078n01394o87361o93202m95851n11527o87301o76632
2749.3G99871564n60761o12199p73907p53462o07967o92427q80540p99298n98967o34790
2769.7G92957246p96377p75636p20143q87811j044929r55403q33809q82328r95636
$$ y = [832286477, 831869483, 831545889, 831007063, 830329776, 829839051, 829482257, 828979015, 828395128, 828000307, 827679992, 827116728, 826434195, 825962663, 825605392, 825089514, 824555635, 824242890, 823929310, 823346972, 822710574, 822278380, 821889460, 821334183, 820787966, 820474744, 820166528, 819580734, 818912864, 818421960, 817963660, 817351222, 816745102, 816332400, 815896153, 815194726, 814473212, 813968599, 813470542, 812806249, 812173784, 811704516, 811157763, 810390115, 809662580, 809155524, 808643281, 807959020, 807314336, 806837678, 806281626, 805481732, 804682910, 804124832, 803623438, 802936077, 802242875, 801747024, 801235497, 800548196, 799871564, 799310803, 798698604, 797924697, 797171235, 796563268, 795870841, 794990301, 794191003, 793592036, 792957246, 792160869, 791385233, 790665090, 789777279, 788732350, 787776947, 786943138, 786060810, 785065174]
2788.1G85065174r88424r34124j061141j211643j129747j042306j175642j304984j223028
2806.4G74994135j136363j285076j473903j393438j241147j374126j569331j524746
2822.7G63996005j478076j641095j819491j855433j923919k200603k517581k779663
2839.1G47780144l288626m141272m914224n064726m306018k963781j742304j065492
2855.4G20293701r65059j249015j639665j971960k330959k747237k918124k663553
2871.7G03808129k302289k104104j868248j568138j485586j625658j761257j787424
2888F89305425j864732k056300k168775k207756k341509k492249k501607k515852k763927
2906.4F68392718l244341l781080m219830m481435m310667l566921k647281j957059
$$ y = [785065174, 784076750, 783142626, 782081485, 780869842, 779740095, 778697789, 777522147, 776217163, 774994135, 773857772, 772572696, 771098793, 769705355, 768464208, 767090082, 765520751, 763996005, 762517929, 760876834, 759057343, 757201910, 755277991, 753077388, 750559807, 747780144, 744491518, 740350246, 735436022, 730371296, 726065278, 723101497, 721359193, 720293701, 719328642, 718079627, 716439962, 714468002, 712137043, 709389806, 706471682, 703808129, 701505840, 699401736, 697533488, 695965350, 694479764, 692854106, 691092849, 689305425, 687440693, 685384393, 683215618, 681007862, 678666353, 676174104, 673672497, 671156645, 668392718, 665148377, 661367297, 657147467, 652666032, 648355365, 644788444, 642141163, 640184104]
2922.7F40184104j468360r29594l29971L5762K68341P71105J454532J948297K241433
2941F44175649K436518K362848J870751J186073O92606L54528L7968k4497K44319N48244
2961.4F53885007O37472O39140P26760Q14020Q26121P52329O61731P23601Q00550O76214
2981.8F61142945N74410O26505O05702M83453L16024j7404l87967o50644q38518r38297
3002.2F60916209j061022j195252j150131j012326j103639j380861j517534j563072
3018.5F50932372j687348j773954j791715j832426j824915j795948j829266j949132
3034.9F36447668k123177k166510k102553k153159k333641k460181k412737k340257
3051.2F18355453k414167k498269k469718k430618k412260k334833k211034k220452
$$ y = [640184104, 638715744, 637786150, 637456179, 637491941, 637760282, 638531387, 639985919, 641934216, 644175649, 646612167, 648975015, 650845766, 652031839, 652724445, 653078973, 653116941, 653092444, 653336763, 653885007, 654522479, 655161619, 655888379, 656702399, 657528520, 658280849, 658942580, 659666181, 660466731, 661142945, 661717355, 662343860, 662949562, 663433015, 663749039, 663731635, 663343668, 662693024, 661854506, 660916209, 659855187, 658659935, 657509804, 656497478, 655393839, 654012978, 652495444, 650932372, 649245024, 647471070, 645679355, 643846929, 642022014, 640226066, 638396800, 636447668, 634324491, 632157981, 630055428, 627902269, 625568628, 623108447, 620695710, 618355453, 615941286, 613443017, 610973299, 608542681, 606130421, 603795588, 601584554, 599364102]
3067.5E99364102k388060k427101k261579k122581k143979k293706k401889k386451
3083.8E80938756k398908k434730k405584k450824k568245k548754k403736k415598
3100.1E61312377k658605k814591k714753k615094k753258k832234k680123k660870
3116.4E39582849k850116l095925l296315l284693l137469l042281l058672l183782
3132.8E14633596l244102l173053l187836l372013l510147l477425l396571l329008
3149.1D87943441l328324l452569l581583l632576l656685l601641l506839l535539
3165.4D59647685l600329l581047l567785l585756l581166l589064l560483l509343
3181.7D31072712l506482l502786l487140l463626l440857l419637l400296l384918
$$ y = [599364102, 596976042, 594548941, 592287362, 590164781, 588020802, 585727096, 583325207, 580938756, 578539848, 576105118, 573699534, 571248710, 568680465, 566131711, 563727975, 561312377, 558653772, 555839181, 553124428, 550509334, 547756076, 544923842, 542243719, 539582849, 536732733, 533636808, 530340493, 527055800, 523918331, 520876050, 517817378, 514633596, 511389494, 508216441, 505028605, 501656592, 498146445, 494669020, 491272449, 487943441, 484615117, 481162548, 477580965, 473948389, 470291704, 466690063, 463183224, 459647685, 456047356, 452466309, 448898524, 445312768, 441731602, 438142538, 434582055, 431072712, 427566230, 424063444, 420576304, 417112678, 413671821, 410252184, 406851888, 403466970]
3198D03466970l342629l290087l247708l176033l152699l160029l085673l020138k977013
3216.4C75014961k956480k960503k896547k818287k788156k734661k618104k510965
3232.7C52731258k520115k584964k552181k460271k359599k234578k191097k255022
3249C33573431k289534k250284k164900k116323k110332k051055k029151k065301k020150
3267.4C14476401j938880j976311k071828k088785k085805k082467k014995j960605
3283.7B98256725j974642j980990j934529j909286j937925k012045k126783k098471
3300B82282054j921951j824618j863152j996219k126157k151936k090365k023160j982212
3318.4B64302284j910717j817435j816630j925200j986325j910716j828701j769498
$$ y = [403466970, 400124341, 396834254, 393586546, 390410513, 387257814, 384097785, 381012112, 377991974, 375014961, 372058481, 369097978, 366201431, 363383144, 360594988, 357860327, 355242223, 352731258, 350211143, 347626179, 345073998, 342613727, 340254128, 338019550, 335828453, 333573431, 331283897, 329033613, 326868713, 324752390, 322642058, 320591003, 318561852, 316496551, 314476401, 312537521, 310561210, 308489382, 306400597, 304314792, 302232325, 300217330, 298256725, 296282083, 294301093, 292366564, 290457278, 288519353, 286507308, 284380525, 282282054, 280360103, 278535485, 276672333, 274676114, 272549957, 270398021, 268307656, 266284496, 264302284, 262391567, 260574132, 258757502, 256832302, 254845977, 252935261, 251106560, 249337062]
3334.7B49337062j653939j614943j709193j763702j736909j620486j479507j541167
3351B36217216j679942j624853j437410j295299j287862j307667j156360j016572j131058
3369.3B24280193j325711j300827j037001q29369p91922q12352p16508m81814j99035
3387.7B16785654M9383R626l13193m12672j9968L30716R3312k92719j47953K43842
3408.1B16326028M19796L98457K85133K75806M64678O28710O78315Q31172J079142
3426.5B21387237J215816J147449J155123J316667J264840J014709R77114J243145
3442.8B30722100J553297J714080J660198J638174J761660J917720K120644K284184
3459.1B45372057K182752K166748K551109K761989K425552J964926J983822K374559
$$ y = [249337062, 247683123, 246068180, 244358987, 242595285, 240858376, 239237890, 237758383, 236217216, 234537274, 232912421, 231475011, 230179712, 228891850, 227584183, 226427823, 225411251, 224280193, 222954482, 221653655, 220616654, 219787285, 218995363, 218183011, 217466503, 216984689, 216785654, 216835037, 216844663, 216531470, 216118798, 216098830, 216429546, 216522858, 216230139, 216082186, 216326028, 216745824, 217144281, 217429414, 217705220, 218169898, 218798608, 219476923, 220308095, 221387237, 222603053, 223750502, 224905625, 226222292, 227487132, 228501841, 229478955, 230722100, 232275397, 233989477, 235649675, 237287849, 239049509, 240967229, 243087873, 245372057, 247554809, 249721557, 252272666, 255034655, 257460207, 259425133, 261408955, 263783514]
3475.4B63783514K731056K771884K516508K483576K755523K787918K678484K867400
3491.7B85375863L098250L158420L040493K994537L150105L088415K857447K970725
3508C09734255L342599L629237L570378L297091L340333L713995M097224L953606L505706
3526.4C42184424L527731L856480M106790M368097M470557M264146M321068M635871
3542.7C75735164M737973M461080M284501M537612M824340M861921M891813N094826
3559D13429230N185932M987330N022883N853474O184250N619049N454660N774021O042987
3577.4D63553816O262243O471127O425947O386787O637603O698757O404221O545663
3593.7E15386164O949067P152200P241190P191479O963193O876528P279218P466852
$$ y = [263783514, 266514570, 269286454, 271802962, 274286538, 277042061, 279829979, 282508463, 285375863, 288474113, 291632533, 294673026, 297667563, 300817668, 303906083, 306763530, 309734255, 313076854, 316706091, 320276469, 323573560, 326913893, 330627888, 334725112, 338678718, 342184424, 345712155, 349568635, 353675425, 358043522, 362514079, 366778225, 371099293, 375735164, 380473137, 384934217, 389218718, 393756330, 398580670, 403442591, 408334404, 413429230, 418615162, 423602492, 428625375, 434478849, 440663099, 446282148, 451736808, 457510829, 463553816, 469816059, 476287186, 482713133, 489099920, 495737523, 502436280, 508840501, 515386164, 522335231, 529487431, 536728621, 543920100, 550883293, 557759821, 565039039, 572505891]
3610E72505891P343293P322907P047236P236361P815302P218540O370544O254017P281363
3628.4F36395454P994354O965041O573618O514251O278396O219983O062090N711675
3644.7F88714862N764961O570220O352842M856646M403472M976094M912376M235029
3661G30786502L819228L705978L625691L633976L655672L174305K828062K727746K552391
3679.4G60509551K523601K605557K679408K704799K235472J595676J625717J779437
3695.7G78259218J680672J502037J472592J507700J443386J330495J253068J220048
3712G89669216J238405J163423R79424P87079O53804N82277O34790Q97050J083851
3730.3G97689319J133859J058638R13560Q35955O68586L27170K45511P48515P91252
$$ y = [572505891, 579849184, 587172091, 594219327, 601455688, 609270990, 616489530, 622860074, 629114091, 636395454, 644389808, 651354849, 657928467, 664442718, 670721114, 676941097, 683003187, 688714862, 694479823, 701050043, 707402885, 712259531, 716663003, 721639097, 726551473, 730786502, 734605730, 738311708, 741937399, 745571375, 749227047, 752401352, 755229414, 757957160, 760509551, 763033152, 765638709, 768318117, 771022916, 773258388, 774854064, 776479781, 778259218, 779939890, 781441927, 782914519, 784422219, 785865605, 787196100, 788449168, 789669216, 790907621, 792071044, 793050468, 793837547, 794491351, 795073628, 795708418, 796605468, 797689319, 798823178, 799881816, 800795376, 801631331, 802299917, 802627087, 802872598, 803621113, 804412365]
3748.7H04412365M03583L40879N73099O62505N65768M50849M30048M12821L78669L01301
3769.1H08931887K13564L15785N46515O75619M83632K17139J69218J32263J53959L40580
3789.5H12180161M67599M02033L40939M16577K85268N483J23978J51276L1591K22504
3809.9H14627409M18961L67045K81215L27230N1617j70529J27972K77578K41220K34366
3830.3H16784084K89678L46125J23798k39372j76549N5313J90556L13342L56019M6491
3850.7H18089485p11560m81486M75406N03958K33650Q5175J49488J41502j14382j66237
3871.1H18204999P272J57416K42471J46091J17421J39177n8353j57416o2704j6808
3891.5H18719566N2690J55986J41442m411j71304k34306p3552J31130J32382O5148
$$ y = [804412365, 804815948, 805156827, 805729926, 806392431, 806958199, 807409048, 807839096, 808251917, 808630586, 808931887, 809145451, 809461236, 810007751, 810683370, 811167002, 811384141, 811553359, 811685622, 811839581, 812180161, 812647760, 813049793, 813390732, 813807309, 814092577, 814098060, 814222038, 814373314, 814404905, 814627409, 815046370, 815413415, 815694630, 816021860, 816073477, 815902948, 816030920, 816308498, 816549718, 816784084, 817073762, 817419887, 817543685, 817304313, 817127764, 817183077, 817373633, 817686975, 818042994, 818089485, 817377925, 816896439, 817371845, 817875803, 818109453, 818194628, 818344116, 818485618, 818371236, 818204999, 818212271, 818369687, 818612158, 818758249, 818875670, 819014847, 818956494, 818799078, 818736374, 818719566, 818772256, 818928242, 819069684, 819065273, 818893969, 818659663, 818586111, 818717241, 818849623, 818914771]
3911.9H18914771O6817j5736j29878p5281j8060O437J07467J41502L6657k5332j2100
3934.3H18997264l457M7922N8234k7299j6868O6578K1219m3630K5987J11103R8229
3956.7H19335282O8724O0558L3260K3663N4836J27614J66893J01268M8458J25766K01345
3979.2H20347667J46448M8280J0252L5286N9247N2571Q7142J37210O7175
3997.5H20991278
$$ y = [818914771, 818981588, 818965852, 818835974, 818760693, 818742633, 818749070, 818856537, 818998039, 819034696, 819009364, 818997264, 818993807, 819041729, 819099963, 819072664, 819055796, 819122374, 819143593, 819099963, 819125950, 819237053, 819335282, 819404006, 819464564, 819497824, 819521487, 819576323, 819703937, 819870830, 819972098, 820020556, 820146322, 820347667, 820494115, 820542395, 820552647, 820587933, 820647180, 820699751, 820786893, 820924103, 820991278]
##END=$$ End of the data block
