##TITLE=$$ Begin of the data block
##JCAMP-DX=5.00 $$ ACD/SpecManager v 10.08
##SPECTROMETER/DATA SYSTEM=Alpha
##DATE=09 Apr 2014 11:14:46
##DATA TYPE=INFRARED SPECTRUM
##DATA CLASS=XYDATA
##ORIGIN=
##OWNER=
##NPOINTS=1765
##FIRSTX=399.75695801
##LASTX=3997.56933594
##MAXX=3997.56933594
##MINX=399.75695801
##MAXY=0.85160917
##MINY=0.21616653
##XFACTOR=1.0000000000
##YFACTOR=1.000000000000000e-9
##FIRSTY=0.58334726
##DELTAX=2.03957629
##XUNITS=1/CM
##YUNITS=ARBITRARY UNITS
##XYDATA=(X++(Y..Y))
399.8E83347261m206419m288971M40716J136899l369927l338099J522363K307713j962543
418.1E71588993k747357J262546p0989l776312j556754K222716m94480l807485n20825
436.5E62100053K364516p55906k645731Q80003J650989k450049k481520J890242J649201
454.8E62201798k907217k612769J541138K29895l579498j895725J819312l77297m237354
473.2E50182283j600325J607299j048446l427327k99811J883268j502394l307164Q345
491.5E42495728J061022k644897l292143M90785J000702k726018k661944R14037L60251
509.9E34997523l189147k378165R98735l38376l790080k236843O49750j271546l989994
528.3E19451857j710833Q38578j349807l533184r91285J285076j068175l033876o40512
$$ plain form
399.8 583347261 579140842 574851871 575292587 576429486 573059559 569721460 571243823 573551536 571588993
418.1 571588993 568841636 570104182 570033193 566256881 564700127 566922843 566428363 562620878 562100053
436.5 562100053 564464569 563708663 561062932 561942935 563593924 561143875 558662355 560552597 562201798
454.8 562201798 559294581 556681812 558222950 558452845 554873347 552977622 554796934 554419637 550182283
473.2 550182283 548581958 550189257 549140811 545713484 545413673 547296941 545794547 542487383 542495728
491.5 542495728 543556750 540911853 537619710 538110495 539111197 536385179 533723235 534637272 534997523
509.9 534997523 531808376 529430211 530428946 530090570 526300490 524063647 524713397 523441851 519451857
528.3 519451857 517741024 518579602 517229795 513696611 512705326 513990402 512922227 509888351 509247839
546.6E09247839R59754j637339k972186l63052M92335k517045l462553p60466l11881
565D98675406l348410l962010j192630j041859l926903l824651q52287j137018l802210
583.3D75587428l202916n44041j095951l699570l152162q51900j707613m006118l292560
601.7D54034597j409561k089977l080368j164854P58291n14895j596868J372129M625588
620D50934082L751070K324104M068434N558938L582001K005636L805012M904568K358019
638.4D83291864K15888J301140K364934J419037J284987K853751K020419j224637k72304
656.7D93255079N546957Q029431M857004J995444K890945N455672L616691K594531
673.1E28241754M478991M546284J827896J468718L871679L597737P20799P92741L320754
$$ plain form
546.6 509247839 510207593 508570254 505598068 505235016 505727351 503210306 499747753 498987287 498675406
565 498675406 495326996 491364986 490172356 489130497 485203594 481378943 480526656 479389638 475587428
583.3 475587428 472384512 471840471 470744520 467044950 463892788 463040888 461333275 457327157 454034597
601.7 454034597 452625036 450535059 447454691 446289837 447048128 446533233 444936365 446308494 450934082
620 450934082 454685152 457009256 461077690 466636628 470218629 472224265 476029277 480933845 483291864
638.4 483291864 483507752 484808892 487173826 488592863 489877850 492731601 494752020 493527383 493255079
656.7 493255079 498802036 506831467 511688471 513683915 516574860 522030532 525647223 528241754
673.1 528241754 532720745 537267029 539094925 540563643 544435322 548033059 548753858 549546599 552867353
691.4E52867353K721965p7843L21984K846658K316296N2452J082123L804087L069580
709.8E69004655P36654J950741M487812L231108P59483K245247M684925L142238O95705
728.1E90938568K126396M250645K425313J19627J776040L796994J907528L576K188385
746.5F09533072M234015K126933K95937K517998M202783J850784K63750K641082L944338
764.8F31610692J351892p4982K189875K892255k96056j878202L53634Q95441k057612
783.2F34986937k808750L02732J757026J87934J021266N078315O652832M792214M956722
801.6F56927228P761002P506370L925622L085851N187750M211843M70877j21832J631796
819.9F90586507q7380m094422m471958k478480l645658o376267n476952k912581l625988
$$ plain form
691.4 552867353 555589318 555511475 555833459 558680117 560996413 561048865 562130988 565935075 569004655
709.8 569004655 569741309 571692050 576179862 579410970 580170453 582415700 587100625 590242863 590938568
728.1 590938568 593064964 597315609 599740922 599860549 601636589 605433583 607341111 607344687 609533072
746.5 609533072 613767087 615894020 616189957 618707955 622910738 624761522 625025272 627666354 631610692
764.8 631610692 632962584 632887602 635077477 637969732 637673676 635795474 636149108 637044549 634986937
783.2 634986937 632178187 632480919 634237945 634425879 635447145 640525460 647178292 651970506 656927228
801.6 656927228 664688230 672194600 676120222 679206073 684393823 688605666 689076543 688954711 690586507
819.9 690586507 690499127 686404705 681932747 679454267 675808609 669432342 663955390 661042809 657416821
838.3F57416821n552352m115105j501262j894653k717793M03822M964113O296098O317675
856.6F59617364R004832J1843681J0652423Q188128Q805573R628118O556689L298164
872.9G27594972M290998N502641K458155q52108k12908N13733k294660m481018k594471
891.3G29925334o90341j828372k033830J123846L246844J654148N19395K321064K660990
909.6G36899078o82473l009320k074539k208948n006731n802691k984524j099527j778543
928G12251782j088321J735032K363682J16586m81426J359999J323282j120865j749217
946.4G14710534l17455j148283m323244n501926m754961o233454r585380j0929704
962.7F71916127j0860741j2905002j6058445j6543448j4856219j4074385j3684094
$$ plain form
838.3 657416821 651864469 647749364 646248102 644353449 641635656 642039478 647003591 653299689 659617364
856.6 659617364 668622196 680465877 691118300 699306428 708112001 717740119 724296808 727594972
872.9 727594972 731885970 737388611 739846766 738994658 738781750 739295483 737000823 732519805 729925334
891.3 729925334 729234993 727406621 725372791 726496637 729743481 731397629 731917024 734238088 736899078
909.6 736899078 736216605 733207285 731132746 728923798 723917067 718114376 715129852 714030325 712251782
928 712251782 711163461 712898493 715262175 715378761 714897335 716257334 717580616 716459751 714710534
946.4 714710534 714393079 713244796 708921552 703419626 698664665 692431211 682845831 671916127
962.7 671916127 661055386 648150384 632091939 615548491 600692272 586617887 572933793
977E72933793j1333585q301317p444084p881820o914258n122483m740834n001426l829479
995.3E12364507k120436j979649k562940j990437j441539k884596n020589n616605
1011.6D88747716n452275o249011p025540o202817m999846n197167n814046n187899
1027.9D42619115m215002m341245m589259l632665k526730k608925k953232k370119
1044.3D15381938j790851k285689k777010j962871o56307n4836M92901J646936K160221
1062.6D10154432R10431r46015j963526k719074l934503m631281m103184l517031l868461
1081C85381788m413635m439413m690051n572587n932838m920632l268689j878887n69493
1099.3C49695563Q43704J598418J253068P28339O62506L26723q52675k348154l798426
$$ plain form
977 572933793 561600208 553298891 545854807 537972987 531058729 525936246 521195412 516193986 512364507
995.3 512364507 510244071 508264422 505701482 503711045 502269506 499384910 494364321 488747716
1011.6 488747716 483295441 477046430 470020890 463818073 458818227 453621060 447807014 442619115
1027.9 442619115 438404113 434062868 429473609 425840944 423314214 420705289 417752057 415381938
1044.3 415381938 413591087 411305398 408528388 406565517 405909210 405854374 406347275 407994211 410154432
1062.6 410154432 411064863 410118848 408155322 405436248 401501745 396870464 392767280 389250249 385381788
1081 385381788 380968153 376528740 371838689 366266102 360333264 355412632 352143943 350265056 349695563
1099.3 349695563 350539267 352137685 353390753 354119092 354781598 355108321 354255646 351907492 348109066
1117.7C48109066n532085o577284m757136p01368J923830J650601L07292j24842Q64059
1136C35162133K386183L555029M170448L967255K956003K117485K090603K221793J993000
1154.4C60619932K072722L001630M185468N114228O324559Q095056R431482R657353
1170.7D08502430R537905R778917R699434Q765221P860899P491827O563663M431784
1187D72632080K327234J127720J5616j228809j325458J29371J792849K757459L596932
1205.4D81824994M399449M059612K587796J576036J575649J450479Q04960P01339J433223
1223.7E00413537J808107J502335J705348K611578K967179K595126K679050L296018
1240.1E19578278L177762K250075J850844K009272J489878M65691L31521J028121J243293
$$ plain form
1117.7 348109066 342576981 335999697 331242561 330541193 332465023 334115624 334422916 334298074 335162133
1136 335162133 337548316 341103345 345273793 349241048 352197051 354314536 356405139 358626932 360619932
1154.4 360619932 362692654 365694284 369879752 374993980 381318539 389413595 398845077 408502430
1170.7 408502430 418040335 427819252 437518686 446283907 454144806 461636633 468200296 472632080
1187 472632080 474959314 476087034 476102650 474873841 473548383 473677754 475470603 478228062 481824994
1205.4 481824994 486224443 490284055 492871851 494447887 496023536 497474015 498278975 498980314 500413537
1223.7 500413537 502221644 503723979 505429327 508040905 511008084 513603210 516282260 519578278
1240.1 519578278 522756040 525006115 526856959 528866231 530356109 530821800 531153321 532181442 533424735
1258.4E33424735J119137J904011L281474L891945L914892M613817N716920N862236
1274.7E63729167N393445N680085O438434O323576N697489O035804O824732O450653
1291F12573385N409837N254924N475760M631996L387690L192186L355384K480268J335919
1309.4F47097349J317382J644969R31323J34050O39499J425445J119137O59883J149892
1327.8F56118929J494468N80787m83393m32074k46406r95398j380920n71728L8266
1346.1F54122531m30286r38892n68509l47614j133859j715899j520097j838803k904594
1364.5F42723978l313363l211379l462255m892826o999076q553147j3261557k3172199
1380.8E75858176k6046396r115934J6272664K4159312J4745415P449865L758311N49495
$$ plain form
1258.4 533424735 534543872 536447883 539729357 543621302 547536194 552150011 557866931 563729167
1274.7 563729167 569122612 574802697 581241131 587564707 593262196 599298000 606122732 612573385
1291 612573385 617983222 623238146 628713906 633345902 636733592 639925778 643281162 645761430 647097349
1309.4 647097349 648414731 650059700 650991023 651125073 651764572 653190017 654309154 654969037 656118929
1327.8 656118929 657613397 658194184 657710791 657278717 657032311 656036913 654655993 654084265 654122531
1346.1 654122531 653692245 652753353 652184844 651837230 650703371 648987472 647467375 645628572 642723978
1364.5 642723978 639410615 636199236 632736981 627844155 620845079 612291932 599030375 575858176
1380.8 575858176 549811780 540695846 556968510 581127822 595873237 603323102 607081413 607630908
1397.1F07630908j512408j966059k253056l257393l363789k411007j979947j996518
1413.4E88890731j515388q77500q71896r17912m63545N4598J62541k77578j51277P26044
1433.8E84758818J114607R19759J185239J906931K213061K298474K923012L912032
1450.1F01231933M415810M801213P069529R813249P779360O437897P694245Q550226
1466.4F57793462P582188P691920R857714R953737P406354N535722M681408M166365
1482.8G14668870K993643J556754L36767n58377j170277k034605l252685l692508l539085
1501.1G05308497l347218m226208p671892p560373n679071n086124m594862m368842
1517.4F62773907l895581l911793l717601l442884l783166l014207k490342l324389
$$ plain form
1397.1 607630908 606118500 604152441 601899385 598641992 595278203 592867196 590887249 588890731
1413.4 588890731 587375343 586497843 585625947 584708035 584244490 584299088 584461629 584184051 584032774 584758818
1433.8 584758818 585873425 586793184 587978423 589885354 592098415 594396889 597319901 601231933
1450.1 601231933 605647743 610448956 617518485 627331734 635111094 641548991 649243236 657793462
1466.4 657793462 665375650 673067570 682925284 692879021 700285375 705821097 710502505 714668870
1482.8 714668870 717662513 719219267 719556034 718997657 717827380 715792775 712540090 708847582 705308497
1501.1 705308497 701961279 697735071 690063179 682502806 676823735 671737611 667142749 662773907
1517.4 662773907 658878326 654966533 651248932 647806048 644022882 641008675 638518333 635193944
1533.7F35193944k895951j585245j836777k452910j519203m57883K82526M16756N35011
1552.1F25680268J109183J562297P43985j061857p87377q43286j668811k928436m190743
1570.5F17615223l894448m518092p316172p173956o003558o828308p581830p707715
1586.8E66591144p878900q328974q485794q339167q091092p931888p875860p628083
1603.1E02031386p276595p310867p542789p059604o190985o830395q408785o420791
1619.4D44990575n009293o099403n985797n018025m408241l295332k618402k827257
1635.7D09728825j776934k40504P25954J566530K548039L258735K982229L898322O171435
1654.1D28862631N144775M651785N733580P134020P535517O860942Q011430R809256
$$ plain form
1533.7 635193944 632297993 630712748 628875971 626423061 624903858 624445975 624728501 625145257 625680268
1552.1 625680268 626789451 628351748 629095733 628033876 627246499 626403213 624734402 621805966 617615223
1570.5 617615223 613720775 609202683 601886511 594712555 588708997 581880689 574298859 566591144
1586.8 566591144 558712244 550383270 541897476 533558309 525467217 517535329 509659469 502031386
1603.1 502031386 494754791 487443924 479901135 472841531 466650546 459820151 451411366 444990575
1619.4 444990575 439981282 433881879 427896082 422878057 418469816 415174484 412556082 409728825
1635.7 409728825 407951891 407711387 408437341 410003871 412551910 415810645 418792874 422691196 428862631
1654.1 428862631 434007406 438659191 444392771 451526791 459062308 465923250 473934680 483743936
1670.4D83743936Q859247R239733J0554492R726584R140134J0632634J4275372J2476147
1686.7E68648279J0135650J0760248J0334373J1540472J3041020J3028621J4872313
1701F52360976J2098253J0100781J0381043R050489P952630P308305P057428P430255
1717.3G23740160O293059M666805M444957M691422M431903M113257L858388M305184
1733.6G60545135M189252L328562L642500M046976L836215L564119L558338L661692
1749.9G90372789L297806K648711K599299K675474K292573J918435J776338J868367
1766.3H09449792J895070J799464J746416J578629J279652J205087J347721J433789
1782.6H21735620J250089J069605J219273J329481J049996P70151R49622J097679R26256
$$ plain form
1670.4 483743936 492603183 501842916 512397408 522123992 531264126 541896760 556172132 568648279
1686.7 568648279 578783929 589544177 599878550 611419022 624460042 637488663 652360976
1701 652360976 664459229 674560010 684941053 693991542 701944172 709252477 716309905 723740160
1717.3 723740160 730033219 734700024 739144981 743836403 748268306 752381563 756239951 760545135
1733.6 760545135 764734387 768062949 771705449 775752425 779588640 783152759 786711097 790372789
1749.9 790372789 793670595 796319306 798918605 801594079 803886652 805805087 807581425 809449792
1766.3 809449792 811344862 813144326 814890742 816469371 817749023 818954110 820301831 821735620
1782.6 821735620 822985709 824055314 825274587 826604068 827654064 828424215 829373837 830471516 831397772
1800.9H31397772P06434P72238Q87513P41720N51522O26087P75218O33300N21123O71744
1821.3H38284671P40111N45979M65929N62728N05030L81052L80755N10990N69344N07236
1841.7H43453825L83973L45349L55840K93195L04401L97682L88503K49624K52486M14371
1862.1H46839249M96566L96908K37643J49072J14321J01149J67311K74658K36809J46866
1882.5H49160552K25782L46661J93298k9683P9930K40385J63496Q1598J69278J97053
1902.9H50828350P5459Q226Q3208J52587J28925J22846J34944P4625n7756j31548j6332
1925.3H51403534O6936m4286q3387J6690L933j05977q8274r418q4579j95801j66535
1947.8H50712836p0214r5904k29419k28107j12712j18434k26081j76370m8220j18137
$$ plain form
1800.9 831397772 832104206 832876444 833763957 834505677 835057199 835683286 836458504 837091804 837612927 838284671
1821.3 838284671 839024782 839570761 840036690 840599418 841104448 841485500 841866255 842377245 842946589 843453825
1841.7 843453825 843837798 844183147 844538987 844832182 845136583 845534265 845922768 846172392 846424878 846839249
1862.1 846839249 847335815 847732723 847970366 848119438 848233759 848334908 848502219 848776877 849013686 849160552
1882.5 849160552 849386334 849732995 849926293 849896610 849976540 850216925 850380421 850462019 850631297 850828350
1902.9 850828350 850903809 850912035 850995243 851147830 851276755 851399601 851534545 851609170 851551414 851419866 851403534
1925.3 851403534 851470470 851426184 851342797 851359487 851363420 851257443 851169169 851159751 851075172 850879371 850712836
1947.8 850712836 850642622 850546718 850317299 850089192 849976480 849858046 849631965 849455595 849407375 849289238
1968.2H49289238k75313k38538q3327j01626k31505k03907p3433j21773k59339j98424
1988.6H47502053q2016j84238l08156k07961j08897k10345l41594k59400j16408j96635
2009H45486403l12329j80840q9646k96950m41372k67625r5070k18868l60668k29537
2029.4H42993498j05739k84254m29154k30253m6193j77324l22223k08199j10447k32756
2049.8H40846956l20733j71780n6863j66297k31624q9705k5570k22624k99513q3864
2070.2H39178383K8015j41323k27928p6115j5855j59621j99736m2617j8179j98543
2090.5H38126481k08795L8385J17063o9379j14680P8023J05977j10090j34587P3015
2110.9H37901413R7633j06812j22964J06752J56820l8326m8816J70588J86980l3140
$$ plain form
1968.2 849289238 849013925 848775387 848692060 848590434 848358929 848155022 848081589 847959816 847700477 847502053
1988.6 847502053 847420037 847235799 846927643 846719682 846610785 846400440 846058846 845799446 845683038 845486403
2009 845486403 845174074 844993234 844903588 844606638 844165266 843897641 843802571 843583703 843223035 842993498
2029.4 842993498 842887759 842603505 842174351 841944098 841897905 841720581 841398358 841190159 841079712 840846956
2049.8 840846956 840526223 840354443 840297580 840131283 839899659 839809954 839784384 839561760 839262247 839178383
2070.2 839178383 839206398 839065075 838837147 838761032 838745177 838585556 838385820 838343203 838325024 838126481
2090.5 838126481 837917686 837956071 838073134 838003755 837889075 837967098 838073075 837962985 837828398 837901413
2110.9 837901413 837999046 837892234 837769270 837876022 838032842 837994516 837945700 838116288 838303268 838270128
2131.3H38270128l6896K06411J86384m8637l398K30909K06172n960J1921K09331J83582
2153.8H39409947r954N4360K79307K27332Q226N0783K55525K16186J8239Q0526K94387
2176.2H40884864J88947n2333O8605L20077J96099o5505K5511K45213J45018p1525
2196.6H41884971K3961K21014Q7440j33395N960K30253R6023j21951o795K11060J10030
2219H42608571j11282j3172J85549N6088j49131l4750J38998J20j87695l4392J68979
2241.5H42627883p927k19703n1439J21951m2617j97411k1696J55568o3538l04580j04427
2263.9H41892064J55329L0697j07527J06871K58982N0843r5665J00016K34723K3186
2284.3H42649519j63137k9266M7207k07127l53038j55151m0889k37941l87967l11911
$$ plain form
2131.3 838270128 838233232 838439643 838626027 838577390 838573992 838804901 839011073 839005113 839017034 839226365 839409947
2153.8 839409947 839399993 839454353 839733660 839960992 839969218 840020001 840275526 840491712 840509951 840590477 840884864
2176.2 840884864 841073811 841021478 841090083 841410160 841606259 841540754 841566265 841811478 841956496 841884971
2196.6 841884971 841908932 842129946 842217386 842083991 842089951 842320204 842416227 842294276 842287481 842498541 842608571
2219 842608571 842497289 842484117 842669666 842725754 842576623 842541873 842680871 842680991 842493296 842458904 842627883
2241.5 842627883 842619956 842400253 842348814 842470765 842428148 842230737 842209041 842364609 842301071 841996491 841892064
2263.9 841892064 842047393 842078090 841970563 842077434 842336416 842387259 842291594 842391610 842626333 842649519
2284.3 842649519 842486382 842457116 842504323 842297196 841944158 841789007 841748118 841510177 841122210 840810299
2304.7H40810299l40223n73457o17087l12089j88709n85079r18329p37846m77314n07593
2325.1H35552573o01411m44173k22087l11792m11213k03013r3222j41680M62115J730144
2345.5H35316241J825630K73586j384020k003551j749336j374364o92666L12865J025796
2363.8H31550181J355946J756072K142906K144098J825095J691401J827001J741469
2380.2H46034169J343429J028836Q57651N44668J31785K3425J97709J90019p331p15
2400.6H50343645J85728J68562m5061q8573N2154K8551j49131j24455L4750j10269
2421H50295901n06341n64933r4473L22282L18527K73407L31700J86681q5175r1552
2441.3H50386024R2983L9756j63376p0036J62483N0067k41041j98424O3599L5107j94669
$$ plain form
2304.7 840810299 840470076 839896619 839279532 838967443 838778734 838193655 837275326 836537480 836060166 835552573
2325.1 835552573 834951162 834506989 834284902 833973110 833561897 833358884 833265662 833123982 833586097 835316241
2345.5 835316241 837141871 837415457 836031437 834027886 832278550 830904186 830211520 830524385 831550181
2363.8 831550181 832906127 834662199 836805105 838949203 840774298 842465699 844292700 846034169
2380.2 846034169 847377598 848406434 849264085 849808753 849940538 849963963 850161672 850351691 850344360 850343645
2400.6 850343645 850529373 850697935 850652874 850564301 850616455 850645006 850495875 850371420 850406170 850295901
2421 850295901 849789560 849224627 849130154 849452436 849770963 850044370 850376070 850562751 850477576 850386024
2441.3 850386024 850479007 850518763 850355387 850285351 850447834 850497901 850256860 850058436 850122035 850157142 849962473
2463.8H49962473j60873N3704J3411k07007j79231J9967j6033k07782j45555N0664
2484.2H49183738m5597k55704j76370L814q7797k63214j55509L6061o7294k70664j84775
2506.6H47716689J2219m8697k11716j32024M4227n9366k81930k04385n424j04904k90275
2529H46434414j54316N2631p0155k86937j90436r180j50501l04222r8527P5340j11877
2551.5H45186234l17753k23398p2360j72496l15309j84655p689j38640l47436k93374
2571.9H43113124j68025k69652m10437k85387j32203k89619m81487l73482k29240l42846
2592.3H40130746m70101l34263k23101m20629o02842m72009l38554m92275o09696m08411
2612.7H35758865k66552m81069o44505n01156l99709n39660o13034m23610l12925n01990
$$ plain form
2463.8 849962473 849801600 849855304 849868715 849661708 849482477 849502444 849486411 849278629 849133074 849183738
2484.2 849183738 849138141 848882437 848706067 848709881 848622084 848358870 848203361 848239422 848172128 847901464 847716689
2506.6 847716689 847728908 847680211 847468495 847336471 847380698 847321332 847039402 846835017 846829593 846724689 846434414
2529 846434414 846280098 846332729 846262574 845975637 845785201 845776021 845625520 845321298 845222771 845298111 845186234
2551.5 845186234 844868481 844645083 844572723 844400227 844084918 843900263 843892574 843753934 843406498 843113124
2571.9 843113124 842945099 842675447 842265010 841979623 841847420 841557801 841076314 840702832 840473592 840130746
2592.3 840130746 839660645 839326382 839103281 838682652 838079810 837607801 837269247 836776972 836167276 835758865
2612.7 835758865 835492313 835011244 834366739 833865583 833465874 832926214 832313180 831889570 831576645 831074655
2633.1H31074655o43969n10573m14014n39601n68091l53992l12686n81205o77884m66704
2653.5H26005936l75867n31733n41389l08812k72751n30779o37889m65572l93152n41687
2673.9H21406305n59569l60071l52204n80728o19769m57764m53889o03199n92172m20809
2694.3H16406131m40300o80148o98448m79400m94420o97613o77228n12958n62608p37369
2714.6H10425639o86765n03242n36501p01487o49035m83930n68569p82728p44343n38409
2735H04230630n53667p29084o59943m47631n09262o87659o53088n51879o13272p77483
2755.4G98047662p76112o32823p07030q97706p82013n45799o18875q10862p79152p25448
2775.8G90771842q92758j027108r28878q22723q86858j022279j023352r24468j015783
$$ plain form
2633.1 831074655 830430686 829920113 829506099 828966498 828398407 828044415 827731729 827150524 826472640 826005936
2653.5 826005936 825630069 825098336 824556947 824248135 823975384 823444605 822806716 822341144 821947992 821406305
2673.9 821406305 820846736 820486665 820134461 819553733 818933964 818476200 818022311 817419112 816826940 816406131
2694.3 816406131 815965831 815285683 814587235 814107835 813613415 812915802 812238574 811725616 811163008 810425639
2714.6 810425639 809738874 809235632 808699131 807997644 807348609 806864679 806296110 805513382 804769039 804230630
2735 804230630 803676963 802947879 802287936 801840305 801331043 800643384 799990296 799438417 798825145 798047662
2755.4 798047662 797271550 796638727 795931697 795033991 794251978 793706179 793087304 792276442 791497290 790771842
2775.8 790771842 789879084 788851976 787923098 787100375 786213517 785191238 784167886 783243418 782227635
2794.2G82227635j200854j163543j066446j159251j291632j249254j168788j285195
2810.5G72642672j435339j367510j288831j437068j561165j492202j485109j654625
2826.8G60920823j808882j835108j908839k191603k517462k786159l264606m079521
2843.1G40528643m891395n097330m350662l016234j777053j065671r65297j248062
2859.5G18116939j599193j922428k333641k771259k895653k638936k346575k147973
2875.8F99461281j855135j532674j451730j608134j758337j790702j879752k090752
2892.1F85494065k214312k227903k303302k424717k475798k545476k816260l272951
2908.4F65213346l765940m217744m493296m285038l547370k665103j961767j437545
$$ plain form
2794.2 782227635 781026781 779863238 778796792 777637541 776345909 775096655 773927867 772642672
2810.5 772642672 771207333 769839823 768550992 767113924 765552759 764060557 762575448 760920823
2826.8 760920823 759111941 757276833 755367994 753176391 750658929 747872770 744608164 740528643
2843.1 740528643 735637248 730539918 726189256 723173022 721395969 720330298 719365001 718116939
2859.5 718116939 716517746 714595318 712261677 709490418 706594765 703955829 701609254 699461281
2875.8 699461281 697606146 696073472 694621742 693013608 691255271 689464569 687584817 685494065
2892.1 685494065 683279753 681051850 678748548 676323831 673848033 671302557 668486297 665213346
2908.4 665213346 661447406 657229662 652736366 648451328 644903958 642238855 640277088 638839543
2924.7F38839543q93891l57866n0068K38538Q05020J495361J994372K272188K455235
2943.1F46798432K369702J837492J152515O85990L45111K9743j2994K66969N56946
2961.4F54029906O27994O37353P60555Q65221Q35896P26878O38664P02202Q01385O90639
2981.8F61316693N63979O29902O37472M82797K82765k7419l69489o34789q30889r10044
3002.2F61140978j030326j221656j192272j017511j088619j353681j513005j580417
3018.5F51143491j675307j764060j824200j851022j811325j777173j792073j922011
3034.9F36726320k124429k155185k079427k155721k369940k489388k389610k297759
3051.2F18664861k411068k519011k491355k446473k403617k317309k208650k202630
$$ plain form
2924.7 638839543 637945652 637587786 637537718 637776256 638581276 640076637 642071009 644343197 646798432
2943.1 646798432 649168134 651005626 652158141 652844131 653189242 653218985 653205991 653472960 654029906
2961.4 654029906 654657900 655295253 656055808 656921029 657756925 658483803 659122467 659824669 660626054 661316693
2981.8 661316693 661880672 662510574 663148046 663630843 663913608 663886189 663516700 662881911 662051022 661140978
3002.2 661140978 660110652 658888996 657696724 656679213 655590594 654236913 652723908 651143491
3018.5 651143491 649468184 647704124 645879924 644028902 642217577 640440404 638648331 636726320
3034.9 636726320 634601891 632446706 630367279 628211558 625841618 623352230 620962620 618664861
3051.2 618664861 616253793 613734782 611243427 608796954 606393337 604076028 601867378 599664748
3067.5E99664748k331913k403736k315342k171517k148270k291620k383649k371908
3083.8E81246793k419293k439320k379119k429843k549470k532303k434552k479851
3100.1E61583042k673507k763688k676249k640128k783000k821863k674878k690851
3116.4E39858878k882004l088236l248215l248453l141522l049851l065288l226995
3132.8E14908314l303707l187120l169000l363550l496408l447294l363192l309191
3149.1D88268852l341764l494233l611505l612757l607779l602833l568411l549844
3165.4D59879726l562271l589660l609896l615618l576487l522486l518670l542304
3181.7D31342334l526569l478706l437996l428459l461957l473133l423512l353536
$$ plain form
3067.5 599664748 597332835 594929099 592613757 590442240 588293970 586002350 583618701 581246793
3083.8 581246793 578827500 576388180 574009061 571579218 569029748 566497445 564062893 561583042
3100.1 561583042 558909535 556145847 553469598 550829470 548046470 545224607 542549729 539858878
3116.4 539858878 536976874 533888638 530640423 527391970 524250448 521200597 518135309 514908314
3132.8 514908314 511604607 508417487 505248487 501884937 498388529 494941235 491578043 488268852
3149.1 488268852 484927088 481432855 477821350 474208593 470600814 466997981 463429570 459879726
3165.4 459879726 456317455 452727795 449117899 445502281 441925794 438403308 434884638 431342334
3181.7 431342334 427815765 424337059 420899063 417470604 414008647 410535514 407112002 403758466
3198D03758466l332197l328085l277421l195465l150433l130168l075510l027201k988934
3216.4C75253052k949000k919465k929002k913684k800733k684295k594769k520442
3232.7C52941662k540409k581060k536238k462387k343625k202034k175837k297700
3249C33802372k355605k217829k106935k147526k182632k146215k091586k005190j915067
3267.4C14633787j879573j935125k068907k148538k132714k059609j980096j988083
3283.7B98441142j982302j909166j905740j950502j985878k022117k045333k043128
3300B82596976j999081j932025j911938j974553k086609k148301k091050k001077j979828
3318.4B64472514j945138j826793j791268j926214j996606j913429j858890j748576
$$ plain form
3198 403758466 400426269 397098184 393820763 390625298 387474865 384344697 381269187 378241986 375253052
3216.4 375253052 372304052 369384587 366455585 363541901 360741168 358056873 355462104 352941662
3232.7 352941662 350401253 347820193 345283955 342821568 340477943 338275909 336100072 333802372
3249 333802372 331446767 329228938 327122003 324974477 322791845 320645630 318554044 316548854 314633787
3267.4 314633787 312754214 310819089 308750182 306601644 304468930 302409321 300429225 298441142
3283.7 298441142 296458840 294549674 292643934 290693432 288707554 286685437 284640104 282596976
3300 282596976 280597895 278665870 276753932 274779379 272692770 270544469 268453419 266452342 264472514
3318.4 264472514 262527376 260700583 258909315 256983101 254986495 253073066 251214176 249465600
3334.7B49465600j563073j583918j758501j831934j776889j598910j413867j486957
3351B36451551j675829j677200j490176j282096j255929j285985j127378j014709j169816
3369.3B24472433j373082j288489r73031q06048q04678q14527p26819n02273k26319
3387.7B16957167j5348p7427l51921l45945Q2627L56659Q5593k74823j31115K56270
3408.1B16541737M36336L90455K41727K62111M97371O27846O50331P95022J013413
3426.5B21456349J200691J195758J196280J381711J309007R60603R25750J243249J526862
3444.8B32396260J665771J676410J721219J815885J944885K152740K274916K135709
3461.1B47783795K113283K522483K781332K429992J936137J984269K376258K717942
$$ plain form
3334.7 249465600 247902527 246318609 244560108 242728174 240951285 239352375 237938508 236451551
3351 236451551 234775722 233098522 231608346 230326250 229070321 227784336 226656958 225642249 224472433
3369.3 224472433 223099351 221810862 220837831 220031783 219227105 218412578 217685759 217183486 216957167
3387.7 216957167 216941819 216864392 216512471 216166526 216249153 216605812 216691405 216416582 216285467 216541737
3408.1 216541737 216978073 217368528 217610255 217872366 218369737 218997583 219647914 220442936 221456349
3426.5 221456349 222657040 223852798 225049078 226430789 227739796 228700399 229626149 230869398 232396260
3444.8 232396260 234062031 235738441 237459660 239275545 241220430 243373170 245648086 247783795
3461.1 247783795 249897078 252419561 255200893 257630885 259567022 261551291 263927549 266645491
3477.4B66645491K766848K486765K437592K737969K840251K752244K854347L046990
3493.8B88568497L163159L071576K999902L145218L121346K909720K999663L343165
3510.1C13322246L573805L498227L308415L400445L700823L993958L882348L560543
3526.4C42240810L634841L908902M095674M310876M408687M272968M403621M715502
3542.7C75991881M745304M431040M288315M536301M780650M822106M899561N124450
3559D13619608N185097M975468N042017N866676O148636N590082N465865N784720O019473
3577.4D63697642O231397O469101O426126O369054O651283O758630O443679O535948
3593.7E15582860O928026P133246P228076P204592O937743O782949P211983P464528
$$ plain form
3477.4 266645491 269412339 271899104 274336696 277074665 279914916 282667160 285521507 288568497
3493.8 288568497 291731656 294803232 297803134 300948352 304069698 306979418 309979081 313322246
3510.1 313322246 316896051 320394278 323702693 327103138 330803961 334797919 338680267 342240810
3526.4 342240810 345875651 349784553 353880227 358191103 362599790 366872758 371276379 375991881
3542.7 375991881 380737185 385168225 389456540 393992841 398773491 403595597 408495158 413619608
3559 413619608 418804705 423780173 428822190 434688866 440837502 446427584 451893449 457678169 463697642
3577.4 463697642 469929039 476398140 482824266 489193320 495844603 502603233 509046912 515582860
3593.7 515582860 522510886 529644132 536872208 544076800 551014543 557797492 565009475 572474003
3610E72474003P352173P357776P140339P317781P801652P196665O384015O242693P273256
3628.4F36540353Q010269O935715O557644O582021O332100O187320O021618N683065
3644.7F88850105N706012O503224O336570M896760M462958N023777M932463M247844
3661G30959713L865898L707051L475368L440500L584742L171742K860129K841175K702772
3679.4G60609090K604246K538681K520681K551258K213537J738131J771629J857281
3695.7G78404534J706898J506865J431942J421213J389027J318157J219093J208544
3712G89606273J326382J207412R31143P43926O68347O35266O87838R46223J094223
3730.3G97847033J013696Q43286Q46982R20594P11560L34800L30925Q09609P33316
$$ plain form
3610 572474003 579826176 587183952 594324291 601642072 609443724 616640389 623024404 629267097 636540353
3628.4 636540353 644550622 651486337 658043981 664626002 670958102 677145422 683167040 688850105
3644.7 688850105 694556117 701059341 707395911 712292671 716755629 721779406 726711869 730959713
3661 730959713 734825611 738532662 742008030 745448530 749033272 752205014 755065143 757906318 760609090
3679.4 760609090 763213336 765752017 768272698 770823956 773037493 774775624 776547253 778404534
3695.7 778404534 780111432 781618297 783050239 784471452 785860479 787178636 788397729 789606273
3712 789606273 790932655 792140067 793071210 793815136 794483483 795118749 795806587 796752810 797847033
3730.3 797847033 798860729 799704015 800550997 801471591 802183151 802517951 802848876 803658485 804391801
3748.7H04391801L78728M21465O15596O23048N48839M96507M51148M29868M06623L00288
3769.1H09063911K28525L30865N20885O57678M94599K07901J27614J25885J85966L35813
3789.5H12279642M37677M12821L83973M06981K29120J5259J31309N8830p928K77698
3809.9H14625382M56751L80814K51472K54989J9133j62542J40309L25084K65479J65284
3830.3H16722155K33471L57389J18316k44201j05023J53184K21312K62320K79546K9981
3850.7H18028450o10411m49956L88980M81189K76625R3102O8307P8321j21296j52170
3871.1H18081141Q5890K47419K42412N5015L2306J23262o6698j33752J8179N0485Q5771
3893.5H18821430J57595R6857r2327k48254k35319o2942J18255J68086J53362J41800
$$ plain form
3748.7 804391801 804770529 805191994 805807590 806430638 806979477 807475984 807927132 808357000 808763623 809063911
3769.1 809063911 809292436 809623301 810144186 810801864 811296463 811504364 811631978 811757863 811943829 812279642
3789.5 812279642 812717319 813130140 813514113 813921094 814150214 814165473 814296782 814355612 814347684 814625382
3809.9 814625382 815082133 815462947 815714419 815969408 815988541 815825999 815966308 816291392 816556871 816722155
3830.3 816722155 816955626 817313015 817431331 817187130 817082107 817235291 817456603 817718923 817998469 818028450
3850.7 818028450 817418039 816968083 817357063 817838252 818114877 818207979 818276286 818354607 818233311 818081141
3871.1 818081141 818167031 818414450 818656862 818711877 818744183 818867445 818800747 818666995 818685174 818735659 818821430
3893.5 818821430 818979025 819075882 818983555 818735301 818499982 818437040 818555295 818723381 818876743 819018543
3913.9H19018543P152j62124r9302K7240P8737R9183N2392j5914j1683O2823O8248
3936.3H19125295j610l8385j7703N1022N8472l874j371M7684Q9883J19508J14202P6473
3960.8H19619596L1531J4901N9843J16646J27137J32084J24395R7334P4089R8467J40965
3983.2H20636988P2181k3306p033N0366J29879J75833P7784
3997.5H21112692
$$ plain form
3913.9 819018543 819025695 818863571 818764269 818791509 818870246 818969429 819021821 819005907 818994224 819057047 819125295
3936.3 819125295 819123685 819085300 819067597 819118619 819177091 819173217 819171846 819219530 819309413 819428921 819543123 819619596
3960.8 819619596 819651127 819666028 819725871 819842517 819969654 820101738 820226133 820323467 820397556 820496023 820636988
3983.2 820636988 820709169 820685863 820678830 820729196 820859075 821034908 821112692
3997.5 821112692
##END=$$ End of the data block
