##TITLE=$$ Begin of the data block
##JCAMP-DX=5.00 $$ ACD/SpecManager v 10.08
##SPECTROMETER/DATA SYSTEM=Alpha
##DATE=09 Apr 2014 11:14:46
##DATA TYPE=INFRARED SPECTRUM
##DATA CLASS=XYDATA
##ORIGIN=
##OWNER=
##NPOINTS=1765
##FIRSTX=399.75695801
##LASTX=3997.56933594
##MAXX=3997.56933594
##MINX=399.75695801
##MAXY=0.85156536
##MINY=0.21646367
##XFACTOR=1.0000000000
##YFACTOR=1.000000000000000e-9
##FIRSTY=0.58275259
##DELTAX=2.03957629
##XUNITS=1/CM
##YUNITS=ARBITRARY UNITS
##XYDATA=(X++(Y..Y))
399.8E82752585m306852m611612K84910Q93593l290415k817213J963437K433776j866102
$$ 582752585 578445733 573834121 574119031 575012624 571722209 568904996 570868433 573302209 571436107
418.1E71436107k495885J030505o80327l764630j152217K075314n70833l388465l41594
$$ 571436107 568940222 569970727 569290400 565525770 564373553 566448867 565878034 562489569 562147975
436.5E62147975K095282j019299k477109J222968J701176k588749k535820J965105
$$ 562147975 564243257 563223958 560746849 561969817 563670993 561082244 558546424 560511529
452.8E60511529J705647k928078k709568J287520m8160l562034j712203J818955l89874
$$ 560511529 562217176 559289098 556579530 557867050 557818890 554256856 552544653 554363608 553973734
471.1E53973734m030346j446188J547456j164437l456532k89858J747131j625359l113210
$$ 553973734 549943388 548497200 550044656 548880219 545423687 545133829 546880960 545255601 542142391
489.5E42142391L56913J252591k609014l345966L04699P81297k678633k412200R95756
$$ 542142391 542499304 543751895 541142881 537796915 538101614 538882911 536204278 533792078 534787834
507.9E34787834K26497l365457k497732R28461l20852l654122k147734N94556j332462
$$ 534787834 535014331 531648874 529151142 530079603 529758751 526104629 523956895 524551451 523218989
526.2E23218989l937602j721978P53820j275718l384292r70245J203359j164973l053129
$$ 523218989 519281387 517559409 518313229 517037511 513653219 512682974 513886333 512721360 509668231
544.6E09668231n09918J040638j780927l066361k49625O34373k372206l370374q89748
$$ 509668231 509158313 510198951 508418024 505351663 505102038 505736411 503364205 499993831 499104083
562.9D99104083n26548l405094l945529j321525j175612l810823l587902p82638j213104
$$ 499104083 498577535 495172441 491226912 489905387 488729775 484918952 481331050 480548412 479335308
581.3D79335308l817022l155291n16027j097709l709644l085703p10547j619488m011124
$$ 479335308 475518286 472362995 471846968 470749259 467039615 463953912 463243365 461623877 457612753
599.6D57612753l358871j510650k085954k997964j219958N87642n60850j424044J438409
$$ 457612753 454253882 452743232 450657278 447659314 446439356 447026998 446466148 445042104 446480513
618D46480513M460394L720582K432256M049063N494535L651977K140522L855318M878938
$$ 446480513 450940907 454661489 457093745 461142808 466637343 470289320 472429842 476285160 481164098
636.3D81164098K301961J23948J235843K401858J544535J331002K773374K046406j085609
$$ 481164098 483466059 483590007 484825850 487227708 488772243 490103245 492876619 494923025 493837416
654.7D93837416k11000N535930Q002609M779637J918674K922594N532086L610194K602756
$$ 493837416 493626416 499162346 507164955 511944592 513863266 516785860 522317946 525928140 528530896
673.1E28530896M527211M517674J663804J343728L954470L793537Q23975P65502L275693
$$ 528530896 533058107 537575781 539239585 540583313 544537783 548331320 549155295 549920797 553196490
691.4E53196490K728522r8884K33650K780378K306282R1612J141787L865778L128112
$$ 553196490 555925012 555826128 556059778 558840156 561146438 561238050 562379837 566245615 569373727
709.8E69373727P69675J958966M470467L230572P84099K237261M632234L092766O97792
$$ 569373727 570143402 572102368 576572835 579803407 580587506 582824767 587457001 590549767 591247559
728.1E91247559K182900M287363K349674K6167J787126L843605J946092Q0883K269447
$$ 591247559 593430459 597717822 600067496 600093663 601880789 605724394 607670486 607751369 610020816
746.5F10020816M224480K017021K09093K512038M201650J877129K86222K599776L979504
$$ 610020816 614245296 616262317 616471410 618983448 623185098 625062227 625348449 627948225 631927729
764.8F31927729J468658n3644K090573K749384m13776j917302L52203R02892k010942
$$ 631927729 633396387 633342743 635433316 638182700 637768924 635851622 636203825 637106717 635095775
783.2F35095775k767682K78354J728475K40266J147390N190491O629884M690230M914761
$$ 635095775 632328093 632606447 634334922 634575188 635722578 640913069 647542953 652233183 657147944
801.6F57147944P755578P451832L805399L001809N229115M294217M64797j52528J658022
$$ 657147944 664903522 672355354 676160753 679162562 684391677 688685894 689150691 688998163 690656185
819.9F90656185q9109m161119m504383k417564l604770o410181n476773k883792l652334
$$ 690656185 690567076 686405957 681901574 679484010 675879240 669469059 663992286 661108494 657456160
838.3F57456160n578995m097104j471579j864553k720237L79682M980385O315172O272972
$$ 657456160 651877165 647780061 646308482 644443929 641723692 642103374 647083759 653398931 659671903
856.6F59671903Q993804J1937022J0701597Q120418Q738041R607493O547392L323376
$$ 659671903 668665707 680602729 691304326 699424744 708162785 717770278 724317670 727641046
872.9G27641046M307151N443990K378345q91924j77145N83529k286076m482746k526701
$$ 727641046 731948197 737392187 739770532 738878608 738701463 739284992 736998916 732516170 729989469
891.3G29989469o38962j863181k095938J101673L234088J629353N45978K342641K598525
$$ 729989469 729350507 727487326 725391388 726493061 729727149 731356502 731902480 734245121 736843646
909.6G36843646p27475k962887k020419k216935n047679n811453k939940j075327j812637
$$ 736843646 736116171 733153284 731132865 728915930 723868251 718056798 715116858 714041531 712228894
928G12228894j120746J720786K333760Q4579m79042J371026J291990j162767j742602
$$ 712228894 711108148 712828934 715162694 715247273 714768231 716139257 717431247 716268480 714525878
946.4G14525878l06010j166761m310190n453766m736841o246626r599209j0921657
$$ 714525878 714219868 713053107 708742917 703289151 698552310 692305684 682706475 671784818
962.7F71784818j0828614j2893260j6076386j6558051j4865040j4058590j3619304
$$ 671784818 660956204 648062944 631986558 615428507 600563467 586504877 572885573
977E72885573j1297584q336246p473409p868647o875635n084514m743934n066812l897369
$$ 572885573 561587989 553251743 545778334 537909687 531034052 525949538 521205604 516138792 512241423
995.3E12241423k115428j930595k558648k037228j457631k868384n018592n603850
$$ 512241423 510125995 508195400 505636752 503599524 502141893 499273509 494254917 488651067
1011.6D88651067n411714o203115p006109o239116n071908n238981n798012n138933
$$ 488651067 483239353 477036238 470030129 463791013 458719105 453480124 447682112 442543179
1027.9D42543179m148126m285842m584879l656238k525300k586961k945333k366513
$$ 442543179 438395053 434109211 429524332 425868094 423342794 420755833 417810500 415443987
1044.3D15443987j769722k277970k806127j985938o57349n5135N05090J660436K124995
$$ 415443987 413674265 411396295 408590168 406604230 405946881 405891746 406396836 408057272 410182267
1062.6D10182267Q58218r29535j915782k707184l955960m667908m087090l459245l858328
$$ 410182267 411040485 410110950 408195168 405487984 401532024 396864116 392777026 389317781 385459453
1081C85459453m415721m404127m674882n618692n978673m883141l188818j853377n87761
$$ 385459453 381043732 376639605 371964723 366346031 360367358 355484217 352295399 350442022 349854261
1099.3C49854261Q22276J570016J246154P49260O50972K66433r11146k355814l757030
$$ 349854261 350676537 352246553 353492707 354241967 354892939 355159372 354248226 351892412 348135382
1117.7C48135382n485356o546378m719079o94066J842111J563848L06844o8903R08107
$$ 348135382 342650026 336103648 331384569 330690503 332532614 334096462 334403306 334334403 335242510
1136C35242510K382994L515601M119545L937066K975404K166420K105176K180219J949191
$$ 335242510 337625504 341141105 345260650 349197716 352173120 354339540 356444716 358624935 360574126
1154.4C60574126K084106L040672M186153N102277O344795Q123189R419978R601981
$$ 360574126 362658232 365698904 369885057 374987334 381332129 389455318 398875296 408477277
1170.7D08477277R508878R801864R708882Q738070P821113P430554O503850M433036
$$ 408477277 417986155 427788019 437496901 446234971 454056084 461486638 467990488 472423524
1187D72423524K371400J169056M3809j245409j357823J68174J872331K796352L572345
$$ 472423524 474794924 475963980 476007789 474762380 473404557 473572731 475445062 478241414 481813759
1205.4D81813759M330009M009873K588599J617283J631647J457423P75189P17848J472384
$$ 481813759 486143768 490153641 492742240 494359523 495991170 497448593 498223782 498941630 500414014
1223.7E00414014J790047J467824J716494K640247K967895K561807K669633L333866
$$ 500414014 502204061 503671885 505388379 508028626 510996521 513558328 516227961 519561827
1240.1E19561827L204525K233684J828730K028823J527726M80175L14296J006484J254439
$$ 519561827 522766352 525000036 526828766 528857589 530385315 530865490 531179786 532186270 533440709
1258.4E33440709J120210J868307L258288L875554L880083M589141N724609N870521
$$ 533440709 534560919 536429226 539687514 543563068 547443151 552032292 557756901 563627422
1274.7E63627422N381644N685031O441891O283999N679130O062508O825983O438077
$$ 563627422 569009066 574694097 581135988 587419987 593099117 599161625 605987608 612425685
1291F12425685N438924N297661N480408M611433L387332L200650L333867K460479J366854
$$ 612425685 617864609 623162270 628642678 633254111 636641443 639842093 643175960 645636439 647003293
1309.4F47003293J368582J669944R46283J50740O21855J377941J105248O92547J166701
$$ 647003293 648371875 650041819 650988102 651138842 651760697 653138638 654243886 654936433 656103134
1327.8F56103134J453519N18799n03600m11331k20180r76086j352310n15163Q4400
$$ 656103134 657556653 658075452 657571852 657160521 656940341 655964255 654611945 654096782 654181182
1346.1F54181182m28497r55820n78881l51488j128316j703441j514495j829564k898813
$$ 654181182 653752685 652796865 652217984 651866496 650738180 649034739 647520244 645690680 642791867
1364.5F42791867l323436l208398l464401m924238o998598q525908j3281346k3212313
$$ 642791867 639468431 636260033 632795632 627871394 620872796 612346888 599065542 575853229
1380.8E75853229k6054502r110391J6262829K4163425J4763415P444441L756702N75066
$$ 575853229 549798727 540688336 556951165 581114590 595878005 603322446 607079148 607654214
1397.1F07654214j492262j959503k249777l238678l335357k412915k006292k010942
$$ 607654214 606161952 604202449 601952672 598713994 595378637 592965722 590959430 588948488
1413.4E88948488j518845q93712q81255r02057m48644O3539J56462k93851j37746P48634
$$ 588948488 587429643 586535931 585654676 584752619 584303975 584367514 584523976 584230125 584092379 584841013
1433.8E84841013J082122Q62778J185536J938999K213537K251506K902746L934503
$$ 584841013 585923135 586785913 587971449 589910448 592123985 594375491 597278237 601212740
1450.1F01212740M409194M760146P016003R779334P798314O488324P746458Q569300
$$ 601212740 605621934 610382080 617398083 627177417 634975731 641464055 649210513 657779813
1466.4F57779813P566869P639229R792865R972632P462382N557954M708588M193187
$$ 657779813 665346682 672985911 682778776 692751408 700213790 705771744 710480332 714673519
1482.8G14673519K956808J492738L23356n25952j130640k021790l262996l704250l580690
$$ 714673519 717630327 719123065 719446421 718920469 717789829 715768039 712505043 708800793 705220103
1501.1G05220103l422796m335464p732629p471800n587936n042672m582107m376948
$$ 705220103 701797307 697461843 689729214 682257414 676669478 671626806 667044699 662667751
1517.4F62667751l939092l959119l698945l399909l744900k970159k447307l298521
$$ 662667751 658728659 654769540 651070595 647670686 643925786 640955627 638508320 635209799
1533.7F35209799k919316j684547j975417k439976j399755l54350L41654M38452N26070
$$ 635209799 632290483 630605936 628630519 626190543 624790788 624436438 624778092 625216544 625742614
1552.1F25742614J070917J501918O78420r64284o52909p98107j677632k965271m208863
$$ 625742614 626813531 628315449 628993869 628029585 627376676 626578569 624900937 621935666 617726803
1570.5F17726803l878236m517555p322014p134854n963087o834269p598341p696867
$$ 617726803 613848567 609331012 602008998 594874144 588911057 582076788 574478447 566781580
1586.8E66781580p877528q350611q509755q348882q074940p928729p909119p662296
$$ 566781580 558904052 550553441 542043686 533694804 525619864 517691135 509782016 502119720
1603.1E02119720p284164p300407p559002p109016o237417o855667q387446o395161
$$ 502119720 494835556 487535149 479976147 472867131 466629714 459774047 451386601 444991440
1619.4D44991440n043626o157875n987495m992307m406601l294885k603144k815097
$$ 444991440 439947814 433789939 427802444 422810137 418403536 415108651 412505507 409690410
1635.7D09690410j774818k28405P31915J536847K497464L248185L008544L907562O173491
$$ 409690410 407915592 407687187 408419102 409955949 412453413 415701598 418710142 422617704 428791195
1654.1D28791195N193442M707456N744368P103473P553100O895036P970094R755105
$$ 428791195 433984637 438692093 444436461 451539934 459093034 465988070 473958164 483713269
1670.4D83713269Q871824R269863J0585189R730637R099305J0574639J4263570J2523532
$$ 483713269 492585093 501854956 512440145 522170782 531270087 541844726 556108296 568631828
1686.7E68631828J0174632J0793328J0345876J1479736J2959838J3014674J4903545
$$ 568631828 578806460 589599788 599945664 611425400 624385238 637399912 652303457
1701F52303457J2128234J0118902J0409355R079397P946610P252872O966591P370412
$$ 652303457 664431691 674550593 684959948 694039345 701985955 709238827 716205418 723575830
1717.3G23575830O326914M723728M499495M740596M431188M070044L794014M231632
$$ 723575830 729902744 734626472 739125967 743866563 748297751 752367795 756161809 760393441
1733.6G60393441M202068L380835L649413M027009L818274L551364L535747L634095
$$ 760393441 764595509 767976344 771625757 775652766 779471040 783022404 786558151 790192246
1749.9G90192246L333271K715647K616048K664030K299726J948416J800895J842022
$$ 790192246 793525517 796241164 798857212 801521242 803820968 805769384 807570279 809412301
1766.3H09412301J840114J770258J764119J629293J309275J209200J354754J439869
$$ 809412301 811252415 813022673 814786792 816416085 817725360 818934560 820289314 821729183
1782.6H21729183J242936J060963J188874J269817J035154Q19087R92656J096189Q93891
$$ 821729183 822972119 824033082 825221956 826491773 827526927 828346014 829338670 830434859 831328750
1800.9H31328750P00235Q07881R31681P70390N71310O24478P50661O27637N23448O35147
$$ 831328750 832028985 832836866 833768547 834538937 835110247 835734725 836485386 837113023 837636471 838271618
1821.3H38271618O81996N21660M78089N75125N27859M22597M12285N09739N26309M35889
$$ 838271618 838953614 839475274 839953363 840528488 841056347 841478944 841891229 842400968 842927277 843363166
1841.7H43363166L42905L83795M12643L21626L28303M15802L67939K22802K59459M25101
$$ 843363166 843706071 844089866 844502509 844824135 845152438 845568240 845936179 846158981 846418440 846843541
1862.1H46843541M81903L66748K02715J44720J70648J63734J82450K57611K30730J57475
$$ 846843541 847325444 847692192 847894907 848039627 848210275 848374009 848556459 848814070 849044800 849202275
1882.5H49202275K20657L25739J83284k0921P9095K19107J53661P3254J54495K17259
$$ 849202275 849422932 849748671 849931955 849911034 849990129 850209236 850362897 850436151 850590646 850807905
1902.9H50807905J13964J0312N9307J41263J28924J08540J14978Q0168l3617j04070
$$ 850807905 850921869 850932181 850991488 851132751 851261675 851370215 851485193 851565361 851531744 851427674
1923.3H51427674q464N8473l1650o0261K2531n543j15335r9242j7107p4804k05993
$$ 851427674 851419210 851477683 851446033 851385772 851408303 851402760 851287425 851188183 851171076 851096272 850890279
1945.7H50890279j98007o5744n9247k12788k27034j03355j31309k58028j94133o0379
$$ 850890279 850692272 850626528 850567281 850354493 850127459 850024104 849892795 849634767 849440634 849380255
1966.1H49380255j31607k71917k05457n3167j08540k36452j83225p5698j51932k73823
$$ 849380255 849248648 848976731 848771274 848718107 848609567 848373115 848189890 848114192 847962260 847688437
1986.5H47688437j98544q0466j71363l02911k10226p6890j70528l39985k65599j15573
$$ 847688437 847489893 847409427 847238064 846935153 846724927 846648037 846477509 846137524 845871925 845756352
2006.9H45756352k08557l28719j97053q9348k53319m00305k83897j60694k71082l33846
$$ 845756352 845547795 845219076 845022023 844932675 844679356 844279051 843995154 843834460 843563378 843229532
2027.3H43229532j66297r2387l19660m43041k23875o8367j88648l07739k05398j17957
$$ 843229532 843063235 842970848 842651188 842208147 841984272 841915905 841727257 841419518 841214120 841096163
2047.7H41096163k51651l37243j58131k8372j53720k31266r5070l8326k35676l13461
$$ 841096163 840844512 840507269 840349138 840320766 840167046 839935780 839840710 839802384 839566708 839253247
2068.1H39253247r3878L6180j20282k10821n7102L696j61648k15351m9532j8060j99616
$$ 839253247 839159369 839195549 839075267 838864446 838807344 838811040 838649392 838434041 838384509 838366449 838166833
2090.5H38166833k04742M9829J12772r5844j15454J11103J18852j22071j38819Q0526
$$ 838166833 837962091 838011920 838124692 838028848 837913394 838024497 838143349 838021278 837882459 837962985
2110.9H37962985J09077j04964j48893P5162J50621k8968m0948J81257J94252n2870
$$ 837962985 838072062 837967098 837818205 837893367 838043988 838015020 837974072 838155329 838349581 838296711
2131.3H38296711p2777J91212K14398j5617j2457K05696J95801n365K5750K31921K09511
$$ 838296711 838223934 838415146 838629544 838613927 838601470 838807166 839002967 838997602 839023352 839255273 839464784
2153.8H39464784J5080M2259K35200K04444P570P3612K94804K07842k1816P6652L13818
$$ 839464784 839479864 839522123 839757323 839961767 839969337 840042949 840337753 840545595 840523779 840600431 840914249
2176.2H40914249K19047j2040P6414K92241J68800q2790O377K28584J33753p9870K6047
$$ 840914249 841133296 841121256 841197670 841489911 841658711 841575921 841582298 841810882 841944635 841864765 841890812
2198.6H41890812K30312J07706j15097n36K25305J01328j26123j1683K00749Q8155
$$ 841890812 842121124 842228830 842113733 842113197 842338502 842439830 842313707 842302024 842502773 842590928
2219H42590928j12474J2338K11835O4135j67668m5300J45734j4127j82211K9326K12550
$$ 842590928 842478454 842490792 842702627 842766762 842599094 842553794 842699528 842685401 842503190 842532516 842745066
2241.5H42745066k0385k36690n7757R1374r1314k09988j0192J41382o6578k49207l4929
$$ 842745066 842724681 842487991 842430234 842521608 842430294 842220306 842210114 842351496 842284918 842035711 842000782
2263.9H42000782J70351O55j34170R0480K52068N1916r8229J08302K48730L0041j48595
$$ 842000782 842171133 842171788 842037618 842128098 842380166 842432082 842333853 842442155 842690885 842720926 842572331
2286.3H42572331k8967K0980k19524l35276j35362o6817k92480l95894k79367l16619
$$ 842572331 842543364 842564344 842344820 842009544 841874182 841807365 841514885 841118991 840839624 840523005
2306.7H40523005n63384o03735k92301j72377o07908j001060q01146m80890n06878
$$ 840523005 839959621 839355886 839063585 838891208 838283300 837282240 836481094 836000204 835493326
2325.1H35493326o24239n23985k98261k60592l13639j97888j65582k08199M46201J765668
$$ 835493326 834869087 834345102 834046841 833786249 833472610 833274722 833109140 832900941 833347142 835112810
2345.5H35112810J887441L24547j367569k014041j786589j453639p46428L58462J119912
$$ 835112810 837000251 837324798 835957229 833943188 832156599 830702960 829956532 830314994 831434906
2363.8H31434906J420855J769483K105653K083958J809239J752973J904666J768768
$$ 831434906 832855761 834625244 836730897 838814855 840624094 842377067 844281733 846050501
2380.2H46050501J344204J056075Q92937N43058J14322J3828J75834J63555j4842l397
$$ 846050501 847394705 848450780 849343717 849886775 850001097 850014925 850190759 850354314 850339472 850336075
2400.6H50336075J86622J80066l8326o7353Q7559L6061j60277j33217K8134j16110
$$ 850336075 850522697 850702763 850664437 850597084 850684643 850720704 850560427 850427210 850455344 850339234
2421H50339234n23269n76496p3374L58105L41833K86698L37779J68205j18733j14500
$$ 850339234 849815965 849239469 849166095 849524200 849866033 850152731 850490510 850658715 850539982 850425482
2441.3H50425482P7784K7716j68741p4863J58846O6281k00451j81317L0160P510j74761
$$ 850425482 850503266 850530982 850362241 850287378 850446224 850512505 850312054 850130737 850160897 850168407 849993646
2463.8H49993646j31249M9889m17j91689j59979J5795m3809k57254j72555P4923n663
$$ 849993646 849862397 849912286 849911869 849720180 849560201 849575996 849532187 849274933 849102378 849177301 849171638
2486.2H49171638k30133j71423k325q1837k38478j31607L4809q8930k78056j70409
$$ 849171638 848941505 848770082 848767757 848685920 848447442 848315835 848350644 848261714 847983658 847813249
2506.6H47813249Q702q3208k35915j27435L8683q7618k87951j97172k0146j02937k57373
$$ 847813249 847821951 847738743 847502828 847375393 847414076 847326458 847038507 846841335 846821189 846718252 846460879
2529H46460879j33991N2154p7784k97666j98185n544j30832k91049j18256N0187j19984
$$ 846460879 846326888 846379042 846301258 846003592 845805407 845799863 845669031 845377982 845259726 845309913 845189929
2551.5H45189929l27766k18153l2604j42812l17514j94013k2889j75893l78966k71738
$$ 845189929 844862163 844644010 844611406 844468594 844151080 843957067 843934178 843758285 843379319 843107581
2571.9H43107581j21832k62022m23670k91526j60456l34918m83811l18408j81735l36408
$$ 843107581 842985749 842723727 842300057 842008531 841848075 841513157 841029346 840710938 840529203 840192795
2592.3H40192795m64142l42905k62857m29451n90205m90368l54230m64022n56767l94643
$$ 840192795 839728653 839385748 839122891 838693440 838103235 837612867 837258637 836794615 836237848 835843205
2612.7H35843205l13878n20229o18994m40002l86059n85675o28412m06027l38852n43535
$$ 835843205 835529327 835009098 834390104 833950102 833564043 832978368 832349956 831943929 831605077 831061542
2633.1H31061542o35326m71473l72529n03361n61595l92079l59059n69403o24537m34458
$$ 831061542 830426216 829954743 829582214 829078853 828517258 828125179 827766120 827196717 826572180 826137722
2653.5H26137722l76046n65589n79893l09289k66432n50867o55412m58062l75748n28276
$$ 826137722 825761676 825196087 824616194 824306905 824040473 823489606 822834194 822376132 822000384 821472108
2673.9H21472108n37216l38137l66629o23285o52075m54009m27425o03795o17563m31419
$$ 821472108 820934892 820596755 820230126 819606841 818954766 818500757 818073332 817469537 816851974 816420555
2694.3H16420555m49717o77347o81460m86076m89116o65128o75320n31078n58257p41422
$$ 816420555 815970838 815293491 814612031 814125955 813636839 812971711 812296391 811765313 811207056 810465634
2714.6H10465634p12454n07772n17726o93977o54876m76301n66721q07047p66337n40853
$$ 810465634 809753180 809245408 808727682 808033705 807378829 806902528 806335807 805528760 804762423 804221570
2735H04221570n31792o92725o39737m35770m77016o85811p04109n69344o02782p85529
$$ 804221570 803689778 802997053 802357316 801921546 801444530 800758719 800054610 799485266 798882484 798096955
2755.4G98096955p71523o27875p18057q90494p69078n54681o32644q15332p68184o88971
$$ 798096955 797325432 796697557 795979500 795089006 794319928 793765247 793132603 792317271 791549087 790860116
2775.8G90860116q81195j083493r83774q13723q54731r87887r88245r41396j068652
$$ 790860116 789978921 788895428 787911654 787097931 786243200 785255313 784267068 783325672 782257020
2794.2G82257020j218557j136899j035571j151144j286865j231909j153767j281976
$$ 782257020 781038463 779901564 778865993 777714849 776427984 775196075 774042308 772760332
2810.5G72760332j440287j386285j296282j417875j549661j463533j437068j657784
$$ 772760332 771320045 769933760 768637478 767219603 765669942 764206409 762769341 761111557
2826.8G61111557j858234j860380j891971k180814k528728k798080l297448m138589
$$ 761111557 759253323 757392943 755500972 753320158 750791430 747993350 744695902 740557313
2843.1G40557313m908383n060911m313767k982736j747727j050413r68814j275837
$$ 740557313 735648930 730588019 726274252 723291516 721543789 720493376 719524562 718248725
2859.5G18248725j615644j910388k331853k790093k914846k635956k309621k121508
$$ 718248725 716633081 714722693 712390840 709600747 706685901 704049945 701740324 699618816
2875.8F99618816j880407j584351j498699j624882j731396j740992j840353k085507
$$ 699618816 697738409 696154058 694655359 693030477 691299081 689558089 687717736 685632229
2892.1F85632229k225876k236545k306998k415061k460599k535641k823651l302812
$$ 685632229 683406353 681169808 678862810 676447749 673987150 671451509 668627858 665325046
2908.4F65325046l797710m216254m460573m258633l533542k668858j989722j471996
$$ 665325046 661527336 657311082 652850509 648591876 645058334 642389476 640399754 638927758
2924.7F38927758r21130l34621J0312K28285P38740J473606K032518K308369K429664
$$ 638927758 638006628 637672007 637682319 637910604 638649344 640122950 642155468 644463837 646893501
2943.1F46893501K331794J864969J208902O93917L13342L1948K4140K69830N46574
$$ 646893501 649225295 651090264 652299166 652993083 653306425 653338373 653362513 653632343 654178917
2961.4F54178917O40154O38426P59244Q61942Q07882P13944O77705P50959Q02755O74188
$$ 654178917 654819071 655457497 656216741 657078683 657886565 658600509 659278214 660029173 660831928 661506116
2981.8F61506116N85318O59287O40810M82320K79010m4406l71814o27338q50976r36091
$$ 661506116 662091434 662750721 663391531 663873851 664152861 664108455 663736641 663109303 662258327 661322236
3002.2F61322236j023829j174927j146435j037300j143158j357913j453161j523793
$$ 661322236 660298407 659123480 657977045 656939745 655796587 654438674 652985513 651461720
3018.5F51461720j679062j784087j805901j843214j854956j829684j820743j917243
$$ 651461720 649782658 647998571 646192670 644349456 642494500 640664816 638844073 636926830
3034.9F36926830k098620k152681k108634k170861k350688k459109k391159k326608
$$ 636926830 634828210 632675529 630566895 628396034 626045346 623586237 621195078 618868470
3051.2F18868470k392113k466261k481938k457142k390504k297759k215087k239347
$$ 618868470 616476357 614010096 611528158 609071016 606680512 604382753 602167666 599928319
3067.5E99928319k361297k393603k276719k138674k130926k279997k392948k401650
$$ 599928319 597567022 595173419 592896700 590758026 588627100 586347103 583954155 581552505
3083.8E81552505k444863k453625k401888k458275k552628k522886k434373k475142
$$ 581552505 579107642 576654017 574252129 571793854 569241226 566718340 564283967 561808825
3100.1E61808825k648890k719284k629280k593338k746046k835691k717852k700568
$$ 561808825 559159935 556440651 553811371 551218033 548471987 545636296 542918444 540217876
3116.4E40217876k870023l090739l268182l276170l164947l074407l090859l197729
$$ 540217876 537347853 534257114 530988932 527712762 524547815 521473408 518382549 515184820
3132.8E15184820l241360l167809l152668l336608l496468l452838l386408l352821
$$ 515184820 511943460 508775651 505622983 502286375 498789907 495337069 491950661 488597840
3149.1D88597840l336459l459633l634155l645688l585756l574997l557682l553957
$$ 488597840 485261381 481801748 478167593 474521905 470936149 467361152 463803470 460249513
3165.4D60249513l586351l611088l624201l620535l597975l570378l495127l462434
$$ 460249513 456663162 453052074 449427873 445807338 442209363 438638985 435143858 431681424
3181.7D31681424l533393l545135l465235l443480l485471l452301l356576l307789
$$ 431681424 428148031 424602896 421137661 417694181 414208710 410756409 407399833 404092044
3198D04092044l317684l330052l309280l243863l180147l121614l051937l013521k974123
$$ 404092044 400774360 397444308 394135028 390891165 387711018 384589404 381537467 378523946 375549823
3216.4C75549823k941132k951562k935380k841234k733230k672464k623171k556443
$$ 375549823 372608691 369657129 366721749 363880515 361147285 358474821 355851650 353295207
3232.7C53295207k572149k622694k571434k482503k364427k241701k216011k260089
$$ 353295207 350723058 348100364 345528930 343046427 340682000 338440299 336224288 333964199
3249C33964199k252549k157360k071202k106011k196431k196223k139062k083390j990647
$$ 333964199 331711650 329554290 327483088 325377077 323180646 320984423 318845361 316761971 314771324
3267.4C14771324j855820j846164j989216k093732k140284k141655k078443j991123
$$ 314771324 312915504 311069340 309080124 306986392 304846108 302704453 300626010 298634887
3283.7B98634887j915515j927018j970172j931280j933396k009868k031923k003729
$$ 298634887 296719372 294792354 292822182 290890902 288957506 286947638 284915715 282911986
3300B82911986j944423j896917j968205k099008k155304k114624k000212j939625j983523
$$ 282911986 280967563 279070646 277102441 275003433 272848129 270733505 268733293 266793668 264810145
3318.4B64810145j976669j919329j883715j881809j903861j873106j825631j760378
$$ 264810145 262833476 260914147 259030432 257148623 255244762 253371656 251546025 249785647
3334.7B49785647j648605j655802j779586j788602j719102j625389j455754j458555
$$ 249785647 248137042 246481240 244701654 242913052 241193950 239568561 238112807 236654252
3351B36654252j648590j709357j537070j327917j297667j300827j138568j017585j137168
$$ 236654252 235005662 233296305 231759235 230431318 229133651 227832824 226694256 225676671 224539503
3369.3B24539503j299247j208961r52288q24005q29950q59364p57710m96655j99095
$$ 224539503 223240256 222031295 221079007 220255002 219425052 218565688 217807978 217311323 217112228
3387.7B17112228L6031j9029l15293l26559O0722K74807L58k95892o3703L41728M47527
$$ 217112228 217148259 217129230 216813937 216487378 216548100 216822907 216823265 216527373 216463670 216805398 217252925
3410.1B17252925L62784K31385K32652M66257O55741O89491Q15362J056313J220704
$$ 217252925 217615709 217847094 218079746 218546003 219201744 219891235 220706597 221762910 222983614
3428.5B22983614J169979J208142J391515J243353R02146R44301J316011J574576J635641
$$ 222983614 224153593 225361735 226753250 227996603 228898749 229843050 231159061 232733637 234369278
3446.8B34369278J617700J688018J822621J956895K147108K306745K191767K125710
$$ 234369278 235986978 237674996 239497617 241454512 243601620 245908365 248100132 250225842
3463.2B50225842K488554K721995K389013J937181J978070K358049K707571K738356
$$ 250225842 252714396 255436391 257825404 259762585 261740655 264098704 266806275 269544631
3479.5B69544631K473563K475649K778888K863228K772183K877682L061503L134758
$$ 269544631 272018194 274493843 277272731 280135959 282908142 285785824 288847327 291982085
3495.8B91982085L035604K999217L106743L028542K864718L013492L358096L623783
$$ 291982085 295017689 298016906 301123649 304152191 307016909 310030401 313388497 317012280
3512.1C17012280L600925L355265L350079L622502L948957L903896L606170L652096
$$ 317012280 320613205 323968470 327318549 330941051 334890008 338793904 342400074 346052170
3528.4C46052170L918916M127860M339218M379928M221231M400790M717618M715502
$$ 346052170 349971086 354098946 358438164 362818092 367039323 371440113 376157731 380873233
3544.7C80873233M428774M289299M510165M790097M876703M936725N099088N136132
$$ 380873233 385302007 389591306 394101471 398891568 403768271 408704996 413804084 418940216
3561.1D18940216M952401N011082N827665O194741N674809N461991N732268O033152
$$ 418940216 423892617 428903699 434731364 440926105 446600914 452062905 457795173 463828325
3577.4D63828325O273061O465137O413490O384820O680637O783009O465554O557465
$$ 463828325 470101386 476566523 482980013 489364833 496045470 502828479 509294033 515851498
3593.7E15851498O927311P101595P168413P160663O966591O884813P310153P450938
$$ 515851498 522778809 529880404 537048817 544209480 551176071 558060884 565371037 572821975
3610E72821975P280171P330715P122696P268905P816375P256984O349028O115138P165313
$$ 572821975 580102146 587432861 594555557 601824462 609640837 616897821 623246849 629361987 636527300
3628.4F36527300Q047223P039487O610036O605029O375313O195367N961716N618035
$$ 636527300 644574523 651614010 658224046 664829075 671204388 677399755 683361471 688979506
3644.7F88979506N639375O456077O420433M990876M446864M947901M888117M229784
$$ 688979506 694618881 701074958 707495391 712486267 716933131 721881032 726769149 730998933
3661G30998933L856957L769040L587246L468216L513932L088534K807856K855420K707064
$$ 730998933 734855890 738624930 742212176 745680392 749194324 752282858 755090714 757946134 760653198
3679.4G60653198K616703K613485K573550K540767K199829J699328J693606J822770
$$ 760653198 763269901 765883386 768456936 770997703 773197532 774896860 776590466 778413236
3695.7G78413236J751661J567364J472235J467049J415789J265884J114130J149952
$$ 778413236 780164897 781732261 783204496 784671545 786087334 787353218 788467348 789617300
3712G89617300J346946J277625J013101P79151N82815M92990O43611R71853J084388
$$ 789617300 790964246 792241871 793254972 794034123 794616938 795109928 795753539 796725392 797809780
3730.3G97809780R74238Q47399Q83996R39846P21991K88725K06292P73489P85172L65198
$$ 797809780 798784018 799631417 800515413 801455259 802177250 802465975 802672267 803445756 804230928 804596126
3750.7H04596126M28796P36713O88315M89294M83156N23030M58062L86417L05056L00169
$$ 804596126 805024922 805761635 806449950 806939244 807422400 807945430 808403492 808789909 809094965 809395134
3771.1H09395134M49241N67555N69940L81529J90794J97173K26020K20240K78711L85106
$$ 809395134 809844375 810411930 810981870 811363399 811554193 811751366 811977386 812197626 812476337 812861443
3791.5H12861443L66449K69949K72811J64807N4121K61545J78397J7046K57135M52459
$$ 812861443 813227892 813497841 813770652 813935459 813989580 814251125 814429522 814446568 814703703 815156162
3811.9H15156162L53277K12073K61426K38j71125K02298L49880K77161K06471K08735
$$ 815156162 815509439 815721512 815982938 815983176 815812051 816014349 816364229 816641390 816847861 817056596
3832.3H17056596K67685L9041k72811n0783K22147K65956K85923K50638o9917p43031
$$ 817056596 817324281 817363322 817090511 817039728 817261875 817527831 817813754 818064392 817994475 817251444
3852.7H17251444m33087N63979O25252K85328N722K0206L1710k30790k03728J14858
$$ 817251444 816818357 817382336 818007588 818292916 818298638 818318844 818350554 818119764 817916036 818030894
3873.1H18030894K93016L06487J44065J46746J60695j31965j84059N424M9710J07527
$$ 818030894 818323910 818630397 818774462 818921208 819081903 818949938 818765879 818771303 818821013 818928540
3893.5H18928540J57654M7326j42276k81513k63452q107K51770K61963J25587L3259
$$ 818928540 819086194 819133520 818991244 818709731 818446279 818438172 818689942 818951905 819077492 819110751
3913.9H19110751o2406j53184o4134N8949R6261J13070M5836o1095j5795Q2314M2498
$$ 819110751 819048345 818895161 818831027 818889976 818986237 819099307 819145143 819084048 819068253 819150567 819193065
3936.3H19193065j132J0013K4498N6624L3856j6213L0279Q2076M5121M1484J00434
$$ 819193065 819191933 819201946 819226444 819283068 819316924 819300711 819330990 819413066 819458187 819499671 819600105
3958.8H19600105R0301J6094n007N6624J31369J55926J46329J43766J49072J00255
$$ 819600105 819690406 819706500 819701493 819758117 819889486 820045412 820191741 820335507 820484579 820584834
3979.2H20584834M8637O3539M2915L1412R0658O9320M4048J11580J06573
$$ 820584834 820633471 820697010 820739925 820771337 820861995 820931315 820975363 821086943 821193516
3997.5H21193516
$$ 821193516
##END=$$ End of the data block
