##TITLE=$$ Begin of the data block
##JCAMP-DX=5.00 $$ ACD/SpecManager v 10.08
##SPECTROMETER/DATA SYSTEM=Alpha
##DATE=09 Apr 2014 11:14:46
##DATA TYPE=INFRARED SPECTRUM
##DATA CLASS=XYDATA
##ORIGIN=
##OWNER=
##NPOINTS=1765
##FIRSTX=399.75695801
##LASTX=3997.56933594
##MAXX=3997.56933594
##MINX=399.75695801
##MAXY=0.85166800
##MINY=0.21676925
##XFACTOR=1.0000000000
##YFACTOR=1.000000000000000e-9
##FIRSTY=0.58221042
##DELTAX=2.03957629
##XUNITS=1/CM
##YUNITS=ARBITRARY UNITS
##XYDATA=(X++(Y..Y))
399.8E82210422l651679m095554J35004Q51214l351033l243267J764476K755344j556218
418.1E71818709k772987P73430p30514l893137j102746K300740o58930l502905j24335
436.5E62107325K228379j147807k793252R88245J806617k409637k664268J682221J741708
454.8E61539531k607584k481282J371026k3901l602446j673042J953005m90725m341244
473.2E49643338j498819J617372j262009l477990o0499J970470j613498l193676K69532
491.5E42394221J148164k712548l361046M36187R33409k632618k412737J014412K13265
509.9E35020709l356278k475440Q95738l39150l709436k223849O39379j190364l803432
528.3E19457877j685024O39022j423300l400683q49903J306534j110136k915621n11110
$$ y = [582210422, 578558743, 574463189, 574598193, 575449407, 572098374, 568855107, 570619583, 573374927, 571818709, 569045722, 569819152, 569088638, 565195501, 564092755, 566393495, 565734565, 562231660, 562107325, 564335704, 563187897, 560394645, 561382890, 563189507, 560779870, 558115602, 559797823, 561539531, 558931947, 556450665, 557821691, 557797790, 554195344, 552522302, 554475307, 553984582, 549643338, 548144519, 549761891, 548499882, 545021892, 544961393, 546931863, 545318365, 542124689, 542394221, 543542385, 540829837, 537468791, 537904978, 538838387, 536205769, 533793032, 534807444, 535020709, 531664431, 529188991, 530084729, 529745579, 526036143, 523812294, 524451673, 523261309, 519457877, 517772853, 518411875, 516988575, 513587892, 512737989, 514044523, 512934387, 510018766, 509507656]
546.6E09507656Q67605j728177k947628l28601N08964k603530l582061p08848k64913
565D98720467l426582l992140j210630j038074l758103l662497r21905j255065l809065
583.3D75646406l155201m79341j100868l699660l029883p51615j669854l923684l260285
601.7D54576015j531630k236218l147840j165450P98434m34249j533777J300007M549891
620D51175183L846586K395659L935934N456835L736138K216101L734737M673332K337545
638.4D83508050L58552J382858K381742J479387J337647K781451J962036j185685k27124
656.7D93778914N592704Q085221M837930J918435K940417N597770L615558K584815
673.1E28951764M483342M493177J768410J481474L942907L677427Q03531Q62181L319204
$$ y = [509507656, 510375261, 508647084, 505699456, 505370855, 505879819, 503276289, 499694228, 498985380, 498720467, 495293885, 491301745, 490091115, 489053041, 485294938, 481632441, 480710536, 479455471, 475646406, 472491205, 472011864, 470910996, 467211336, 464181453, 463429838, 461759984, 457836300, 454576015, 453044385, 450808167, 447660327, 446494877, 447293311, 446859062, 445325285, 446625292, 451175183, 455021769, 457417428, 461353362, 466810197, 470546335, 472762436, 476497173, 481170505, 483508050, 483866602, 485249460, 487631202, 489110589, 490448236, 493229687, 495191723, 494006038, 493778914, 499371618, 507456839, 512294769, 514213204, 517153621, 522751391, 526366949, 528951764, 533435106, 537928283, 539696693, 541178167, 545121074, 548798501, 549602032, 550464213, 553783417]
691.4E53783417K628028k33233K19464K874673K387047Q8930J076042L790617L089965
709.8E69704950P82490K012789M516601L201545P67529K322316M675388L000021O17326
728.1E91600955K217531M355967K420246R2030J761675L736853J878560Q8930K259851
746.5F10412598M157602J995624K65300K554953M181206J804471K69771K710879M036843
764.8F32389247J374722j00672K134204K746045m39048j877963M18007Q99136k056241
783.2F35487437k754807L73363J833380K29597J013100N054474O567299M683256M936516
801.6F57423615P794798P465541L812731L100335N308032M207492L82245j27256J670241
819.9F91037774j05917m129112m478216k493501l688574o401241n441129k902329l671348
$$ y = [553783417, 556411445, 556178212, 556397676, 559272349, 561659396, 561748326, 562824368, 566614985, 569704950, 570487440, 572500229, 577016830, 580218375, 580985904, 583308220, 587983608, 590983629, 591600955, 593818486, 598174453, 600594699, 600686729, 602448404, 606185257, 608063817, 608152747, 610412598, 614570200, 616565824, 616831124, 619386077, 623567283, 625371754, 625641525, 628352404, 632389247, 633763969, 633663297, 635797501, 638543546, 638104498, 636226535, 636644542, 637543678, 635487437, 632732630, 633105993, 634939373, 635168970, 636182070, 641236544, 647803843, 652487099, 657423615, 665218413, 672683954, 676496685, 679597020, 684905052, 689112544, 689494789, 689367533, 691037774, 690931857, 686802745, 682324529, 679831028, 676142454, 669741213, 664300084, 661397755, 657726407]
838.3F57726407n503297l971576j435757j924336k734780M09305M929959O235183O274521
856.6F60005629Q983016J1845231J0652423Q167565Q800089R579957O420731L251374
872.9G27706015M388154N538165K381683r10819j90794N71906k299666m499793k533079
891.3G30151772o67989j903176k078354J177907L307223J651883N18739K295971K549470
909.6G37003446p41005k920151k026260k316534n088091n740166k920568j155496j848578
928G12246597j086533J735329K323389N8949n27083J348018J306892j140535j710356
946.4G14554667k78770j162112m300356n430579m741907o306291r662330j0926187
962.7F71746135j0804415j2890100j6067863j6519248j4836669j4077306j3634205
$$ y = [657726407, 652223110, 648251534, 646815777, 644891441, 642156661, 642565966, 647495925, 653731108, 660005629, 668988645, 680833876, 691486299, 699653864, 708453953, 718033910, 724454641, 727706015, 732094169, 737632334, 740014017, 739103198, 738912404, 739484310, 737184644, 732684851, 730151772, 729483783, 727580607, 725502253, 726680160, 729987383, 731639266, 732158005, 734453976, 737003446, 736262441, 733342290, 731316030, 728999496, 723911405, 718171239, 715250671, 714095175, 712246597, 711160064, 712895393, 715218782, 715277731, 714750648, 716098666, 717405558, 716265023, 714554667, 714275897, 713113785, 708813429, 703382850, 698640943, 692334652, 682672322, 671746135, 660941720, 648051620, 631983757, 615464509, 600627840, 586550534, 572916329]
977E72916329j1247814q297860p508576p897497o868720n085706m736245n041718l895522
995.3E12336671k144396j974702k587020k032638j465559k904326n060136n631238
1011.6D88536656n408138o209254o995321o150096n018354n279064n812258n098670
1027.9D42565501m107625m258722m560887l614217k499402k608508k968788k347946
1044.3D15599406j736939k265185k780855j976579p01100q8841N01991J650452K126128
1062.6D10328478Q91745r23634j954943k742082l954678m624129m076361l529460l926992
1081C85487944m408360m324406m584879n579889n976408m885167l202021j870394n87881
1099.3C50068539Q45343J598835J246542P45267O64442K64556r26227k363473l765315
$$ y = [572916329, 561668515, 553370655, 545862079, 537964582, 531095862, 526010156, 521273911, 516232193, 512336671, 510192275, 508217573, 505630553, 503597915, 502132356, 499228030, 494167894, 488536656, 483128518, 476919264, 469923943, 463773847, 458755493, 453476429, 447664171, 442565501, 438457876, 434199154, 429638267, 426024050, 423524648, 420916140, 417947352, 415599406, 413862467, 411597282, 408816427, 406839848, 406138748, 406049907, 406551898, 408202350, 410328478, 411220223, 410296589, 408341646, 405599564, 401644886, 397020757, 392944396, 389414936, 385487944, 381079584, 376755178, 372170299, 366590410, 360614002, 355728835, 352526814, 350656420, 350068539, 350913882, 352512717, 353759259, 354504526, 355168968, 355433524, 354507297, 352143824, 348378509]
1117.7C48378509n521416o599754m755497p02471J854926J582206L27319o6251Q97735
1136C35395306K392918L535807M120767L910870K962023K184391K103120K147645J928568
1154.4C60681415K080679L056973M200637N058885O285280Q108318R437590R632081
1170.7D08541858R540588R829432R703844Q692354P794381P443457O496579M401237
1187D72443730K375275J191198K0117j276523j336604J81615J838148K767145L598959
1205.4D81803060M400879M039049K560317J590014J610309J426637P54952P32273J495749
1223.7E00413239J777887J431048J733423K703845K982020K551794K689660L354132
1240.1E19637048L219962K265156J856863K032221J525580M79758L18170J012146J229644
$$ y = [348378509, 342857093, 336257339, 331501842, 330799371, 332654297, 334236503, 334563822, 334497571, 335395306, 337788224, 341324031, 345444798, 349355668, 352317691, 354502082, 356605202, 358752847, 360681415, 362762094, 365819067, 370019704, 375078589, 381363869, 389472187, 398909777, 408541858, 418082446, 427911878, 437615722, 446308076, 454102457, 461545914, 468042493, 472443730, 474819005, 476010203, 476030320, 474753797, 473417193, 473598808, 475436956, 478204101, 481803060, 486203939, 490242988, 492803305, 494393319, 496003628, 497430265, 498185217, 498917490, 500413239, 502191126, 503622174, 505355597, 508059442, 511041462, 513593256, 516282916, 519637048, 522857010, 525122166, 526979029, 529011250, 530536830, 531016588, 531334758, 532346904, 533576548]
1258.4E33576548J093626J878917L268004L865540L860235M554093N679965N839884
1274.7E63616812N371630N666674O402313O248594N670130O097257O892383O471038
1291F12436831N413294N265713N479097M628241L405273L231466L380894K491475J368463
1309.4F47100747J340568J626074R39846J85013O41048J370191J101792P12455J196503
1327.8F56214237J455605N01156n14030m25280k35915r64999j317859n04314O1154
1346.1F54269755m54664r44555n23567l03626j120627j717866j529336j843810k889454
1364.5F42942250l282547l186405l479779m948854p031560q563340j3292432k3174405
1380.8E75982928k5989949r111107J6186059K4132967J4790117P453800L739655N71608
$$ y = [533576548, 534670174, 536549091, 539817095, 543682635, 547542870, 552096963, 557776928, 563616812, 568988442, 574655116, 581057429, 587306023, 592976153, 599073410, 605965793, 612436831, 617850125, 623115838, 628594935, 633223176, 636628449, 639859915, 643240809, 645732284, 647100747, 648441315, 650067389, 651007235, 651192248, 651833296, 653203487, 654305279, 655017734, 656214237, 657669842, 658170998, 657656968, 657231688, 656995773, 656030774, 654712915, 654208601, 654269755, 653815091, 652870536, 652346969, 652043343, 650922716, 649204850, 647675514, 645831704, 642942250, 639659703, 636473298, 632993519, 628044665, 621013105, 612449765, 599157333, 575982928, 549992979, 540881872, 557067931, 581200898, 595991015, 603444815, 607184470, 607756078]
1397.1F07756078j463771j931250k255022l249049l323496k409518k021193k025545
1413.4E89077234j535237r32991r17971q87335m09662P9691J40131l01600j24097P53045
1433.8E84941208J073540Q74102J207530J929045K188742K250612K894640L898263
1450.1F01257682M383266M724145O959975R829998P874310O463050P691324Q571804
1466.4F57755554P579207P611931R762227R993553P532478N624115M706204M162431
1482.8G14727700K966583J495838L02911n10633j129091k044857l264665l695667l587902
1501.1G05260217l448963m376888p758916p456422n536794m963875m551470m415274
1517.4F62751615l956199l947615l693342l397763l716052k923786k452374l335834
$$ y = [607756078, 606292307, 604361057, 602106035, 598856986, 595533490, 593123972, 591102779, 589077234, 587541997, 586609006, 585691035, 584803700, 584394038, 584473729, 584613860, 584312260, 584188163, 584941208, 586014748, 586888850, 588096380, 590025425, 592214167, 594464779, 597359419, 601257682, 605640948, 610365093, 617325068, 627155066, 635029376, 641492426, 649183750, 657755554, 665334761, 672946692, 682708919, 692702472, 700234950, 705859065, 710565269, 714727700, 717694283, 719190121, 719493032, 718982399, 717853308, 715808451, 712543786, 708848119, 705260217, 701811254, 697434366, 689675450, 682219028, 676682234, 671718359, 667166889, 662751615, 658795416, 654847801, 651154459, 647756696, 644040644, 641116858, 638664484, 635328650]
1533.7F35328650k905428j667261j986861k425134j376331l31283L41594M15981N18859
1552.1F25912786J069724J493931O75142r53079o32822p70986j659215k975404m218995
1570.5F17941082l864110m498243p286191p091523n935847o816328p619321p760227
1586.8E67069292p923305q356750q509755q374214q109749p937610p894993p651269
1603.1E02311647p301360p345230p579416p082969o216317o874800q432507o422341
1619.4D45056707n057067o173134o010771n018592m405140l282100k633095k870292
1635.7D09606516j753896j72854P61480J537680K487511L270030L021747L883898O193965
1654.1D28836077N215645M691154N751908P169694P621824O914080P965385R747357
$$ y = [635328650, 632423222, 630755961, 628769100, 626343966, 624967635, 624636352, 624977946, 625393927, 625912786, 626982510, 628476441, 629151583, 628198504, 627565682, 626794696, 625135481, 622160077, 617941082, 614076972, 609578729, 602292538, 595201015, 589265168, 582448840, 574829519, 567069292, 559145987, 550789237, 542279482, 533905268, 525795519, 517857909, 509962916, 502311647, 495010287, 487665057, 480085641, 473002672, 466786355, 459911555, 451479048, 445056707, 439999640, 433826506, 427815735, 422797143, 418392003, 415109903, 412476808, 409606516, 407852620, 407679766, 408441246, 409978926, 412466437, 415736467, 418758214, 422642112, 428836077, 434051722, 438742876, 444494784, 451664478, 459286302, 466200382, 474165767, 483913124]
1670.4D83913124Q866667R254814J0557413R708404R062529J0528207J4284968J2577951
1686.7E68754077J0195672J0796667J0325968J1443019J2923240J2981892J4923751
1701F52344286J2183965J0131418J0409713R105146P946491P193029O895900P377029
1717.3G23586977O393492M775405M524648M723012M387498M036665L768385M231453
1733.6G60427535M247725L409028L655851M029214L809929L540456L543019L658355
1749.9G90321112L348410K715051K622366K674341K268553J897931J819432J886844
1766.3H09554040J818300J714825J749039J650095J338422J233340J368105J425207
1782.6H21851373J215636J067460J210392J255333J000047Q18789J018882J118063
$$ y = [483913124, 492779791, 502034605, 512592018, 522300422, 531362951, 541891158, 556176126, 568754077, 578949749, 589746416, 600072384, 611515403, 624438643, 637420535, 652344286, 664528251, 674659669, 685069382, 694174528, 702121019, 709314048, 716209948, 723586977, 729980469, 734755874, 739280522, 744003534, 748391032, 752427697, 756196082, 760427535, 764675260, 768084288, 771740139, 775769353, 779579282, 783119738, 786662757, 790321112, 793669522, 796384573, 799006939, 801681280, 803949833, 805847764, 807667196, 809554040, 811372340, 813087165, 814836204, 816486299, 817824721, 819058061, 820426166, 821851373, 823067009, 824134469, 825344861, 826600194, 827600241, 828419030, 829437912, 830555975]
1798.9H30555975R09448P39813Q48174R16243P04109N17249O19948P63357O37174N48601
1819.3H37760091O67631O87421N04851M58479N59032N16355M17054M24981N39720N53787
1839.7H43089402M49002L53097L82126L76165K86758L33845M42326L83973K23995K49803
1860.1H46570492L95357M32313L32296K27630K10285K01643J47283J72674K78175K39194
1880.5H49207342J57296K32816L02792J37329k3663R9003K18034J50800R2268J66058
1900.9H50740075J95921R1314J5020P3135J43707J17302R9003J21594P0929p1823j06216
1923.3H51489961N0604J03593l0815p1109J0133n543j04010j16050n0187o9023j57833
1945.7H51049721j53959o1869p8917k18451k26497j24813j47402k39849j83880q2433
$$ y = [830555975, 831465423, 832205236, 833053410, 833969653, 834673762, 835191011, 835810959, 836574316, 837211490, 837760091, 838427722, 839115143, 839619994, 840078473, 840637505, 841153860, 841570914, 841995895, 842535615, 843089402, 843538404, 843891501, 844273627, 844649792, 844936550, 845270395, 845712721, 846096694, 846320689, 846570492, 846965849, 847398162, 847730458, 847958088, 848168373, 848370016, 848517299, 848689973, 848968148, 849207342, 849364638, 849597454, 849900246, 850037575, 850013912, 850112915, 850330949, 850481749, 850574017, 850740075, 850935996, 851027310, 851042330, 851115465, 851259172, 851376474, 851475477, 851597071, 851668000, 851596177, 851489961, 851540565, 851644158, 851613343, 851542234, 851552367, 851546824, 851442814, 851326764, 851276577, 851207554, 851049721, 850895762, 850833893, 850754976, 850536525, 850310028, 850185215, 850037813, 849797964, 849614084, 849531651]
1966.1H49531651j33276k34783j99139r6917j35005k36273j96933r2149j48058k60949
1986.5H47798169j92762q9526j83821k88367j82509o6460j69634l49999k87413j26660
2006.9H45861018j93239k97844j78397j10984l02612m17590k75135j46926k34723l24667
2027.3H43378901k12609j24991k92361m02451k05278p5281k27272l27468j76609p3731
2047.7H41260850k07066l07620j66714o4611j98961k69293j02163l8206k45154k99394
2068.1H39361668n0843O6221j39416k39074n3882K980j75297k01047j1980l279k16067
2090.5H38339984k20060L5644R4235r5487j03295J10865J02102j37329j35541R3580
2110.9H38084698J10268j23441j39654J18912J64807m0830k9325J97172J83582o4850
$$ y = [849531651, 849398375, 849163592, 848964453, 848867536, 848732531, 848496258, 848299325, 848207176, 848059118, 847798169, 847605407, 847515881, 847332060, 847043693, 846861184, 846794724, 846625090, 846275091, 845987678, 845861018, 845667779, 845369935, 845191538, 845080554, 844777942, 844360352, 844085217, 843938291, 843703568, 843378901, 843166292, 843041301, 842748940, 842346489, 842141211, 842065930, 841838658, 841511190, 841334581, 841260850, 841053784, 840746164, 840579450, 840514839, 840315878, 840046585, 839944422, 839906216, 839661062, 839361668, 839310825, 839377046, 839237630, 838998556, 838944674, 838947654, 838772357, 838571310, 838559330, 838556051, 838339984, 838119924, 838155568, 838249803, 838154316, 838051021, 838161886, 838263988, 838126659, 837991118, 838084698, 838194966, 838071525, 837931871, 838050783, 838215590, 838174760, 838145435, 838342607, 838526189, 838461339]
2131.3H38461339o6339J96278J94132m5419k0146K12371K03908K0802M9948K33829
2151.7H39440703K07305j1861J0848K64287K45929N483N7340K70128J88709k0564P9870
2174.2H40738177L24250K22683k6465N8234K72572J66833n4538M2737K54750J52468
2194.6H42151701p1227K0564K09152P5460j30475K086K20299R6023j30236j3948K12491
2217H42641890J08063p9095M5121K00331L0279j68026l8862J40250O318j74165k3007
2239.4H42689097J60515j3828j99080m0888Q9228p0036j63853L2902J50919j03951
2259.8H42531025k90572m5240J69754j5080j38700J13130K62498K6167j26481J16229
2280.2H42602730K75075L6657j63913m7028P272k34425l54886j43528m1843k73346
$$ y = [838461339, 838395000, 838591278, 838785410, 838739991, 838719845, 838932216, 839136124, 839156926, 839206874, 839440703, 839648008, 839636147, 839646995, 839911282, 840157211, 840162694, 840220034, 840490162, 840678871, 840658307, 840738177, 841062427, 841285110, 841258645, 841316879, 841589451, 841756284, 841701746, 841744483, 841999233, 842151701, 842080474, 842101038, 842310190, 842385650, 842255175, 842257261, 842477560, 842573583, 842443347, 842429399, 842641890, 842749953, 842670858, 842715979, 842916310, 842946589, 842778563, 842739701, 842879951, 842886269, 842712104, 842689097, 842849612, 842835784, 842636704, 842595816, 842685044, 842615008, 842451155, 842484057, 842634976, 842531025, 842240453, 842195213, 842364967, 842349887, 842211187, 842324317, 842586815, 842612982, 842486501, 842602730, 842877805, 842914462, 842750549, 842703521, 842710793, 842476368, 842121482, 841977954, 841936111, 841662765]
2300.6H41662765m14074l05951l55958o11544o15716k76506j65284o03437r97365p98464
2321H36518466m59730n05865o61909n28515k71678k91228l75450j81973n6684j20043
2341.4H33065391M09722J688659J880825L41475j414538k148568j902819j412630o02901
2359.8H29904616M14252J102448J416623J799166K157271K122105J819789J713872
2376.1H42450142J878619J818121J418113J093030Q85964N26666J11342K6941K07126
2394.4H50416064J81079j7822K2233K19405J66416p8380q9825J04249N3167j89483
2414.8H50787103j73330R715j24335n17070n56827o5386L38137K99811K54453L46958
2435.2H50599229J93775j10686r6023J22011N8830j60993p0452J54376L8862k36273
$$ y = [841662765, 841248691, 840942740, 840586782, 839975238, 839359522, 839083016, 838917732, 838314295, 837316930, 836518466, 836058736, 835552871, 834890962, 834362447, 834090769, 833799541, 833424091, 833242118, 833185434, 833065391, 833475113, 835163772, 837044597, 837386072, 835971534, 833822966, 831920147, 830507517, 829904616, 830318868, 831421316, 832837939, 834637105, 836794376, 838916481, 840736270, 842450142, 844328761, 846146882, 847564995, 848658025, 849543989, 850070655, 850181997, 850208938, 850416064, 850597143, 850579321, 850601554, 850820959, 850987375, 850908995, 850819170, 850923419, 850976586, 850787103, 850613773, 850623488, 850499153, 849982083, 849425256, 849359870, 849698007, 849997818, 850252271, 850599229, 850793004, 850682318, 850586295, 850708306, 850767136, 850606143, 850535691, 850690067, 850728929, 850492656]
2455.6H50492656j88708N0485K384k06470j22071R7514Q642k35736j95801N185l3319
2478.1H49674761k03252j22368P0512m0948k65181j89066n722q8334k61903j60634
2498.5H48407865K5689o9976k45273j52349J2696p2480k25723j37984K3067p8619k75910
2520.9H47211003j87695N663p9990k41041j23083L3259j14322l05772j83403p928j29044
2543.3H45877647k59101j01387L1530j31130l18289k25961p7665j75535k90573j54913
2563.7H44174623k3543j76728l61025k73049j36733k57790l99292k67446j51455l33727
2584.1H41793835m92930l46363k17497l73125m96507l44813k34663m21942n96761m58837
2604.5H37810397l17991m83214o04809m10914l05116n26846o48260m65751l74973n42759
$$ y = [850492656, 850303948, 850354433, 850356817, 850150347, 850028276, 850125790, 850134432, 849898696, 849702895, 849708080, 849674761, 849471509, 849349141, 849419653, 849378705, 849113524, 848924458, 848918736, 848830402, 848568499, 848407865, 848433554, 848363578, 848118305, 847965956, 847978652, 847906172, 847680449, 847542465, 847565532, 847486913, 847211003, 847023308, 847028971, 846948981, 846707940, 846584857, 846618116, 846503794, 846198022, 846014619, 846006691, 845877647, 845618546, 845517159, 845548689, 845417559, 845099270, 844873309, 844795644, 844620109, 844329536, 844174623, 844151080, 843974352, 843613327, 843340278, 843203545, 842945755, 842546463, 842279017, 842127562, 841793835, 841300905, 840954542, 840737045, 840363920, 839867413, 839522600, 839287937, 838865995, 838269234, 837810397, 837492406, 837009192, 836404383, 835993469, 835688353, 835161507, 834513247, 834047496, 833672523, 833129764]
2624.9H33129764o04988l93629l01957n38110o76394m82917l67045n30660n81384l71218
2645.3H28281462l30806n83291o73353m51386l46124n18024n37515l20554l33249n91279
2665.7H23595881o29127m19318l72231n36740n36323l43263l69251o13331o50883m72963
2686.1H18652451m53412n94855n53787l75151m58300p19130o87898m62889m90308o82235
2706.5H13174486o69002n11170n59449p60734p17878m88818n11527p17282o66798m62889
2726.9H07108939n46873q05676p77423n28336n24223p26163o68943m22895m68075p11262
2747.3H00929070p26343n85794o25014p64847p01428n86748p20799q80897p49707n55456
2767.7G94032037o51061q50618q17955p35998q86083j020491r12249q16226r07898
$$ y = [833129764, 832524776, 832131147, 831829190, 831291080, 830614686, 830131769, 829764724, 829234064, 828652680, 828281462, 827950656, 827367365, 826694012, 826242626, 825896502, 825378478, 824840963, 824520409, 824187160, 823595881, 822966754, 822547436, 822175205, 821638465, 821102142, 820758879, 820389628, 819776297, 819125414, 818652451, 818199039, 817604184, 817050397, 816675246, 816216946, 815497816, 814809918, 814347029, 813856721, 813174486, 812505484, 811994314, 811434865, 810674131, 809956253, 809467435, 808955908, 808238626, 807571828, 807108939, 806562066, 805756390, 804978967, 804450631, 803926408, 803200245, 802531302, 802108407, 801640332, 800929070, 800202727, 799616933, 798991919, 798227072, 797525644, 796938896, 796218097, 795337200, 794587493, 794032037, 793380976, 792530358, 791712403, 790976405, 790090322, 789069831, 788157582, 787341356, 786433458]
2786G86433458j022398r83119r05693j019895j183688j132668j045525j180470j336813
2804.4G76623189j253664j146615j281499j423538j340628j290023j472354j591265
2820.7G65823603j471162j432777j629352j813352j846135j912832k194584k520740
2837G51002669k799868l311813m104138m829049n024969m344523l033817j780748j053930
2855.4G20719814r41038j241147j626194j965523k384781k813936k887249k580464
2871.7G04279482k301275k157092j878500j523614j439631j627326j771450j773358
2888F89807236j872778k113402k221167k198577k278447k431810k486229k527177k807379
2906.4F68870270l293216l763854m183293m462004m284799l580570k699137j955628
$$ y = [786433458, 785411060, 784427941, 783522248, 782502353, 781318665, 780185997, 779140472, 777960002, 776623189, 775369525, 774222910, 772941411, 771517873, 770177245, 768887222, 767414868, 765823603, 764352441, 762919664, 761290312, 759476960, 757630825, 755717993, 753523409, 751002669, 748202801, 744890988, 740786850, 735957801, 730932832, 726588309, 723554492, 721773744, 720719814, 719778776, 718537629, 716911435, 714945912, 712561131, 709747195, 706859946, 704279482, 701978207, 699821115, 697942615, 696419001, 694979370, 693352044, 691580594, 689807236, 687934458, 685821056, 683599889, 681401312, 679122865, 676691055, 674204826, 671677649, 668870270, 665577054, 661813200, 657629907, 653167903, 648883104, 645302534, 642603397, 640647769]
2922.7F40647769j391590q61227l49343l9399K32458P80344J461208J973033K303541
2941F44756794K503693K386272J820684J124620O78062L57211M2617k4259K27332N60105
2961.4F54433131O94692O79732P38263Q08358Q08656P49707O80149P76947Q67784O87360
2981.8F61924779N45621O35028O31869M42505K49386j5080l49641o15776p98344r21548
3002.2F61728799j084566j212239j118004r76742j102149j363754j473546j526416
3018.5F51871383j662254j778782j823306j849293j856804j851201j818002j866400
3034.9F37365341k082169k213597k145231k127588k313673k468646k401948k335965
3051.2F19276524k426446k502024k465844k429724k387822k250552k142727k211929
$$ y = [640647769, 639256179, 638394952, 638045609, 638006210, 638238668, 639019012, 640480220, 642453253, 644756794, 647260487, 649646759, 651467443, 652592063, 653270125, 653627336, 653669953, 653645694, 653873026, 654433131, 655127823, 655807555, 656545818, 657354176, 658162832, 658912539, 659592688, 660369635, 661237419, 661924779, 662470400, 663105428, 663737297, 664179802, 664429188, 664414108, 664064467, 663448691, 662650347, 661728799, 660644233, 659431994, 658313990, 657337248, 656235099, 654871345, 653397799, 651871383, 650209129, 648430347, 646607041, 644757748, 642900944, 641049743, 639231741, 637365341, 635283172, 633069575, 630924344, 628796756, 626483083, 624014437, 621612489, 619276524, 616850078, 614348054, 611882210, 609452486, 607064664, 604814112, 602671385, 600459456]
3067.5F00459456k378940k430320k286792k120912k120971k289057k427101k410531
3083.8E81994832k378762k393007k396226k484441k620340k568781k395511k431690
3100.1E62326074k674282k781510k681494k628148k758979k806962k676368k697289
3116.4E40621042k883613l092408l283739l305853l159999l030837l035903l139734
3132.8E15688956l211081l203690l225684l378392l513127l473580l368169l281862
3149.1D89033371l278285l457606l685415l736525l642500l526449l486723l554195
3165.4D60665673l614426l599882l580898l596008l591358l568620l499627l457427
3181.7D32157427l552824l618151l522128l407896l403186l415853l375501l347784
$$ y = [600459456, 598080516, 595650196, 593363404, 591242492, 589121521, 586832464, 584405363, 581994832, 579616070, 577223063, 574826837, 572342396, 569722056, 567153275, 564757764, 562326074, 559651792, 556870282, 554188788, 551560640, 548801661, 545994699, 543318331, 540621042, 537737429, 534645021, 531361282, 528055429, 524895430, 521864593, 518828690, 515688956, 512477875, 509274185, 506048501, 502670109, 499156982, 495683402, 492315233, 489033371, 485755086, 482297480, 478612065, 474875540, 471233040, 467706591, 464219868, 460665673, 457051247, 453451365, 449870467, 446274459, 442683101, 439114481, 435614854, 432157427, 428604603, 424986452, 421464324, 418056428, 414653242, 411237389, 407861888, 404514104]
3198D04514104l367394l355861l270834l171087l124863l116905l071100l023326l009737
3216.4C76002997k975046k921135k903938k885282k814084k696246k572984k533436
3232.7C53700846k572059k587825k545148k473653k364427k238422k219469k307027
3249C34392816k312899k211690k121597k103567k124250k109170k075672k059162k006889
3267.4C15267920j918435j927852k016127k080053k122730k113551k074421k045959
3283.7B98968792k002239j966059j944632j903474j883894j956255k083599k121508
3300B83107132j995862j829058j843959k045542k191067k146124k005488j941294j973599
3318.4B65135139j978665j911641j839011j876474j950085j913577j854241j775325
$$ y = [404514104, 401146710, 397790849, 394520015, 391348928, 388224065, 385107160, 382036060, 379012734, 376002997, 373027951, 370106816, 367202878, 364317596, 361503512, 358807266, 356234282, 353700846, 351128787, 348540962, 345995814, 343522161, 341157734, 338919312, 336699843, 334392816, 332079917, 329868227, 327746630, 325643063, 323518813, 321409643, 319333971, 317274809, 315267920, 313349485, 311421633, 309405506, 307325453, 305202723, 303089172, 301014751, 298968792, 296966553, 295000494, 293055862, 291152388, 289268494, 287312239, 285228640, 283107132, 281111270, 279282212, 277438253, 275392711, 273201644, 271055520, 269050032, 267108738, 265135139, 263156474, 261244833, 259405822, 257529348, 255579263, 253665686, 251811445, 250036120]
3334.7B50036120j651913j611202j685873j750708j737460j640126j500413j510650
3351B36947775j634255j651108j501382j314848j285375j314312j146972r68337j092613
3369.3B25038573j335531j321227j066386q87573q36030q02234o92248m78655k06903
3387.7B17411786J0759m7997k99364l05936P8559L11464N22l12790p1332L15815M13239
3410.1B17504725L67969K86147K64973M54187O40035O74948Q18863J070395J212940
3428.5B23295182J161635J201048J383841J239568R14082R93297J372427J599356J602933
3446.8B34763369J575664J704827J835271J910866K114877K302915K171635K121106
3463.2B50500530K524793K776861K419770J918823J955419K378345K753347K762705
$$ y = [250036120, 248384207, 246773005, 245087132, 243336424, 241598964, 239958838, 238458425, 236947775, 235313520, 233662412, 232161030, 230846182, 229560807, 228246495, 227099523, 226131186, 225038573, 223703042, 222381815, 221315429, 220427856, 219591826, 218789592, 218097344, 217618689, 217411786, 217422545, 217374548, 217075184, 216769248, 216847807, 217159271, 217159793, 216847003, 216775671, 217091486, 217504725, 217872694, 218158841, 218423814, 218878001, 219518036, 220192984, 221011847, 222082242, 223295182, 224456817, 225657865, 227041706, 228281274, 229195356, 230188653, 231561080, 233160436, 234763369, 236339033, 238043860, 239879131, 241789997, 243904874, 246207789, 248379424, 250500530, 253025323, 255802184, 258221954, 260140777, 262096196, 264474541, 267227888, 269990593]
3479.5B69990593K440334K434670K788485K859830K739609K846509L030717L149122
3495.8B92279869L085345L041178L164351L057123K818644K977341L361613L616541
3512.1C17402005L580898L342152L374219L691912L982841L845752L526121L622264
3528.4C46368164L902942M101127M373133M459918M241854M359841M680127M690766
3544.7C81177872M406423M323542M587233M818380M848331M918844N140751N189657
3561.1D19411033M927159M942059N804450O181418N653710N482852N765408O039828
3577.4D64207917O291569O519675O435841O315530O591081O751418O455779O560207
3593.7E16129017O972611P165491P190407P161498O980002O862819P262051P447779
$$ y = [269990593, 272430927, 274865597, 277654082, 280513912, 283253521, 286100030, 289130747, 292279869, 295365214, 298406392, 301570743, 304627866, 307446510, 310423851, 313785464, 317402005, 320982903, 324325055, 327699274, 331391186, 335374027, 339219779, 342745900, 346368164, 350271106, 354372233, 358745366, 363205284, 367447138, 371806979, 376487106, 381177872, 385584295, 389907837, 394495070, 399313450, 404161781, 409080625, 414221376, 419411033, 424338192, 429280251, 435084701, 441266119, 446919829, 452402681, 458168089, 464207917, 470499486, 477019161, 483455002, 489770532, 496361613, 503113031, 509568810, 516129017, 523101628, 530267119, 537457526, 544619024, 551599026, 558461845, 565723896, 573171675]
3610E73171675P303477P327556P086814P264435P858753P270336O369710O178439P207453
3628.4F37038648Q017600P003665O587028O552100O343782O239236O013632N590736
3644.7F89386427N524397O353736O419420N026639M489720N040347M983485M246950
3661G31471121L808856L694773L524005L437698L525138L103435K789498K846658K731204
3679.4G60932386K641618K620101K586126K550722K161085J680613J735389J858532
3695.7G78766572J735807J498103J375794J409770J433312J331151J184881J215636
3712G89951026J381755J219869Q87692P17461O53267N59211O20842R47892J094819
3730.3G98033834R79363Q04604Q46028R85145P69973L18885K56062P37905O71864L48746
$$ y = [573171675, 580475152, 587802708, 594889522, 602153957, 610012710, 617283046, 623652756, 629831195, 637038648, 645056248, 652059913, 658646941, 665199041, 671542823, 677782059, 683795691, 689386427, 694910824, 701264560, 707683980, 712710619, 717200339, 722240686, 727224171, 731471121, 735279977, 738974750, 742498755, 745936453, 749461591, 752565026, 755354524, 758201182, 760932386, 763574004, 766194105, 768780231, 771330953, 773492038, 775172651, 776908040, 778766572, 780502379, 782000482, 783376276, 784786046, 786219358, 787550509, 788735390, 789951026, 791332781, 792552650, 793440342, 794157803, 794811070, 795370281, 795991123, 796939015, 798033834, 799013197, 799817801, 800663829, 801648974, 802418947, 802737832, 802993894, 803731799, 804403663, 804752409]
3750.7H04752409N23925P79629O79076M59015M47452N21362M61519L63886K83599K78771
3771.1H09550643M20868N88060O40332L99828J47999J63734K29716K87354L41356L75271
3791.5H13145161L71754L31461L23296J73211j3828J59502J45495Q7618L52502M79222
3811.9H15555394L27825J52648J70886m0829j28150K38717L36349K19822J60038K42591
3832.3H17235291L34442N5849l02791p4029K20716L02314L76881L46958j8179p52509
3852.7H17724943n00679M60863N18382K22683m411N1975J08838j49250j89364Q4818
3873.1H18328798K77996L19004J59681J15990J41740o9082j31130j4364K384O0439
3893.5H19191456J33514J8776k04444l15845k08140J37091L34442J93536N2631L4511
$$ y = [804752409, 805276334, 806055963, 806735039, 807194054, 807641506, 808162868, 808624387, 808988273, 809271872, 809550643, 809971511, 810559571, 811199903, 811599731, 811747730, 811911464, 812141180, 812428534, 812769890, 813145161, 813516915, 813848376, 814171672, 814344883, 814331055, 814490557, 814636052, 814723670, 815076172, 815555394, 815883219, 816035867, 816206753, 816165924, 816037774, 816276491, 816612840, 816832662, 816992700, 817235291, 817569733, 817625582, 817322791, 817248762, 817469478, 817771792, 818148673, 818495631, 818477452, 817724943, 817224264, 817685127, 818203509, 818426192, 818421781, 818473756, 818582594, 818433344, 818243980, 818328798, 818606794, 818925798, 819085479, 819201469, 819343209, 819274127, 819142997, 819128633, 819131017, 819191456, 819324970, 819343746, 819139302, 818823457, 818615317, 818752408, 819086850, 819280386, 819333017, 819367528]
3913.9H19367528n6148j32560r835P0691M1127O7294O2048k5272l1710N7936N7220
3936.3H19468319J1623K5511M9532Q5115L7253n4002J3054J15454J06811O5744Q6308
3958.8H20010722J15573N6326l6954m2200O7055J58190J66417J66058J82629J52886
3979.2H20996702R6082Q2195M5002j7464q822L6776Q7142J17600Q4460
3997.5H21519673
$$ y = [819367528, 819311380, 819178820, 819168985, 819239676, 819280803, 819348097, 819410145, 819384873, 819353163, 819411099, 819468319, 819479942, 819505453, 819554985, 819640100, 819677353, 819623351, 819636405, 819751859, 819858670, 819924414, 820010722, 820126295, 820182621, 820145667, 820103467, 820170522, 820328712, 820495129, 820661187, 820843816, 820996702, 821092784, 821174979, 821219981, 821202517, 821193695, 821230471, 821317613, 821435213, 821519673]
##END=$$ End of the data block
