##TITLE=$$ Begin of the data block
##JCAMP-DX=5.00 $$ ACD/SpecManager v 10.08
##SPECTROMETER/DATA SYSTEM=Alpha
##DATE=09 Apr 2014 11:14:46
##DATA TYPE=INFRARED SPECTRUM
##DATA CLASS=XYDATA
##ORIGIN=
##OWNER=
##NPOINTS=1765
##FIRSTX=399.75695801
##LASTX=3997.56933594
##MAXX=3997.56933594
##MINX=399.75695801
##MAXY=0.85180193
##MINY=0.21713921
##XFACTOR=1.0000000000
##YFACTOR=1.000000000000000e-9
##FIRSTY=0.58274883
##DELTAX=2.03957629
##XUNITS=1/CM
##YUNITS=ARBITRARY UNITS
##XYDATA=(X++(Y..Y))
$$ plain form
399.8 582748830 578546047 574087799 574567378 575924337 572648525 569308579 570887029 573044360 570924938
418.1 570924938 568483710 569606483 568806887 564963520 564182401 566826224 566338539 562918007 562753379
436.5 562753379 564805090 563603461 560817897 561686516 563261151 560738027 558334768 560274184 561921358
454.8 561921358 559118807 556451976 557555318 557391524 553945839 552382708 554316938 554038107 549906015
473.2 549906015 548319817 549992859 548966408 545484960 545238614 547141969 545637190 542497456 542647362
491.5 542647362 543739200 541179538 538048506 538530767 539239347 536388278 533849776 534712076 534884810
509.9 534884810 531650662 529261708 530046761 529590011 526031733 523976207 524501801 523076355 519221842
528.3 519221842 517648876 518387914 516968369 513509452 512630165 513964474 512825489 509731710 509201109
$$ packed form
399.8E82748830m202783m458248M79579J356959l275812l339946J578450K157331k119422
418.1E70924938k441228J122773p99596l843367p81119K643823m87685l420532j64628
436.5E62753379K051711j201629k785564Q68619J574635k523124k403259J939416J647174
454.8E61921358k802551k666831J103342j63794l445685j563131J934230k78831m132092
473.2E49906015j586198J673042j026451l481448k46346J903355j504779l139734J49906
491.5E42647362J091838k559662l131032M82261P08580k851069k538502Q62300J72734
509.9E34884810l234148k388954P85053m56750l558278k055526N25594j425446l854513
528.3E19221842j572966P39038j419545l458917q79287J334309j138985l093779n30601
$$ plain form
546.6 509201109 510252655 508513749 505534828 505369902 505961955 503346682 499776065 498990417 498621911
565 498621911 495184392 491210133 489989996 488972217 485292435 481680334 480789274 479545683 475681514
583.3 475681514 472393155 471761674 470670700 467065513 464024425 463218510 461532801 457696229 454596579
601.7 454596579 453173965 451010466 447905928 446693093 447321504 446693450 445216417 446778059 451465458
620 451465458 455278546 457614124 461583972 467096955 470759720 472853333 476647109 481555104 483996421
638.4 483996421 484252423 485520214 487823188 489267379 490696877 493626028 495609224 494341135 494073361
656.7 494073361 499634922 507641733 512492776 514568329 517628610 523092628 526580870 529215872
673.1 529215872 533786595 538268805 539940774 541404724 545421839 549092531 549836516 550690532 554017723
$$ packed form
546.6E09201109J051546j738906k978921j64926N92053k615273l570617p85648l68506
565D98621911l437519l974259j220137j017779l679782l612101q91060j243591l864169
583.3D75681514l288359o31481j090974l605187l041088q05915j685709l836572l099650
601.7D54596579j422614k163499l104538j212835O28411o28054j477033J561642M687399
620D51465458L813088K335578L969848N512983L662765K093613L793776M907995K441317
638.4D83996421K56002J267791K302974J444191J429498K929151J983196j268089k67774
656.7D94073361N561561Q006811M851043K075553L060281N464018L488242K635002
673.1E29215872M570723M482210J671969J463950M017115L670692P43985Q54016L327191
$$ plain form
691.4 554017723 556680799 556550622 556843340 559668541 561917186 561898649 563069165 567042410 570162714
709.8 570162714 570903361 572917163 577429533 580597997 581354022 583700299 588403106 591436327 592095375
728.1 592095375 594285190 598495722 600769281 600871563 602820992 606746137 608650982 608633220 610795438
746.5 610795438 614965618 617027640 617310822 619837224 623963237 625690520 625934660 628672063 632673562
764.8 632673562 633945704 633812726 636054039 638929665 638500094 636538863 636887789 637766302 635740340
783.2 635740340 633061767 633480370 635231495 635335982 636349022 641517401 648166239 652861655 657812417
801.6 657812417 665524960 672786474 676483274 679606676 684987724 689286947 689730406 689604402 691252470
819.9 691252470 691073537 686868250 682462871 680116773 676442444 669958651 664516032 661678493 658014894
$$ packed form
691.4E54017723K663076j30177K92718K825201K248645j8537J170516L973245L120304
709.8E70162714P40647K013802M512370L168464P56025K346277M702807L033221O59048
728.1E92095375K189815M210532K273559J02282J949429L925145J904845j7762K162218
746.5F10795438M170180K062022K83182K526402M126013J727283K44140K737403M001499
764.8F32673562J272142j32978K241313K875626m29571j961231L48926Q78513k025962
783.2F35740340k678573M18603J751125J04487J013040N168379O648838M695416M950762
801.6F57812417P712543P261514L696800L123402N381048M299223M43459j26004J648068
819.9F91252470j78933m205287m405379k346098l674329o483793n442619k837539l663599
$$ plain form
838.3 658014894 652482629 648512542 647089779 645160854 642444253 642932653 647915184 654123962 660382032
856.6 660382032 669372201 681134105 691595852 699640751 708502054 718205571 724653006 727862895
872.9 727862895 732205033 737699449 740088701 739241362 739094794 739624202 737276673 732849538 730417609
891.3 730417609 729746103 727789402 725691497 726830363 730026543 731591105 732133389 734494150 737066686
909.6 737066686 736309111 733384013 731399596 729127884 724058509 718343794 715454996 714296937 712410986
928 712410986 711314797 713058472 715320826 715298176 714760184 716090500 717336357 716202676 714564979
946.4 714564979 714310586 713105738 708775640 703362226 698616326 692274332 682636619 671795368
962.7 671795368 661019623 648080409 631986380 615498245 600696206 586639941 573041499
$$ packed form
838.3F58014894n532265l970087j422763j928925k716601M88400M982531O208778O258070
856.6F60382032Q990169J1761904J0461747Q044899Q861303R703517O447435L209889
872.9G27862895M342138N494416K389252q47339j46568N29408k347529m427135k431929
891.3G30417609o71506j956701k097905J138866L196180J564562N42284K360761K572536
909.6G37066686p57575k925098j984417k271712n069375n714715k888798j158059j885951
928G12410986j096189J743675K262354k2650n37992J330316J245857j133681j637697
946.4G14564979k54393j204848m330098n413414m745900o341994r637713j0841251
962.7F71795368j0775745j2939214j6094029j6488135j4802039j4056265j3598442
$$ plain form
977 573041499 561823666 553525746 545999229 538071632 531190455 526089013 521289408 516217709 512357235
995.3 512357235 510195971 508144736 505515516 503480673 501996934 499050200 493997842 488411009
1011.6 488411009 482988507 476769269 469817460 463688910 458692849 453457117 447669148 442575753
1027.9 442575753 438450694 434198678 429696918 426125318 423632145 421020359 418048084 415709883
1044.3 415709883 413976461 411684185 408887863 406943411 406268179 406143308 406604320 408262312 410373926
1062.6 410373926 411205143 410284311 408406317 405696541 401685953 396985710 392894894 389412850 385547608
1081 385547608 381168038 376821935 372219920 366687566 360792637 355939478 352705866 350805402 350233436
1099.3 350233436 351097792 352691114 353935033 354681015 355342776 355597824 354654282 352275461 348509878
$$ packed form
977E73041499j1217833q297920p526517p927597o881177n101442m799605n071699l860474
995.3E12357235k161264k051235k629220k034843j483739k946734n052358n586833
1011.6D88411009n422502o219238o951809o128550m996061n235732n787969n093395
1027.9D42575753m125059m252016m501760l571600k493173k611786k972275k338201
1044.3D15709883j733422k292276k796322j944452o75232j24871M61012J657992K111614
1062.6D10373926Q31217r20832j877994k709776m010588m700243m090816l482044l865242
1081C85547608m379570m346103m602015n532354n894929m853159l233612j900464n71966
1099.3C50233436Q64356J593322J243919P45982O61761K55048r43542k378821l765583
$$ plain form
1117.7 348509878 343001634 336414039 331665337 330947608 332765698 334332496 334692061 334679633 335577965
1136 335577965 337903917 341416538 345606744 349583447 352512985 354608625 356675595 358824551 360734761
1154.4 360734761 362810075 365891427 370115787 375186592 381474286 389579535 398984015 408543169
1170.7 408543169 418028921 427830815 437509149 446199030 454006433 461449683 467930526 472310275
1187 472310275 474681795 475880653 475894839 474622339 473322004 473561734 475444317 478213012 481773853
1205.4 481773853 486111134 490117460 492706537 494336605 495962501 497372180 498091489 498812139 500320137
1223.7 500320137 502113342 503566921 505304575 508006275 511026204 513614178 516310036 519662619
1240.1 519662619 522874296 525141835 527025104 529074132 530580342 531057298 531426489 532473862 533693075
$$ packed form
1117.7C48509878n508244o587595m748702p17729J818090J566798L59565j2428Q98332
1136C35577965K325952L512621M190206L976703K929538K095640K066970K148956J910210
1154.4C60734761K075314L081352M224360N070805O287694Q105249R404480R559154
1170.7D08543169R485752R801894R678334Q689881P807403P443250O480843M379749
1187D72310275K371520J198858J4186j272500j300335K39730J882583K768695L560841
1205.4D81773853M337281M006326K589077J630068J625896J409679P19309P20650J507998
1223.7E00320137J793205J453579J737654K701700L019929K587974K695858L352583
1240.1E19662619L211677K267539J883269K049028J506210M76956L69191J047373J219213
$$ plain form
1258.4 533693075 534763455 536611199 539850533 543683350 547509491 552053392 557716250 563526094
1274.7 563526094 568896890 574576378 580979824 587236464 592909813 598963559 605780184 612211764
1291 612211764 617659092 622992873 628502011 633117616 636535883 639811099 643199027 645652950 647006094
1309.4 647006094 648378551 650017202 650926113 651112914 651807487 653215110 654319882 655023456 656213105
1327.8 656213105 657671571 658181727 657693624 657293141 657040775 656046033 654734135 654261410 654345512
1346.1 654345512 653906643 653002143 652500927 652156234 651009083 649336994 647859335 646017969 643117130
1364.5 643117130 639838576 636663973 633194029 628231704 621176600 612603247 599261105 575995624
1380.8 575995624 549956203 540835559 557010531 581164658 596035719 603570759 607305825 607826233
$$ packed form
1258.4E33693075J070380J847744L239334L832817L826141M543901N662858N809844
1274.7E63526094N370796N679488O403446O256640N673349O053746O816625O431580
1291F12211764N447328N333781N509138M615605L418267L275216L387928K453923J353144
1309.4F47006094J372457J638651R08911J86801O94573J407623J104772P03574J189649
1327.8F56213105J458466N10156m88103m00483k52366r94742j311898m72725Q4102
1346.1F54345512m38869r04500n01216l44693j147151j672089j477659j841366k900839
1364.5F43117130l278554l174603l469944m962325p055104q573353j3342142k3265481
1380.8E75995624k6039421r120644J6174972K4154127J4871061P535040L735066N20408
$$ plain form
1397.1 607826233 606363416 604471862 602239370 598977864 595632136 593220294 591215014 589196682
1413.4 589196682 587640703 586687803 585781991 584884763 584449351 584555387 584739864 584437430 584291697
1431.8 584291697 585020065 586058557 586913645 588109910 590020895 592179179 594387412 597266436 601175249
1450.1 601175249 605548203 610246539 617179513 626973152 634844363 641343355 649092615 657718658
1466.4 657718658 665307760 672891438 682631612 692639828 700196981 705844998 710586965 714770913
1482.8 714770913 717696905 719121456 719374716 718836725 717716038 715709805 712485850 708801329 705205202
1501.1 705205202 701741576 697313368 689501882 682112396 676675320 671745479 667161942 662726223
1517.4 662726223 658781230 654863775 651213646 647850752 644168794 641256928 638785839 635437727
$$ packed form
1397.1F07826233j462817j891554k232492l261506l345728k411842k005280k018332
1413.4E89196682j555979r52900r05812q97228m35412J06036J84477l02434j45733
1431.8E84291697P28368J038492Q55088J196265J910985K158284K208233K879024L908813
1450.1F01175249M372954M698336O932974R793639P871211O498992P749260Q626043
1466.4F57718658P589102P583678R740174J0008216P557153N648017M741967M183948
1482.8G14770913K925992J424551K53260n37991j120687k006233l223955l684521l596127
1501.1G05205202l463626m428208p811486p389486n437076m929841m583537m435719
1517.4F62726223l944993l917455l650129l362894l681958k911866k471089l348112
$$ plain form
1533.7 635437727 632526100 630843639 628870070 626501322 625185490 624893248 625235140 625625908 626125634
1552.1 626125634 627189636 628662825 629333496 628476501 627899051 627105236 625410259 622440755 618254900
1570.5 618254900 614388824 609850585 602549136 595484614 589551806 582718253 575110555 567385137
1586.8 567385137 559476912 551104486 542577386 534198284 526056051 518060386 510120988 502445042
1603.1 502445042 495145708 487821490 480263144 473191530 466952413 460025132 451554805 445109934
1619.4 445109934 440037847 433883488 427905142 422888219 418444961 415113926 412448734 409565508
1635.7 409565508 407829911 407691985 408464521 409989446 412489980 415809780 418878615 422790736 428955823
1654.1 428955823 434172541 438915461 444703102 451859504 459456056 466352463 474296391 484060198
$$ packed form
1533.7F35437727k911627j682461j973569k368748j315832k92242L41892L90768M99726
1552.1F26125634J064002J473189O70671q56995n77450p93815j694977k969504m185855
1570.5F18254900l866076m538239p301449p064522n932808o833553p607698p725418
1586.8E67385137p908225q372426q527100q379102q142233p995665p939398p675946
1603.1E02445042p299334p324218p558346p071614o239117o927281q470327o444871
1619.4D45109934n072087o154359n978346n016923m443258l331035k665192k883226
1635.7D09565508j735597j37926P72536J524925K500534L319800L068835L912121O165087
1654.1D28955823N216718M742920N787641P156402P596552O896407P943928R763807
$$ plain form
1670.4 484060198 492975295 502260566 512835145 522553563 531604350 542081356 556315243 568890989
1686.7 568890989 579089284 589897573 600231528 611633301 624497294 637448609 652342021
1701 652342021 664516091 674665511 685111344 694245219 702203035 709391236 716247976 723599494
1717.3 723599494 730039835 734860659 739397764 744121671 748503804 752521753 756264269 760458291
1733.6 760458291 764697373 768126011 771777511 775798321 779624760 783175707 786707997 790364206
1749.9 790364206 793728352 796453536 799073935 801735938 803989708 805895269 807735920 809647083
1766.3 809647083 811498582 813205302 814929128 816599727 817936599 819128871 820479691 821941912
1782.6 821941912 823197842 824262202 825438499 826665163 827677786 828528047 829528213 830596268
$$ packed form
1670.4D84060198Q915097R285271J0574579R718418R050787J0477006J4233887J2575746
1686.7E68890989J0198295J0808289J0333955J1401773J2863993J2951315J4893412
1701F52342021J2174070J0149420J0445833R133875P957816P188201O856740P351518
1717.3G23599494O440341M820824M537105M723907M382133M017949L742516M194022
1733.6G60458291M239082L428638L651500M020810L826439L550947L532290L656209
1749.9G90364206L364146K725184K620399K662003K253770J905561J840651J911163
1766.3H09647083J851499J706720J723826J670599J336872J192272J350820J462221
1782.6H21941912J255930J064360J176297J226664J012623Q50261J000166J068055
$$ plain form
1798.9 830596268 831500590 832255483 833098054 834014356 834734797 835272789 835894465 836659431 837334335 837899446
1819.3 837899446 838526428 839173198 839658558 840113282 840692282 841227114 841634572 842039227 842565715 843114734
1839.7 843114734 843552053 843891978 844292581 844699264 845007598 845345616 845777094 846158743 846386790 846643329
1860.1 846643329 847067058 847526670 847853065 848078489 848304629 848494828 848607123 848757386 849039853 849292636
1880.5 849292636 849452138 849677980 849986732 850136101 850112796 850208879 850417554 850557506 850654781 850833833
1900.9 850833833 851046324 851155937 851178408 851238012 851348341 851442277 851541817 851686299 851801932 851754367
1921.3 851754367 851621747 851613462 851660967 851605475 851555526 851612568 851623178 851505458 851395011 851352870 851267517
1943.7 851267517 851098359 850951076 850881279 850779295 850553989 850337923 850239575 850121915 849890590 849704087
$$ packed form
1798.9H30596268R04322P54893Q42571R16302P20441N37992O21676P64966O74904N65111
1819.3H37899446O26982O46770M85360M54724N79000N34832M07458M04655N26488N49019
1839.7H43114734M37319L39925M00603M06683L08334L38018M31478L81649K28047K56539
1860.1H46643329M23729M59612L26395K25424K26140J90199J12295J50263K82467K52783
1880.5H49292636J59502K25842L08752J49369k3305R6083K08675J39952R7275J79052
1900.9H50833833K12491J09613K2471N9604J10329R3936R9540J44482J15633m7565
1921.3H51754367j32620q285M7505n5492m9949N7042J0610j17720j10447m2141q5353
1943.7H51267517j69158j47283o9797j01984k25306k16066r8348j17660k31325j86503
$$ plain form
1964.1 849704087 849609911 849438846 849161446 848953009 848894536 848817229 848612785 848437548 848387420 848259389
1984.5 848259389 847965956 847740054 847651780 847470999 847179711 847000301 846908450 846702099 846373260 846128881
2004.9 846128881 845997870 845762432 845432460 845261693 845176995 844882965 844455063 844186425 844062507 843829036
2025.3 843829036 843504190 843312860 843197167 842893004 842479527 842270136 842207253 841990471 841657639 841477454
2045.7 841477454 841382146 841140926 840825081 840664506 840604484 840437710 840216160 840117812 840046287 839791059
2066.1 839791059 839521527 839483440 839518011 839357913 839134693 839092314 839077055 838879466 838669717 838645935
2086.5 838645935 838630915 838422477 838229477 838307440 838424087 838296652 838142991 838238418 838367820 838262916
2106.9 838262916 838130474 838200748 838290095 838173926 838058054 838192165 838367045 838346899 838332176 838508546
$$ packed form
1964.1H49704087r4176j71065k77400k08437n8473p7307k04444j75237n0128j28031
1984.5H48259389k93433k25902q8274j80781k91288j79410r1851k06351l28839k44379
2004.9H46128881j31011k35438l29972j70767q4698k94030m27902k68638j23918k33471
2025.3H43829036l24846j91330j15693l04163m13477k09391o2883k16782l32832j80185
2045.7H41477454r5308k41220l15845j60575o0022j66774k21550r8348p1525k55228
2066.1H39791059k69532l8087L4571j60098k23220m2379j5259j97589k09749k3782
2086.5H38645935j5020k08438j93000P7963J16647j27435j53661R5427J29402j04904
2106.9H38262916j32442P0274Q9347j16169j15872J34111J74880k0146j4723J76370
$$ plain form
2127.3 838508546 838646412 838561893 838519812 838731289 838900268 838829517 838822722 839068770 839269400 839243054 839277327
2149.7 839277327 839533627 839734375 839722395 839779675 840062618 840282619 840274513 840339661 840628862 840837777
2170.1 840837777 840829790 840904176 841200054 841400504 841379642 841456354 841730237 841881752 841823280 841886163 842169106
2192.5 842169106 842324615 842232406 842240155 842439532 842501283 842378914 842407882 842643499 842750669 842659295 842675686
2215 842675686 842867732 842931569 842823744 842882633 843098819 843098223 842917919 842929304 843086481 843029857 842811346
2237.4 842811346 842819512 843022883 843012631 842802107 842764139 842856824 842760384 842546165 842547894 842715740 842645466
2259.8 842645466 842366099 842314959 842480659 842486620 842387497 842500687 842721343 842745602 842673242 842823565 843078613
2282.3 843078613 843078911 842896938 842866004 842902005 842667043 842307389 842157900 842074335 841774583 841385603 841115773
$$ packed form
2127.3H38508546J37866q4519m2081K11477J68979p0751o795K46048K00630k6346L4273
2149.7H39277327K56300K00748j1980N7280K82943K20001q106O5148K89201K08915
2170.1H40837777p987P4386K95878K00450k0862P6712K73883J51515n8472O2883K82943
2192.5H42169106J55509r2209P749J99377O1751j22369K8968K35617J07170r1374J6391
2215H42675686J92046O3837j07825N8889K16186n96j80304J1385J57177n6624k18511
2237.4H42811346Q166K03371j0252k10524l7968R2685r6440k14219J729J67846p0274
2259.8H42645466k79367n1140J65700N961r9123J13190K20656K4259p2360J50323K55048
2282.3H43078613K98j81973l0934L6001k34962l59654j49489q3565k99752l88980k69830
$$ plain form
2304.7 841115773 840783715 840175211 839523613 839189291 838986337 838377774 837385356 836577892 836104035 835584581
2325.1 835584581 834912598 834398627 834137619 833845496 833512425 833387196 833312690 833113968 833472610 835160434
2345.5 835160434 837045610 837368488 835939705 833786905 831868768 830440104 829799175 830137730 831182182
2363.8 831182182 832662702 834578514 836800277 838958204 840815365 842582345 844494581 846311212
2380.2 846311212 847707450 848787010 849702835 850271046 850380838 850371838 850558221 850756109 850749493 850746632
2400.6 850746632 850957751 851148486 851075232 850966215 851040721 851074278 850910604 850780189 850804210 850671053
2421 850671053 850140572 849570334 849504232 849869430 850202918 850470603 850808322 850984931 850871384 850779831
2441.3 850779831 850881040 850908458 850747466 850679874 850798011 850792587 850560844 850441277 850569367 850597441
$$ packed form
2304.7H41115773l32058o08504o51598l34322k02954o08563r92418q07464m73857n19454
2325.1H35584581o71983n13971k61008k92123l33071j25229p4506j98722L58642J687824
2345.5H35160434J885176L22878j428783k152800j918137j428664o40929L38555J044452
2363.8H31182182J480520J915812K221763K157927J857161J766980J912236J816631
2380.2H46311212J396238J079560R15825N68211J09792r000J86383J97888o616k861
2400.6H50746632K11119J90735p3254j09017P4506L3557j63674j30415K4021j33157
2421H50671053n30481n70238o6102L65198L33488K67685L37719J76609j13547r1553
2441.3H50779831J01209K7418j60992o7592J18137n424k31743j19567J28090K8074
$$ plain form
2461.7 850597441 850374937 850215673 850277662 850281894 850056469 849878550 849904239 849864483 849651635 849539995
2482.1 849539995 849610627 849551320 849274933 849101961 849123538 849026024 848729849 848553360 848585606 848537445 848307490
2504.6 848307490 848150969 848149478 848045409 847790301 847654998 847675562 847566783 847292900 847160161 847205043
2525 847205043 847104967 846820772 846692264 846767128 846684217 846369863 846177042 846183062 846042931 845724761 845594227
2547.4 845594227 845648706 845526040 845207214 845010817 844964147 844760776 844403267 844225943 844224930 844069898
2567.8 844069898 843732476 843485773 843350768 843078375 842681348 842417657 842254519 841918349 841443181 841115236
2588.2 841115236 840906322 840531588 840031743 839697957 839460135 839017332 838427186 837979496 837635040 837137878
2608.6 837137878 836564481 836168706 835851550 835328221 834700465 834245145 833852947 833275616 832650781 832262218
$$ packed form
2461.7H50597441k22504j59264O1989M232k25425j77919K5689l9756k12848j11640
2482.1H49539995P0632n9307k76387j72972K1577r7514k96175j76489L2246m8161k29955
2504.6H48307490j56521j491j04069k55108j35303K0564j08779k73883j32739M4882
2525H47205043j00076k84195j28508P4864q2911l14354j92821O020j40131l18170j30534
2547.4H45594227N4479j22666l18826j96397m6670k03371l57509j77324j013j55032
2567.8H44069898l37422k46703j35005k72393l97027k63691j63138l36170m75168l27945
2588.2H41115236k08914l74734m99845l33786k37822m42803n90146m47690l44456m97162
2608.6H37137878n73397l95775l17156n23329o27756m55320l92198n77331o24835l88563
$$ plain form
2629 832262218 831950963 831403017 830750167 830275536 829908192 829415917 828862667 828476369 828130484 827561200
2649.4 827561200 826919198 826465607 826069295 825515151 824976623 824677646 824386358 823818207 823177159 822732866
2669.8 822732866 822329402 821774483 821252227 820946276 820616722 820029974 819392145 818925023 818455875 817806005
2690.2 817806005 817188859 816792130 816366434 815687418 814999759 814513326 813998282 813311517 812676966 812189043
2710.6 812189043 811596692 810808003 810121715 809655607 809112608 808371067 807715535 807261765 806716442 805923939
2731 805923939 805167198 804655194 804135084 803414285 802758873 802322268 801826417 801131368 800441265 799861372
2751.4 799861372 799233735 798458397 797723353 797126234 796416879 795535028 794783413 794214666 793547988 792725444
2771.8 792725444 791965783 791257739 790338457 789253891 788315415 787521005 786639094 785648048 784688711
$$ packed form
2629H32262218l11255n47946o52850m74631l67344m92275n53250l86298l45885n69284
2649.4H27561200o42002m53591l96312n54144n38528k98977k91288n68151o41048m44293
2669.8H22732866m03464n54919n22256l05951l29554n86748o37829m67122m69148o49870
2690.2H17806005o17146l96729m25696o79016o87659m86433n15044o86765o34551m87923
2710.6H12189043n92351p88689o86288m66108n42999p41541o55532m53770n45323p92503
2731H05923939p56741n12004n20110p20799o55412m36605m95851o95049o90103n79893
2751.4G99861372o27637p75338p35044n97119p09355q81851p51615n68747o66678q22544
2771.8G92725444p59661p08044r19282j084566r38476p94410q81911r91046r59337
$$ plain form
2790.1 784688711 783750236 782666504 781459033 780340731 779292762 778106630 776809931 775606155
2806.4 775606155 774464786 773151100 771676242 770309448 769065738 767684877 766152203 764657855
2822.7 764657855 763151646 761478603 759683192 757858932 755932152 753731906 751219213 748414755
2839.1 748414755 745101869 740987778 736123383 731069803 726726055 723721087 721978188 720930874
2855.4 720930874 719969273 718728900 717115104 715151310 712796390 710027635 707125366 704487026
2871.7 704487026 702157319 700002253 698136091 696630239 695191026 693559229 691807687 690060139
2888 690060139 688194633 686094820 683908820 681717992 679408431 676954567 674461186 671925485 669127882
2906.4 669127882 665855408 662082970 657873631 653387249 649094880 645546138 642899334 640951812
$$ packed form
2790.1G84688711r38475j083732j207471j118302j047969j186132j296699j203776
2806.4G75606155j141369j313686j474858j366794j243710j380861j532674j494348
2822.7G64657855j506209j673043j795411j824260j926780k200246k512693k804458
2839.1G48414755l312886m114091m864395n053580m343748l004968j742899j047314
2855.4G20930874r61601j240373j613796j963794k354920k768755k902269k638340
2871.7G04487026k329707k155066j866162j505852j439213j631797j751542j747548
2888F90060139j865506k099813k186000k190828k309561k453864k493381k535701k797603
2906.4F69127882l272474l772438m209339m486382m292369l548742k646804j947522
$$ plain form
2922.7 640951812 639493346 638575375 638236344 638223529 638474345 639285147 640776038 642737329 645010650
2941 645010650 647511959 649891138 651699543 652843952 653541803 653899610 653951347 653961897 654239058 654829800
2961.4 654829800 655503869 656131208 656858385 657700956 658511460 659250855 659947276 660678506 661471128 662180901
2981.8 662180901 662777126 663398087 664005220 664489448 664809585 664819956 664463997 663828313 662989199 662033200
3002.2 662033200 660954952 659751952 658618569 657643199 656559944 655202568 653722167 652205944
3018.5 652205944 650567949 648796260 646986842 645175815 643336296 641454816 639598131 637713075
3034.9 637713075 635650516 633525431 631462634 629314303 626962304 624520123 622146249 619813561
3051.2 619813561 617376208 614851058 612358630 609905601 607504427 605244994 603119671 600939035
$$ packed form
2922.7F40951812j458466r17971l39031j2815K50816Q10802J490891J961291K273321
2941F45010650K501309K379179J808405J144409O97851L57807N1737J0550K77161N90742
2961.4F54829800O74069O27339P27177Q42571Q10504P39395O96421P31230P92622P09773
2981.8F62180901N96225O20961O07133M84228L20137J0371l55959o35684q39114r55999
3002.2F62033200j078248j203000j133383r75370j083255j357376j480401j516223
3018.5F52205944j637995j771689j809418j811027j839519j881480j856685j885056
3034.9F37713075k062559k125085k062797k148331k351999k442181k373874k332688
3051.2F19813561k437353k525150k492428k453029k401174k259433k125323k180636
$$ plain form
3067.5 600939035 598562241 596132219 593835354 591648817 589478612 587229609 584870517 582468927
3083.8 582468927 580020726 577556610 575160861 572743833 570195913 567608297 565144539 562708795
3100.1 562708795 560072839 557322562 554646075 552004218 549258828 546474040 543792963 541084766
3116.4 541084766 538197398 535111725 531863570 528626621 525514483 522484004 519418538 516195118
3132.8 516195118 512911975 509730756 506543696 503149211 499605268 496137321 492780358 489471942
3149.1 489471942 486165792 482721090 479083449 475389540 471738368 468145937 464619637 461116254
3165.4 461116254 457558960 453945339 450342238 446774811 443207353 439589709 435990572 432476103
3181.7 432476103 428966284 425444126 421970189 418527216 415057451 411609620 408232123 404860705
$$ packed form
3067.5F00939035k376794k430022k296865k186537k170205k249003k359092k401590
3083.8E82468927k448201k464116k395749k417028k547920k587616k463758k435744
3100.1E62708795k635956k750277k676487k641857k745390k784788k681077k708197
3116.4E41084766k887368l085673l248155l236949l112138l030479l065466l223420
3132.8E16195118l283143l181219l187060l394485l543943l467947l356963l308416
3149.1D89471942l306150l444702l637641l693909l651172l592431l526300l503383
3165.4D61116254l557294l613621l603101l567427l567458l617644l599137l514469
3181.7D32476103l509819l522158l473937l442973l469765l447831l377497l371418
$$ plain form
3198 404860705 401493728 398181587 394913971 391714871 388577133 385450035 382340789 379243881 376201838
3216.4 376201838 373258591 370359719 367481411 364622772 361808121 359130651 356562853 353991479
3232.7 353991479 351391941 348801941 346284598 343845099 341467679 339171857 336908549 334626824
3249 334626824 332382500 330201328 328050911 325905651 323754698 321621537 319524318 317477554 315511644
3267.4 315511644 313595474 311632544 309583247 307474017 305370450 303336382 301335931 299326092
3283.7 299326092 297341108 295381576 293426991 291470468 289497495 287493199 285437435 283403993
3300 283403993 281494200 279656798 277736515 275666595 273525357 271419108 269398361 267419100 265420586
3318.4 265420586 263442457 261540771 259679466 257780105 255854815 253972769 252130330 250356078
$$ packed form
3198D04860705l366977l312141l267616l199100l137738l127098l109246l096908l042043
3216.4C76201838k943247k898872k878308k858639k814651k677470k567798k571374
3232.7C53991479k599538k590000k517343k439499k377420k295822k263308k281725
3249C34626824k244324k181172k150417k145260k150953k133161k097219k046764j965910
3267.4C15511644j916170j962930k049297k109230k103567k034068k000451k009839
3283.7B99326092j984984j959532j954585j956523j972973k004296k055764k033442
3300B83403993j909793j837402j920283k069920k141238k106249k020747j979261j998514
3318.4B65420586j978129j901686j861305j899361j925290j882046j842439j774252
$$ plain form
3334.7 250356078 248690590 247046590 245325953 243560940 241838902 240236014 238773406 237277851
3351 237277851 235619038 233939961 232431814 231097430 229785234 228473231 227338418 226359412 225259155
3369.3 225259155 223943457 222660646 221633792 220791742 220009595 219242081 218546778 218030468 217805624
3387.7 217805624 217836082 217781961 217454210 217139214 217205331 217515096 217545614 217255920 217177764 217463255
3408.1 217463255 217857078 218211442 218464330 218726337 219225362 219911948 220629305 221465766 222497761
3426.5 222497761 223678291 224850565 226041824 227387935 228634030 229559049 230489820 231774107 233350590
3444.8 233350590 235049561 236711472 238380432 240209162 242197245 244321644 246556699 248695239
3461.1 248695239 250822783 253362417 256162971 258610636 260561645 262539357 264893323 267573535
$$ packed form
3334.7B50356078j665488j644000j720637j765013j722038j602888j462608j495555
3351B37277851j658813j679077j508147j334384j312196j312003j134813r79006j100257
3369.3B25259155j315698j282811j026854q42050p82147p67514o95303n16310k24844
3387.7B17805624L0458n4121l27751l14996O6117L09765L0518k89694p8156K85491
3408.1B17463255L93823L54364K52888K62007M99025O86586P17357Q36461J031995
3426.5B22497761J180530J172274J191259J346111J246095R25019R30771J284287J576483
3444.8B33350590J698971J661911J668960J828730J988083K124399K235055K138540
3461.1B48695239K127544K539634K800554K447665J951009J977712K353966K680212
$$ plain form
3477.4 267573535 270298809 272800475 275306433 278075933 280862659 283563405 286414474 289442569
3493.8 289442569 292604715 295725197 298735529 301824123 304908097 307833642 310822189 314120352
3510.1 314120352 317710072 321272880 324617505 328045309 331771016 335744411 339568079 343056232
3526.4 343056232 346655220 350625068 354828805 359195411 363606840 367885947 372287840 376974493
3542.7 376974493 381698221 386118084 390348881 394800425 399562806 404435486 409379363 414517641
3559 414517641 419708282 424651593 429600358 435438335 441656828 447290897 452768773 458572030 464643329
3577.4 464643329 470936626 477411479 483795643 490112633 496707410 503459871 509962201 516554773
3593.7 516554773 523511946 530672193 537931919 545174956 552156866 558974028 566211224 573690474
$$ packed form
3477.4B67573535K725274K501666K505958K769500K786726K700746K851069L028095
3493.8B89442569L162146L120482L010332L088594L083974K925545K988547L298163
3510.1C14120352L589720L562808L344625L427804L725707L973395L823668L488153
3526.4C43056232L598988L969848M203737M366606M411429M279107M401893M686653
3542.7C76974493M723728M419863M230797M451544M762381M872680M943877N138278
3559D14517641N190641M943311M948765N837977O218493N634069N477876N803257O071299
3577.4D64643329O293297O474853O384164O316990O594777O752461O502330O592572
3593.7E16554773O957173P160247P259726P243037O981910O817162P237196P479250
$$ plain form
3610 573690474 581018984 588316143 595388770 602676451 610512853 617704213 623979270 630082786 637288928
3628.4 637288928 645359278 652402878 659019113 665591717 671918035 678118467 684107840 689696789
3644.7 689696789 695243418 701606512 708033562 713108242 717641413 722643852 727535784 731755435
3661 731755435 735605955 739350140 742887974 746260881 749625325 752552688 755301595 758303940 761172712
3679.4 761172712 763855457 766454279 768953443 771369874 773470044 775286019 777211785 779158294
3695.7 779158294 780887783 782351375 783717394 785137534 786543846 787807465 788939297 790153146
3712 790153146 791541338 792770505 793712735 794470727 795072734 795584202 796228766 797171474 798213780
3730.3 798213780 799183547 800044656 800963581 801969469 802676916 802849293 802962720 803746104 804544568
$$ packed form
3610E73690474P328510P297159P072627P287681P836402P191360O275057O103516P206142
3628.4F37288928Q070350P043600O616235O572604O326318O200432N989373N588949
3644.7F89696789N546629O363094O427050N074680M533171N002439M891932M219651
3661G31755435L850520L744185L537834L372907L364444K927363K748907L002345K868772
3679.4G61172712K682745K598822K499164K416431K100170J815975J925766J946509
3695.7G79158294J729489J463592J366019J420140J406312J263619J131832J213849
3712G90153146J388192J229167R42230P57992O02007N11468O44564R42708J042306
3730.3G98213780R69767Q61109R18925J005888P07447J72377J13427P83384P98464
$$ plain form
3748.7 804544568 804939806 805442691 806219816 806927264 807431579 807922006 808435619 808870375 809254944 809575081
3769.1 809575081 809886456 810322881 810864925 811415255 811766982 811946332 812140167 812358618 812642395 813027501
3789.5 813027501 813453138 813801050 814049542 814284325 814381361 814364731 814594626 814814687 814965546 815334380
3809.9 815334380 815759718 815995276 816115916 816356599 816351235 816180825 816413999 816793323 817053378 817198277
3830.3 817198277 817377687 817683756 817790449 817555606 817479908 817685366 817963958 818268538 818552017 818471730
3850.7 818471730 817639351 817214966 817857087 818465531 818664670 818622053 818687201 818772674 818545580 818355918
3871.1 818355918 818536937 818877280 819152236 819212258 819287658 819452107 819404364 819299102 819277227 819264829
3891.5 819264829 819393814 819594383 819612980 819381237 819082320 818920076 819012344 819305897 819552720 819677174
$$ packed form
3748.7H04544568L95238N02885P77125P07448N04315M90427N13613M34756L84569L20137
3769.1H09575081L11375M36425N42044N50330L51727J79350J93835K18451K83777L85106
3789.5H13027501M25637L47912K48492K34783R7036j6630K29895K20061J50859L68834
3809.9H15334380M25338K35558J20640K40683n364j70410K33174L79324K60055J44899
3830.3H17198277J79410L06069J06693k34843p5698K05458K78592L04580K83479q0287
3850.7H18471730q32379m24385O42121O08444J99139m2617O5148Q5473k27094j89662
3871.1H18355918J81019L40343K74956O0022P5400J64449m7743j05262k1875j2398
3891.5H19264829J28985K00569J8597k31743k98917j62244R2268K93553K46823J24454
$$ plain form
3911.9 819677174 819760382 819717705 819553554 819513381 819580197 819595277 819606662 819668412 819690108 819656074 819664240
3934.3 819664240 819680214 819684684 819719613 819763720 819838583 819876671 819833159 819847703 819954336 820046186 820088983
3956.7 820088983 820158005 820271611 820334971 820308924 820322752 820474863 820664585 820789814 820888758 821008503
3977.1 821008503 821104527 821210384 821374118 821482360 821493983 821500063 821528256 821610749 821740508 821800649
3997.5 821800649
$$ packed form
3911.9H19677174Q3208m2677j64151m0173O6816J5080J1385O1750K1696l4034Q166
3934.3H19664240J5974M470L4929M4107P4863L8088m3512J4544J06633R1850M2797
3956.7H20088983O9022J13606O3360k6047J3828J52111J89722J25229R8944J19745
3977.1H21008503R6024J05857J63734J08242J1623O080K8193Q2493J29759O0141
3997.5H21800649
##END=$$ End of the data block
