##TITLE=$$ Begin of the data block
##JCAMP-DX=5.00 $$ ACD/SpecManager v 10.08
##SPECTROMETER/DATA SYSTEM=Alpha
##DATE=07 Apr 2014 11:14:18
##DATA TYPE=INFRARED SPECTRUM
##DATA CLASS=XYDATA
##ORIGIN=
##OWNER=
##NPOINTS=1765
##FIRSTX=399.75695801
##LASTX=3997.56933594
##MAXX=3997.56933594
##MINX=399.75695801
##MAXY=0.86615521
##MINY=0.39127621
##XFACTOR=1.0000000000
##YFACTOR=1.000000000000000e-9
##FIRSTY=0.68662578
##DELTAX=2.03957629
##XUNITS=1/CM
##YUNITS=ARBITRARY UNITS
##XYDATA=(X++(Y..Y))
399.8F86625779k06113m52638j093924j062870j39594l9160j018346j545369j149059
418.1F79918706j68562q8334q02040q43286J62959O88195n543p34031l98457L72648
438.5F78102255j59562j259625o38246P93814N24700r17792j249314j67071L52323
456.9F75381482p67291j610517n43714Q43823L9697j838565j546562M28140N58436
475.2F70944929j201391j693904j53721R15527l59833j800775p87318R28700L31998
493.6F67124212j648963j757979p0155N20945q61347j730382n46038O28709k63095
511.9F61395907j710832j499951l2603K71618j181483j982570r63569n0604p95305
530.3F53450608j860618j516998k39134J4246j019180j518727p97391q1420l51250
$$ y = [686625779, 686419666, 685967028, 684873104, 683810234, 683670640, 683631480, 682613134, 681067765, 679918706, 679750144, 679661810, 678859770, 678016484, 678179443, 678867638, 678862095, 678128064, 677729607, 678102255, 677942693, 676683068, 676044822, 676838636, 677363336, 676445544, 675196230, 675029159, 675381482, 674614191, 673003674, 672459960, 673303783, 673343480, 671504915, 669958353, 670386493, 670944929, 669743538, 668049634, 667895913, 668811440, 668451607, 666650832, 665863514, 666792214, 667124212, 665475249, 663717270, 663647115, 664168060, 663306713, 661576331, 661030293, 661659002, 661395907, 659685075, 658185124, 658152521, 658424139, 657242656, 655260086, 654296517, 654245913, 653450608, 651589990, 650072992, 649833858, 649848104, 648828924, 647310197, 646512806, 646431386, 646080136]
548.6F46080136j168728j301348m93884j11401r65357j871049j595974p60734q83758
567F36927903j917422k249837j371264p44701j453698k326190j858115o90878o97672
585.4F23618126j866877k285779j234173l46363j114547k342701k073407r77397j353085
603.7F10023797k690673k513290p22170L37005l44634q76486O69419K971769L376722
622.1F10231459K215147J911283L134668L775239K707302J626253K179563L201008
638.4F30981922K561867P44403M05252K180099L307581J940012K2590M0651J847148
656.7F44031525L378689L282547K808869L076613L910064L310323J074910J416982
673.1F66290522K753138K809346J730680J212895J752019K105594J473904N90264N91815
$$ y = [646080136, 644911408, 643610060, 643116176, 643004775, 642039418, 640168369, 638572395, 637811661, 636927903, 635010481, 632760644, 631389380, 630644679, 629190981, 626864791, 625006676, 624315798, 623618126, 621751249, 619465470, 618231297, 617884934, 616770387, 614427686, 612354279, 611376882, 610023797, 607333124, 604819834, 604097664, 604434669, 604090035, 603213549, 603882968, 606854737, 610231459, 612446606, 614357889, 617492557, 621267796, 623975098, 625601351, 627780914, 630981922, 633543789, 634288192, 634693444, 636873543, 640181124, 642121136, 642143726, 642184377, 644031525, 647410214, 650692761, 653501630, 656578243, 660488307, 663798630, 664873540, 666290522, 669043660, 671853006, 673583686, 674796581, 676548600, 678654194, 680128098, 680718362, 681310177]
691.4F81310177J241565J366198O57797J16169O17921J547218J604974Q64804P12096
709.8F90038919J587987K291918J831830R80735J080393J975179K131939J193225O43373
728.1G03755498J477480K404332J771033M49002M77016J709520K064288R62675L16500
746.5G15387344J331985K468229J976788P29680Q37147K170503K451241J049102J38878
764.8G28540897J041234K018630J320243j41144l55184O44625P90178n90086j536667
783.2G31732726o43313O84381O76155N0962P65025K713204L800869L305077K868593
801.6G45953679L625035M419744L785432K285063J695097K199947K234698J005709
817.9G67204404l99232o96063l69191r39667k413571l172458k584338j855671k101481
$$ y = [681310177, 682551742, 683917940, 684575737, 684691906, 685309827, 686857045, 688462019, 689326823, 690038919, 691626906, 693918824, 695750654, 696731389, 697811782, 699786961, 701918900, 703112125, 703755498, 705232978, 707637310, 709408343, 709857345, 710334361, 712043881, 714108169, 715070844, 715387344, 716719329, 719187558, 721164346, 721894026, 722731173, 724901676, 727352917, 728402019, 728540897, 729582131, 731600761, 732921004, 732779860, 732424676, 733069301, 733859479, 733269393, 731732726, 731089413, 731773794, 732449949, 732500911, 733265936, 735979140, 739780009, 743085086, 745953679, 749578714, 753998458, 757783890, 760068953, 761764050, 763963997, 766198695, 767204404, 766805172, 766109109, 765739918, 764800251, 762386680, 759214222, 756629884, 754774213, 752672732]
836.2G52672732k765715k611101j690507j273334j636803j388371L17454K444566L620684
854.6G47689605M024088M848957O212414O808996N882263M600406M420757M686534
870.9G89174020L829122K129316J258314J572192J532614K14398j173437j144946l24487
889.3G97067106m78864j444161j306653K49744J382708J056790M40419Q61287J581550
907.6G99409926J026094n00560j362860j263797j433254k400279l017306k242565q16107
926G87399292n4657L1828L24607R45390J096546M62651k35974l12865r9480l28601
946.4G89228737j053869j742423k063990k382278l176630m239976n111098n797148
962.7G63661325o615162p713139q773863r234011q904100q040190o996631o049574
$$ y = [752672732, 749907017, 747295916, 745605409, 744332075, 742695272, 741306901, 741624355, 744068921, 747689605, 751713693, 756562650, 762775064, 769584060, 775466323, 780066729, 784487486, 789174020, 793003142, 795132458, 796390772, 797962964, 799495578, 799709976, 798536539, 797391593, 797067106, 796588242, 795144081, 793837428, 794087172, 795469880, 796526670, 796967089, 797828376, 799409926, 800436020, 799935460, 798572600, 797308803, 795875549, 793475270, 790457964, 788215399, 787399292, 787344635, 787376463, 787701070, 788646460, 789743006, 790205657, 789969683, 789656818, 789557338, 789228737, 788174868, 786432445, 784368455, 781986177, 778809547, 774569571, 769458473, 763661325, 757046163, 749333024, 740559161, 731325150, 722421050, 714380860, 707384229, 701334655]
979G01334655n211472m296124l446400l062070k968967k549767j848221j465261j428783
997.3F75057590j177669n87642l17335q86440j849651k448380k669335l062904l708839
1015.7F58349395l954888l506779l051341l215134l558516l330589k710819k449513
1032F32571816k623856k563715j989245j485288j638770k139092k244651j914024j762987
1050.4F14210188j913070j733065q96990O6817L67581r7572p23541j210928j945138
1068.7F06124282l028393l890097m159629m122317m305482m722953m881680m610479
1085E72403252m361451m402518m299283l533065k236843j133800o67512n30899k75612
1103.4E50962269o4671k84314q02100j103818j097500j387358k495408l925204m292369
$$ y = [701334655, 696123183, 691827059, 688380659, 685318589, 682349622, 679799855, 677951634, 676486373, 675057590, 673879921, 673292279, 672974944, 672088504, 670238853, 667790473, 665121138, 662058234, 658349395, 654394507, 650887728, 647836387, 644621253, 641062737, 637732148, 635021329, 632571816, 629947960, 627384245, 625395000, 623909712, 622270942, 620131850, 617887199, 615973175, 614210188, 612297118, 610564053, 609667063, 609733880, 610101461, 610003889, 609280348, 608069420, 606124282, 603095889, 599205792, 595046163, 590923846, 586618364, 581895411, 577013731, 572403252, 568041801, 563639283, 559340000, 555806935, 553570092, 552436292, 551768780, 551237881, 550962269, 550897598, 550613284, 549811184, 548707366, 547609866, 546222508, 543727100, 539801896, 535509527]
1121.8E35509527k897918r99034l7432M88282R48250Q84175Q15988J285195K027691
1140.1E38024724K595007K619505K103984J614690J641810J923740J926124J762688
1156.4E54212272K045095K864480L684938M225373M795432N606354O290912O411791
1172.7E90136647O089390N814850N795359N663276N082429M286706L626704L039658
1189.1F29535019K195597J184344N39899N66423J056552J586676K074480K669930L171206
1207.4F44580126L154993K601743J967132J671493J686275J652419J416028J289904
1223.7F60020113J534998J874209J921952J767814J797020K085448K279222K063512
1240.1F75344288J643122J494467J548767J288414O52492K13027L38852O42658O29246
$$ y = [535509527, 532611609, 531612575, 531575143, 532063425, 533011675, 533895850, 534711838, 535997033, 538024724, 540619731, 543239236, 545343220, 546957910, 548599720, 550523460, 552449584, 554212272, 556257367, 559121847, 562806785, 567032158, 571827590, 577433944, 583724856, 590136647, 596226037, 602040887, 607836246, 613499522, 618581951, 622868657, 626495361, 629535019, 631730616, 632914960, 633454859, 634021282, 635077834, 636664510, 638738990, 641408920, 644580126, 647735119, 650336862, 652303994, 653975487, 655661762, 657314181, 658730209, 660020113, 661555111, 663429320, 665351272, 667119086, 668916106, 671001554, 673280776, 675344288, 676987410, 678481877, 680030644, 681319058, 681971550, 682184577, 682523429, 683166087, 683795333]
1258.4F83795333N27024R14991J711667K272844K334475K361835K813398L350854L364384
1276.8G03446805L010929K999783L472209L800869L613412L357530L495276L714442
1293.1G30911255L442049K772033K388120K475023K415538J849651J258374J178860
1309.4G48690903J357794J211822P47800N45204R07778J304567J195967Q99196R10461
1327.8G57771492J115561R98318M27007q2135p5638L07679M82023K77936K19584N25534
1348.1G61967361P05957M05372j7286q0943N2512k23339q41200r50217o43075n19931
1368.5G59855211o09815j027882j295209q79348p89523j580715k224565j768589q09550
1386.9G48870015m06027o77943j205146j422465j240432j543463j954794k092540k182603
$$ y = [683795333, 684322357, 685237348, 686949015, 689221859, 691556334, 693918169, 696731567, 700082421, 703446805, 706457734, 709457517, 712929726, 716730595, 720344007, 723701537, 727196813, 730911255, 734353304, 737125337, 739513457, 741988480, 744404018, 746253669, 747512043, 748690903, 750048697, 751260519, 752008319, 752553523, 753461301, 754765868, 755961835, 756861031, 757771492, 758887053, 759885371, 760312378, 760230243, 760154605, 760462284, 760944307, 761222243, 761441827, 761967361, 762673318, 763078690, 763061404, 762980461, 763032973, 762809634, 761968434, 761018217, 760375142, 759855211, 759245396, 758217514, 756922305, 756042957, 755253434, 753672719, 751448154, 749679565, 748870015, 748463988, 747786045, 746580899, 745158434, 743918002, 742374539, 740419745, 738327205, 736144602]
1405.3G36144602k037406k118110k237678j769781j233161j483082j912236j134158
1421.6G22218990l42667k09093n06103q61347m09484K45929J13249J00076P55728J251757
1442G22357035J396656J239836J258612J924574K568841K647281K925872M338325M833698
1460.3G45490730M351795M160821M125118L974796M090368M788399M790366L949344
1476.6G79721737L349721K822638K114952J166105L40044q1598l3916j46567r94146
1495G88258970j912832j712263j295269j543104l053546n104840l270924k035082k575278
1513.4G65755832k931416k570271k020359k480626k352357j622260j450658j251697
1529.7G49076188j733363k338231j341223r01044k339065k237499l62277M01378L23057
$$ y = [736144602, 734107196, 731989086, 729751408, 727981627, 726748466, 725265384, 723353148, 722218990, 721876323, 721667230, 721161127, 720299780, 719890296, 720136225, 720249474, 720349550, 721105278, 722357035, 723753691, 724993527, 726252139, 728176713, 730745554, 733392835, 736318707, 740657032, 745490730, 749842525, 754003346, 758128464, 762103260, 766193628, 770982027, 775772393, 779721737, 783071458, 785894096, 788009048, 789175153, 789515197, 789433599, 789399683, 789253116, 788258970, 786346138, 784633875, 783338606, 781795502, 778741956, 773637116, 770366192, 768331110, 765755832, 762824416, 760254145, 758233786, 755753160, 753400803, 751778543, 750327885, 749076188, 747342825, 745004594, 743663371, 742762327, 740423262, 738185763, 737823486, 738224864, 738547921]
1548G38547921j02520m5240L17216K50519r67861j165092L15547L3856r03845k152205
1568.4G34128296l032088k320290k678990m668355m443705l597081m005372m522741
1584.7G04859674n046308n398572n385041n279600n474270n608439n456388n319894
1601.1F61891162n309105n368173n495250n524516n159199m816830n699277o668568
1617.4F17850244m575193l607631m714548m617751l924608l303409k111554j663387
1633.7E89332163j839578l24666J179039J623094J784683K259671L394067L557265
1650F00965738L493667M938781N157590M682541M725516N065083N424559N071283N194902
1668.4F44719660O043494N868793N900800O497383O187916N661368N772293P400274
$$ y = [738547921, 738445401, 738400161, 738717377, 738967896, 738000035, 736834943, 737150490, 737184346, 736280501, 734128296, 731096208, 728775918, 726096928, 721428573, 716984868, 713387787, 709382415, 704859674, 699813366, 694414794, 689029753, 683750153, 678275883, 672667444, 667211056, 661891162, 656582057, 651213884, 645718634, 640194118, 635034919, 630218089, 624518812, 617850244, 613275051, 609667420, 604952872, 600335121, 596410513, 593107104, 590995550, 589332163, 587492585, 587167919, 588346958, 589970052, 591754735, 594014406, 597408473, 600965738, 604459405, 609398186, 614555776, 619238317, 623963833, 629028916, 634453475, 639524758, 644719660, 650763154, 656631947, 662532747, 669030130, 675218046, 680879414, 686651707, 694051981]
1684.7F94051981P538617O589472O564557N937875N999207O704748O871760P805943
1701G48064160O935060O007910O021500N177438M304409L777206L441989L555656L666580
1719.3G90951908L266751K929986K743721K296805J889348J636327J755356K218605
1735.7H09688807K001285J725733J892269K067268J949429J750231J859606K310395
1752H25245023K210021J735389J479089J370490J387536J380623J056015O99103O02544
1770.3H37165833P42316J035690R99928P92920P68602Q14915O76930N62727N20468
1788.7H44080329L65019M31239O38366N97179N05030N63979N89311M46380L61621M24504
1809.1H49002957M60446L66032K90633L78251N13673L52799L5823M7385K98799L33249
$$ y = [694051981, 701590598, 708180070, 714744627, 720682502, 726681709, 733386457, 740258217, 748064160, 754999220, 761007130, 767028630, 772206068, 776510477, 780287683, 783729672, 787285328, 790951908, 794218659, 797148645, 799892366, 802189171, 804078519, 805714846, 807470202, 809688807, 811690092, 813415825, 815308094, 817375362, 819324791, 821075022, 822934628, 825245023, 827455044, 829190433, 830669522, 832040012, 833427548, 834808171, 835864186, 836563289, 837165833, 837908149, 838943839, 839943767, 840736687, 841505289, 842320204, 842997134, 843559861, 844080329, 844445348, 844876587, 845514953, 846112132, 846617162, 847181141, 847770452, 848216832, 848578453, 849002957, 849463403, 849829435, 850120068, 850498319, 851011992, 851364791, 851400614, 851447999, 851746798, 852080047]
1829.5H52080047L17931L44873L53694M19140L01301m8399j75893L07560N92470L37422
1849.9H54830146J42217K41816L57329J94192l1888J0967K07961J37388j45733k2590
1870.3H55921805L99232M91440K44618l6896o4373J70410K88546N7936k13564k7954
1890.7H57231200K97844K17617j0431n0008R9599J91688N2691j36375j01984J33634
1911.1H57925475J93178n3525k31743l0398J61648O2764l6657j8418N0366P3254l5465
1933.5H58060479j38223q3625l6538j42097k09690j19388L1531R8527l2544k19763
1953.9H57208669k29895r7215l1293j26242k53916k16782k7657K6405j51753k67029
1974.3H55833292j29223L0995n6386k16604j63912j3948l7849k33293k95758q5234
$$ y = [852080047, 852397978, 852742851, 853096545, 853515685, 853816986, 853768587, 853592694, 853900254, 854492724, 854830146, 854972363, 855214179, 855571508, 855765700, 855733812, 855744779, 855952740, 856090128, 855944395, 855921805, 856321037, 856812477, 857057095, 857020199, 856955826, 857126236, 857414782, 857472718, 857259154, 857231200, 857529044, 857746661, 857736230, 857686222, 857785821, 857977509, 858030200, 857893825, 857791841, 857925475, 858118653, 858065128, 857833385, 857802987, 857964635, 858027399, 857990742, 857972324, 858022690, 858095944, 858060479, 857922256, 857838631, 857802093, 857659996, 857450306, 857330918, 857362449, 857460976, 857428432, 857208669, 856978774, 856881559, 856850266, 856724024, 856470108, 856253326, 856225669, 856252074, 856100321, 855833292, 855704069, 855735064, 855678678, 855462074, 855298162, 855284214, 855246365, 855013072, 854717314, 854632080]
1994.7H54632080O6936o0201k56777k52962o3360M530j83105l30866k10046n0962j10925
2017.1H53184342k45869k11954l8743J1385j73688l33906k06291J6629j6152k32637
2037.5H51753116k90692j00136L6359q9228k58863k07544k2173k38k02119k88427n6088
2060H50273967J19805p3433k88904j75952M7028P5638j08659k25246p3135R8467K0086
2082.4H49689662j42097j26183K7776P2181r7454j96397k2829J49310O5267j03354
2102.8H49315882j06752J4603M3452p2062j21773P093J30594O6936o2764m7743Q3864
2125.2H49251330J44958O5744k9564p808P2777P6533L3080L2008P3135R9123P3015
2147.7H49884331K5273K0265O9559J05679R1374O0022M5120N7102R6917J19030R8765
$$ y = [854632080, 854699016, 854638815, 854382038, 854129076, 854065716, 854070246, 853887141, 853556275, 853346229, 853295267, 853184342, 852938473, 852726519, 852687776, 852699161, 852525473, 852191567, 851985276, 852001905, 851985753, 851753116, 851462424, 851362288, 851398647, 851309419, 851050556, 850843012, 850820839, 850820601, 850618482, 850330055, 850273967, 850393772, 850320339, 850031435, 849855483, 849902511, 849978149, 849869490, 849644244, 849571109, 849669576, 849689662, 849547565, 849421382, 849449158, 849521339, 849423885, 849227488, 849204659, 849353969, 849419236, 849315882, 849209130, 849223733, 849267185, 849195123, 849073350, 849080443, 849211037, 849277973, 849215209, 849167466, 849251330, 849396288, 849462032, 849432468, 849424660, 849497437, 849573970, 849607050, 849639058, 849712193, 849811316, 849884331, 849909604, 849929869, 849999428, 850105107, 850196481, 850256503, 850301623, 850358725, 850455642, 850574672, 850673437]
2170.1H50673437O7890P1764J02520P3492Q524K5868R8109J06693M4405p391L5346
2192.5H51300657J15990P5460l6299m1545N9068R1911r299p3969J9491J28269R8169
2215H51727903k6345q7500P749J00493J0431j01268k8670R1135P1347l8147r6142o676
2239.4H51624310J04129L4273r1851m6730R3699Q5294o4790r2566J9014N6147K5630
2261.9H51746559J8180K8252O6281Q2254m888r7930l8803Q9526R5428K1755M5121J70588
2286.3H52222323K50102J69396P0333J45376K99633L59237K87771K44379L61979N26846
2306.7H54937375N50150M23432L48389M51684O23286O87301O09338N26190N62131N86689
2327.1H60305965M51028K46823J70112K03490J71423J02639P5400j00911o43968o90401
$$ y = [850673437, 850741327, 850813091, 850915611, 850989103, 850997627, 851023495, 851121604, 851228297, 851272702, 851265311, 851300657, 851416647, 851492107, 851455808, 851414263, 851473331, 851565242, 851555943, 851481974, 851501465, 851629734, 851727903, 851701558, 851614058, 851621807, 851722300, 851732731, 851631463, 851602793, 851693928, 851765275, 851727128, 851630986, 851624310, 851728439, 851762712, 851670861, 851624131, 851717830, 851803124, 851738334, 851645768, 851664782, 851720929, 851746559, 851764739, 851792991, 851859272, 851941526, 851936638, 851838708, 851799905, 851889431, 851984859, 852006614, 852051735, 852222323, 852472425, 852641821, 852712154, 852857530, 853157163, 853516400, 853804171, 854048550, 854410529, 854937375, 855487525, 855910957, 856259346, 856711030, 857334316, 858021617, 858630955, 859157145, 859719276, 860305965, 860756993, 861003816, 861173928, 861377418, 861548841, 861651480, 861726880, 861625969, 860982001, 860291600]
2347.5H60291600J97947J236379J739324J504778Q82209L02970j8000l66807p97213
2365.9H64973187j084864j172125j115918j078308j088500r95755p89464o02185m56095
2384.2H56589973k92003q7857Q2433Q5711J312K5153J15633J22726N7399J8716L7312
2406.7H56756508P5519N7519j3948k9623L8922R2506M6373m4108p6771k5868N3823
2429.1H56930852O1154j7702o3181Q34P2599J6689r6261r3282J3054N7220k8312r3997
2453.6H56759667q225R9182M5061j21176j53840j3351N4181o1453j79887j07824N4240
2476H56366575M9293j14024j58667j2994N9366p0095j85669r7990O9321O9916j07110
2498.5H55867922j81973m9352K7775q6546j76966p7903N3704K2650j20163j78814n9665
$$ y = [860291600, 860489547, 861725926, 863465250, 864970028, 865852237, 866155207, 866137207, 865770400, 864973187, 863888323, 862716198, 861600280, 860521972, 859433472, 858437717, 857648253, 857046068, 856589973, 856297970, 856210113, 856292546, 856378257, 856379569, 856404722, 856520355, 856643081, 856700480, 856719196, 856756508, 856832027, 856889546, 856875598, 856845975, 856884897, 856977403, 857023776, 856979668, 856902897, 856877029, 856930852, 856992006, 856974304, 856911123, 856911957, 856984556, 857001245, 856904984, 856811702, 856824756, 856881976, 856853664, 856759667, 856751442, 856850624, 856895685, 856774509, 856620669, 856607318, 856661499, 856600046, 856420159, 856312335, 856366575, 856415868, 856301844, 856143177, 856130183, 856189549, 856119454, 855933785, 855835795, 855905116, 855975032, 855867922, 855685949, 855636597, 855664372, 855577826, 855400860, 855322957, 855376661, 855399311, 855279148, 855100334, 855040669]
2520.9H55040669N0366m2021j69158j08480L7133L5942j11342j82211q0883J5139m8280
2543.3H54436874j63495j46210j9014R715r9301j49727p5877m232m0173j44064j80126
2565.8H53424370r9182k9921j02580k10464j92225j20819j33454j94133k09152j53125
2586.2H51979315j04010j57177k38896k40504j88709j72496k15113k52604k41518k05577
2606.6H49962711k12907k66612k83480k35796j92642k32279k98083k86222k25961k19285
2626.9H47509444k93732l49522l14772k37822k06948k58803l08692k83480k47777k77817
2647.3H44730079l05116k73228k60651k88009l13521k88188k20836k07364k45750k88785
2667.7H42038631l14652k94030k69234k65003k55525k45869k68757l23892l52442l13401
$$ y = [855040669, 855091035, 855049014, 854879856, 854771376, 854808509, 854844451, 854733109, 854550898, 854470015, 854485154, 854436874, 854273379, 854127169, 854108155, 854117870, 854018569, 853868842, 853792965, 853788733, 853748560, 853604496, 853424370, 853325188, 853295267, 853192687, 852982223, 852789998, 852669179, 852535725, 852341592, 852132440, 851979315, 851875305, 851718128, 851479232, 851238728, 851050019, 850877523, 850662410, 850409806, 850168288, 849962711, 849749804, 849483192, 849199712, 848963916, 848771274, 848538995, 848240912, 847954690, 847728729, 847509444, 847215712, 846866190, 846551418, 846313596, 846106648, 845847845, 845539153, 845255673, 845007896, 844730079, 844424963, 844151735, 843891084, 843603075, 843289554, 843001366, 842780530, 842573166, 842327416, 842038631, 841723979, 841429949, 841160715, 840895712, 840640187, 840394318, 840125561, 839801669, 839449227, 839135826]
2688.1H39135826k51949k48254k99632l31104l09944l01182l41237l63111l33965l00646
2708.5H36054802l19958l61979l42250l19421l45707l22223k90811l29196m04298m66705
2728.9H32552254m26173l26872k92301l04163l07858l25441l68655l42965k42054k54393
2749.3H29361379m06027m87089m19021l28779l36766m18365m82500m67956m03404l76761
2769.7H25234711l84867l83139m11212n03481n97059o17802n52655m40240l87430m82440
2790.1H20474386o15895n96344m87447n28931p13706p86424p09355o59049o77049p34210
2810.5H13965976p66396p48515p83146q58307q54432q02279q43763r67860j009524
2828.9H06331754r50575r49741j077354j294374j624703k017498k332986k610683k785385
$$ y = [839135826, 838883877, 838635623, 838335991, 838004887, 837694943, 837393761, 837052524, 836689413, 836355448, 836054802, 835734844, 835372865, 835030615, 834711194, 834365487, 834043264, 833752453, 833423257, 833018959, 832552254, 832126081, 831799209, 831506908, 831202745, 830894887, 830569446, 830200791, 829857826, 829615772, 829361379, 828955352, 828468263, 828049242, 827720463, 827383697, 826965332, 826482832, 826014876, 825611472, 825234711, 824849844, 824466705, 824055493, 823552012, 822954953, 822337151, 821784496, 821344256, 820956826, 820474386, 819858491, 819262147, 818774700, 818245769, 817532063, 816745639, 816036284, 815377235, 814700186, 813965976, 813199580, 812451065, 811667919, 810809612, 809955180, 809152901, 808309138, 807341278, 806331754, 805381179, 804431438, 803354084, 802059710, 800435007, 798417509, 796084523, 793473840, 790688455]
2847.2G90688455k536774j842498j139522p38740n31435m64559o29782r29058j209855
2865.6G80666232j401305j411319j279235j272022j334370j161933q98838q24809q95202
2883.9G70187199r87351j072824j155376j211167j225829j273274j363397j417458
2900.2G60480523j443744j486659j559913j699865j943469k235472k466440k498567
2916.6G45146394k283216j927256j447261r11593m52221j19328P749J14500M45485
2934.9G38573253Q31962J099884J308859J442909J320958Q78036M09544J91927O973
2953.3G46064305k41816k61843o1870J28448K12908K14100K02596K43306L72708M63128
2973.7G47335970M15743L90708L93570K65777J53303J87874K45571K95997K28166q3625
$$ y = [790688455, 788151681, 786309183, 785169661, 784430921, 783899486, 783434927, 782805145, 781876087, 780666232, 779264927, 777853608, 776574373, 775302351, 773967981, 772806048, 771907210, 771082401, 770187199, 769199848, 768127024, 766971648, 765760481, 764534652, 763261378, 761897981, 760480523, 759036779, 757550120, 755990207, 754290342, 752346873, 750111401, 747644961, 745146394, 742863178, 740935922, 739488661, 738577068, 738124847, 738005519, 738013268, 738127768, 738573253, 739405215, 740505099, 741813958, 743256867, 744577825, 745455861, 745865405, 746057332, 746064305, 745822489, 745560646, 745498776, 745627224, 745840132, 746054232, 746256828, 746500134, 746872842, 747335970, 747751713, 748142421, 748535991, 748801768, 748955071, 749142945, 749388516, 749684513, 749912679, 749829054]
2994.1G49829054l43144m79698o83487p81357p73489q18432p48217n37693n22078p74085
3014.5G43367374j006365j083434j055359j008749j073897j191020j141250j007319
3030.8G34799981j013100j213133j396060j281679j113415j250803j521826j606047
3047.1G24403918j463056j385808j536131j630306j561344j528024j534880j455903
3063.4G12308466j320421j326800j502573j605809j501977j285613j198470j391054
3079.7G01175749j596331j605392j580894j568496j581371j670718j697481j609146
3096F88265920j542032j620889j758039j743614j626015j610279j740754j779556j630843
3114.4F73213899j599312j785218k032757k231777k236903k050757j905143j977027
$$ y = [749829054, 749485910, 749006212, 748322725, 747541368, 746767879, 745949447, 745201230, 744663537, 744141459, 743367374, 742361009, 741277575, 740222216, 739213467, 738139570, 736948550, 735807300, 734799981, 733786881, 732573748, 731177688, 729896009, 728782594, 727531791, 726009965, 724403918, 722940862, 721555054, 720018923, 718388617, 716827273, 715299249, 713764369, 712308466, 710988045, 709661245, 708158672, 706552863, 705050886, 703765273, 702566803, 701175749, 699579418, 697974026, 696393132, 694824636, 693243265, 691572547, 689875066, 688265920, 686723888, 685102999, 683344960, 681601346, 679975331, 678365052, 676624298, 674844742, 673213899, 671614587, 669829369, 667796612, 665564835, 663327932, 661277175, 659372032, 657395005]
3130.7F57395005k146482k139867j964092j915097k131403k328097k317489k263605
3147F40188873k141237k001405k164483k502919k609074k512455k422332k369821k359629
3165.4F19105518k388299k411186k432526k477169k516865k534688k489090k436757
3181.7E99418938k467215k495408k475262k493977k561867k580405k534985k478063
3198E79331756k459169k468705k441287k355874k327680k396167k409577k344251k304017
3216.4E57825029k321184k329230k292097k245605k230763k217472k074718j908839
3232.7E40205121k011239k192617k107084j926362j851678j770020j689553j746893
3249E24909675j788139j659930j574755j676619j750409j684666j638114j615644j525640
$$ y = [657395005, 655248523, 653108656, 651144564, 649229467, 647098064, 644769967, 642452478, 640188873, 638047636, 636046231, 633881748, 631378829, 628769755, 626257300, 623834968, 621465147, 619105518, 616717219, 614306033, 611873507, 609396338, 606879473, 604344785, 601855695, 599418938, 596951723, 594456315, 591981053, 589487076, 586925209, 584344804, 581809819, 579331756, 576872587, 574403882, 571962595, 569606721, 567279041, 564882874, 562473297, 560129046, 557825029, 555503845, 553174615, 550882518, 548636913, 546406150, 544188678, 542113960, 540205121, 538193882, 536001265, 533894181, 531967819, 530116141, 528346121, 526656568, 524909675, 523121536, 521461606, 519886851, 518210232, 516459823, 514775157, 513137043, 511521399, 509995759]
3267.4E09995759j442731j531005j703679j766086j789391j789123j732915j717955
3283.7D96522874j755804j757145j657963j604497j715422j854688j970202j962065
3300D82245088j783014j677394j782596k036273k270043k290845k162725k104044k090096
3318.4D64048058k029926j966059j972765k117306k238601k196461k157867k127320
3334.7D47241753j983136j968592k162457k255529k262205k188474j962721j960635
3351D30498004k249509k370030k189636j981527j952290j985848j832992j634121j748860
3369.3D12553191k065927k081453j766444j557320j504719j470119j374394j176029
3385.7C99556786r03428o19292o35445r43452r86070n90175k69622n22464r23872p56860
$$ y = [509995759, 508553028, 507022023, 505318344, 503552258, 501762867, 499973744, 498240829, 496522874, 494767070, 493009925, 491351962, 489747465, 488032043, 486177355, 484207153, 482245088, 480462074, 478784680, 477002084, 474965811, 472695768, 470404923, 468242198, 466138154, 464048058, 462018132, 460052073, 458079308, 455962002, 453723401, 451526940, 449369073, 447241753, 445258617, 443290025, 441127568, 438872039, 436609834, 434421360, 432458639, 430498004, 428248495, 425878465, 423688829, 421707302, 419755012, 417769164, 415936172, 414302051, 412553191, 410487264, 408405811, 406639367, 405082047, 403577328, 402107209, 400732815, 399556786, 398653358, 398034066, 397398621, 396455169, 395469099, 394878924, 394609302, 394086838, 393162966, 392406106]
3406.1C92406106l47644j63823j00673j70171k62976q4608J23083J50293L11315O29276
3426.5C92490178Q41827Q16941Q49485J061797R70304O30260O49959J037955J371115
3444.8D00719821J486987J482070J555264J682967J782477J930058K083569K022118
3461.1D14745331K018064K368242K559602K206385J724124J719326K072364K420992
3477.4D31834430K462148K172530K170384K474755K472043K322227K432525K605021
3493.8D50946063K686411K654910K604634K595752K503932K383917K449989K745361
3510.1D71570969L060668L011883K689391K655000K922862L172696L068536K780885
3526.4D94932890K854258L169030L359973L446818L412663L304065L451824L633261
$$ y = [392406106, 392058462, 391894639, 391793966, 391623795, 391360819, 391276211, 391399294, 391549587, 391860902, 392490178, 393332005, 394148946, 394998431, 396060228, 397030532, 397660792, 398310751, 399348706, 400719821, 402206808, 403688878, 405244142, 406927109, 408709586, 410639644, 412723213, 414745331, 416763395, 419131637, 421691239, 423897624, 425621748, 427341074, 429413438, 431834430, 434296578, 436469108, 438639492, 441114247, 443586290, 445908517, 448341042, 450946063, 453632474, 456287384, 458892018, 461487770, 463991702, 466375619, 468825608, 471570969, 474631637, 477643520, 480332911, 482987911, 485910773, 489083469, 492152005, 494932890, 497787148, 500956178, 504316151, 507762969, 511175632, 514479697, 517931521, 521564782]
3542.7E21564782L527820L309011L343225L525495L621698L697931L806770L926277
3559E50323009L932179L680944L422439L929973M722595M645765M289567M284263M450858
3577.4E87681592M675686M905999M825055M460335M422486M935562N003691M791200
3593.7F25701606M919648N172909N200803N153656N028784M687846M673481M968345
3610F65507078N055368N108357M964649M864991N365610N402267M732192M014730L916502
3628.4G08931744M836857N018235M658162M417479M136205L911138L762006L405691
3644.7G43077517K843141K921045L837407L883063L275097L273070L452837K958775
3661G69521952K377629K170563J831770J365125J686752J801967J298905J771748K263725
$$ y = [521564782, 525092602, 528401613, 531744838, 535270333, 538892031, 542589962, 546396732, 550323009, 554255188, 557936132, 561358571, 565288544, 570011139, 574656904, 578946471, 583230734, 587681592, 592357278, 597263277, 602088332, 606548667, 610971153, 615906715, 620910406, 625701606, 630621254, 635794163, 640994966, 646148622, 651177406, 655865252, 660538733, 665507078, 670562446, 675670803, 680635452, 685500443, 690866053, 696268320, 701000512, 705015242, 708931744, 713768601, 718786836, 723444998, 727862477, 731998682, 735909820, 739671826, 743077517, 745920658, 748841703, 752679110, 756562173, 759837270, 763110340, 766563177, 769521952, 771899581, 774070144, 775901914, 777267039, 778953791, 780755758, 782054663, 783826411, 786090136]
3679.4G86090136J972854J490593P82609k23995p83145L48091J878083K499282K393425
3697.7G96447933J975000J721441J719535J446604P82371J70291K94268J123786J383185
3716.1H07064414R83298N30064L44515L88682N66482P81298N26011n9128j58965N12599
3736.5H11479270J070679P84278k19644p45117K45929M09305p2599O89090J243472
3754.8H14884663P46548K35915L62933M66406K01404J05798J40667L12567O22034N63562
3775.2H18642497J89781m8578J14441K57433K40683L01242L05295K17438K9385j95265
3795.6H20054352j38521k57194l48389M18782N53429K47598N03838M71890j38581n32508
3816H20834696j55449j11281j3888N04315M20272K55287J54972m1008j07170l59296
$$ y = [786090136, 788062990, 789553583, 790336192, 790112197, 789329052, 789677143, 791555226, 794054508, 796447933, 798422933, 800144374, 801863909, 803310513, 804092884, 804263175, 804557443, 805681229, 807064414, 808047712, 808577776, 808922291, 809310973, 809877455, 810658753, 811184764, 811125636, 810966671, 811479270, 812549949, 813334227, 813114583, 812369466, 812615395, 813024700, 812952101, 813641191, 814884663, 815631211, 815867126, 816230059, 816696465, 816897869, 817003667, 817144334, 817456901, 818078935, 818642497, 818832278, 818783700, 818898141, 819155574, 819396257, 819697499, 820002794, 820220232, 820249617, 820054352, 819915831, 819658637, 819310248, 819729030, 820282459, 820530057, 821033895, 821505785, 821367204, 820834696, 820679247, 820567966, 820554078, 821058393, 821478665, 821733952, 821888924, 821847916, 821740746, 821381450]
3836.4H21381450m87328J21176N64814N84602M72427J53780n03481j361727n34416
3854.8H20391297R69053Q53598K19941k26379r5248J22547k52723k29180K51710M27485
3875.2H22432101L91364o8605k10702J16586M4823J28090R0719k16127J13189L84868
3895.5H23206306o9082n33998m88580j10685M25398O59049L90768O4313j05202k23756
3915.9H23214531j65582Q7500J04785r1911l7848J17063L3915J9968J89244J60814
3936.3H23632479J9669p2837j00612P5400J20043o8962k1994J75178J62422J8478m2200
3958.8H23897064J7106Q9288R1851O0022M9889K9087j6332K265Q2910J00255J10209
3981.2H24513614J56164Q1540o5327p0155L5286Q5414J06215J25885
$$ y = [821381450, 820894122, 821015298, 821580112, 822164714, 822637141, 822790921, 822287440, 820925713, 820391297, 821360350, 822213948, 822433889, 822207510, 822112262, 822234809, 821982086, 821752906, 822004616, 822432101, 822823465, 822754860, 822544158, 822660744, 822705567, 822833657, 822924376, 822708249, 822821438, 823206306, 823137224, 822603226, 822114646, 822003961, 822429359, 823088408, 823479176, 823543489, 823438287, 823214531, 823048949, 823136449, 823241234, 823149323, 823111475, 823228538, 823262453, 823282421, 823471665, 823632479, 823652148, 823579311, 823478699, 823554099, 823674142, 823605180, 823583186, 823758364, 823920786, 823939264, 823897064, 823914170, 824003458, 824095309, 824155331, 824205220, 824234307, 824217975, 824220240, 824303150, 824403405, 824513614, 824669778, 824751318, 824685991, 824615836, 824651122, 824736536, 824842751, 824968636]
3997.5H24968636
$$ y = [824968636]
##END=$$ End of the data block
