##TITLE=$$ Begin of the data block
##JCAMP-DX=5.00 $$ ACD/SpecManager v 10.08
##SPECTROMETER/DATA SYSTEM=Alpha
##DATE=07 Apr 2014 11:14:18
##DATA TYPE=INFRARED SPECTRUM
##DATA CLASS=XYDATA
##ORIGIN=
##OWNER=
##NPOINTS=1765
##FIRSTX=399.75695801
##LASTX=3997.56933594
##MAXX=3997.56933594
##MINX=399.75695801
##MAXY=0.86567456
##MINY=0.39128703
##XFACTOR=1.0000000000
##YFACTOR=1.000000000000000e-9
##FIRSTY=0.68238497
##DELTAX=2.03957629
##XUNITS=1/CM
##YUNITS=ARBITRARY UNITS
##XYDATA=(X++(Y..Y))
399.8F82384968J272976N8353j240492j233816m26471k74956p29621j076817r04262
418.1F77829862j71423j57774n99980m75943J5974K21312k30134r82582o78957M37677
438.5F75208032L00646q20935o41405O79195N74409j050949j517534l9518Q23677m15981
458.9F73099637j486838m90069P59482j22607j874089j580536L67641O31571j154065
477.3F68150127j803935k36690J035035p6950j562893o85811Q95083J25825j801908
495.6F64037883j676261Q404M52995q99553j733601o05345N91994k30909j594305j360655
516F56990647o8068J37687j101912j776278q92341K6465o25491j815856j679063n23984
536.4F48671806j95086r45509j267075o31750m5657m23014j259983j245796m82917
$$ y = [682384968, 683657944, 683716297, 682475805, 681241989, 680815518, 680540562, 679810941, 678734124, 677829862, 677658439, 677500665, 676900685, 676424742, 676440716, 676662028, 676431894, 675449312, 674770355, 675208032, 675508678, 674687743, 674046338, 674725533, 675299942, 674248993, 672731459, 672691941, 673515618, 673099637, 671612799, 671122730, 671882212, 671759605, 669885516, 668304980, 668672621, 669304192, 668150127, 666346192, 666109502, 667144537, 667067587, 665504694, 664818883, 665713966, 665839791, 664037883, 662361622, 662370026, 662823021, 661923468, 660189867, 659584522, 660176516, 659945607, 658351302, 656990647, 656922579, 657060266, 655958354, 654182076, 653289735, 653316200, 652690709, 650874853, 649195790, 648671806, 648476720, 647531211, 646264136, 645632386, 645586729, 645163715, 643903732, 642657936, 642175019]
554.8F42175019k52605r83357j718640j464248p74980r70065j952529k260745j447499
573.1F30350351q37147j373947k173304j762867o05464o73175j817346k178967j224219
591.5F17703915m61936j240373k339482k000809r86874j383424k615511k359093o38425
609.8F03677988K23041n51343r98140O37830L006756L435731K259373J959801L164411
628.2F16815448L813803K768099J630664K134800L159821K559662Q22246N31137K288818
646.5F36524498L346026J900018k7836R358J822353L401041L339350K789378K977371
664.9F56081557L825248L334760J173914J543224K848148K773940J669884J189351
681.2F74440026J737535K160013J549661O07610N86867J282156J381457N79118N9307
$$ y = [642175019, 641922414, 640939057, 639220417, 637756169, 636981189, 636011124, 634058595, 631797850, 630350351, 629513204, 628139257, 625965953, 624203086, 623597622, 622924447, 621107101, 618928134, 617703915, 617241979, 616001606, 613662124, 611661315, 610674441, 609291017, 606675506, 604316413, 603677988, 603901029, 603349686, 602351546, 602989376, 605996132, 609431863, 611691236, 613651037, 616815448, 620629251, 623397350, 625028014, 627162814, 630322635, 632882297, 633704543, 634235680, 636524498, 639870524, 641770542, 641742706, 641752064, 643574417, 646975458, 650314808, 653104186, 656081557, 659906805, 663241565, 664415479, 665958703, 668806851, 671580791, 673250675, 674440026, 676177561, 678337574, 679887235, 680494845, 681081712, 682363868, 683745325, 684324443, 684383750]
699.6F84383750O53684J601219J592398Q40843P44998J608968K262056J796901R80318
717.9F96465135J143396K082109K210498J238525O76512J466394K349973J707136L38078
736.3G09677756L66807J698434K121091J057267L77476J302004K391100J902819P12514
754.6G21607268Q55684K173662K433896J030922J16945J035928K095461J385749j90080
773G32545435m19497O12795P50900o14167j500904n42820P68125O71029j6152O81042
793.4G32935786K672613L851533L379166K915263L667712M412055L727556K271592
809.7G59833276J706422K191603K223134R73046l95119n95928k94447r81509k478719
828.1G62181759l193259k614618j919746k151311k753496k542197j609564j216173
$$ y = [684383750, 685037434, 686638653, 688231051, 689071894, 689816892, 691425860, 693687916, 695484817, 696465135, 697608531, 699690640, 701901138, 703139663, 703816175, 705282569, 707632542, 709339678, 709677756, 710044563, 711742997, 713864088, 714921355, 715298831, 716600835, 718991935, 720894754, 721607268, 722462952, 724636614, 727070510, 728101432, 728218377, 729254305, 731349766, 732735515, 732545435, 732125938, 732738733, 733489633, 732875466, 731374562, 730831742, 731599867, 732270896, 732254744, 732935786, 735608399, 739459932, 742839098, 745754361, 749422073, 753834128, 757561684, 759833276, 761539698, 763731301, 765954435, 766927481, 766532362, 765936434, 765641987, 764660478, 762181759, 758988500, 756373882, 754454136, 752302825, 749549329, 747007132, 745397568, 744181395]
844.4G44181395j627982j415014L22938K517461L684283L986478M747331O132722O729841
862.7G69259453N829394M669845M523635M691660L763855K074420J261771J637578
879.1G97711611J623571K69830j175880j193166m07636n10216j378238j275421J98424
897.4G93862879J381934J123309M51386Q07822J548111J052738m47870j362264j288831
915.8G97129214j420558k391755l045261k265155p87557j9669R358K72155R12189J081049
936.2G89474010M46439k40385l08454r1136l14057j029432j695513k071738k454699
954.5G81715035l186106m172504n051077n808174o686032p742703q742154r223878
970.8G31102407q892179p978141o958723o055772n204439m299760l496230l109753
$$ y = [744181395, 742553413, 741138399, 741461337, 743978798, 747663081, 751649559, 756396890, 762529612, 769259453, 775088847, 779758692, 784282327, 788973987, 792737842, 794812262, 796074033, 797711611, 799335182, 799605012, 798429132, 797235966, 796828330, 796318114, 794939876, 793664455, 793862879, 795244813, 796368122, 796819508, 797627330, 799175441, 800228179, 799780309, 798418045, 797129214, 795708656, 793316901, 790271640, 788006485, 787218928, 787199259, 787208617, 787480772, 788392961, 789474010, 789920449, 789680064, 789371610, 789280474, 788966417, 787936985, 786241472, 784169734, 781715035, 778528929, 774356425, 769305348, 763497174, 756811142, 749068439, 740326285, 731102407, 722210228, 714232087, 707273364, 701217592, 696013153, 691713393, 688217163, 685107410]
987.1F85107410k990246k568185j845181j441121j420677j194239o19590l37660q80003
1005.5F71810508j843035k434969k624154l016174l700078l983617l530979l051460
1021.8F47626042l200590l529132l328442k734065k443314k607107k559960j990974
1038.1F25232458j480281j619458k116263k236247j961112j843453j935959j690685
1054.5F10349000q21651J47403M03642r8049p51078j261294j945138k992571l895223
1072.8E99135041m171908m098177m256785m687547m913748m668772m348814m360199
1089.1E63629091m299700l534556k221346j121223o56545n41210l15547r3103k73644
1107.5E50572217p73311j085699j104355j406967k497137l920257m318356k939940
$$ y = [685107410, 682117164, 679548979, 677703798, 676262677, 674842000, 673647761, 673028171, 672690511, 671810508, 669967473, 667532504, 664908350, 661892176, 658192098, 654208481, 650677502, 647626042, 644425452, 640896320, 637567878, 634833813, 632390499, 629783392, 627223432, 625232458, 623752177, 622132719, 620016456, 617780209, 615819097, 613975644, 612039685, 610349000, 609527349, 609674752, 610078394, 609980345, 609229267, 607967973, 606022835, 603030264, 599135041, 594963133, 590864956, 586608171, 581920624, 577006876, 572338104, 567989290, 563629091, 559329391, 555794835, 553573489, 552452266, 551795721, 551254511, 550938964, 550845861, 550572217, 549798906, 548713207, 547608852, 546201885, 543704748, 539784491, 535466135, 532526195]
1123.8E32526195j042545o9797N12183R97782R16302Q41379J293063K016545K578794
1142.2E40569901K593935K086103J629293J658738J891136J869499J751960K049267
1158.5E56099832K843440L680765M231811M794955N625069O309986O415725O102443
1174.8E96104026N817413N773723N663753N098998M272640L597975L020346K177954
1191.1F31526828J161635N26488N74410J079559J631081K115488K655268L114402L126264
1209.5F47511423K602517J934707J629830J703203J718819J472830J305461J511574
1225.8F61390364J846731J933515J788318J795352K095818K304793K091765J663685
1242.1F76910341J485944J541674J289963O54579K35855L55005O36638O22511N26905
$$ y = [532526195, 531483650, 531413853, 531926036, 532923818, 533840120, 534681499, 535974562, 537991107, 540569901, 543163836, 545249939, 546879232, 548537970, 550429106, 552298605, 554050565, 556099832, 558943272, 562624037, 566855848, 571650803, 577275872, 583585858, 590001583, 596104026, 601921439, 607695162, 613358915, 618457913, 622730553, 626328528, 629348874, 631526828, 632688463, 633214951, 633789361, 634868920, 636500001, 638615489, 641270757, 644385159, 647511423, 650113940, 652048647, 653678477, 655381680, 657100499, 658573329, 659878790, 661390364, 663237095, 665170610, 666958928, 668754280, 670850098, 673154891, 675246656, 676910341, 678396285, 679937959, 681227922, 681882501, 682118356, 682473361, 683109999, 683732510, 684259415]
1260.4F84259415R22680J726090K269924K293229K310992K793371L355921L360629
1276.8G03292251L015458L058255L538549L800690L562272L292977L466547L763080
1293.1G30790079L498613K762676K355933K483606K435804J842737J244366J162767
1309.4G48576581J363874J273930P95305N07235Q47340J298189J209736R02772R28402
1327.8G57703364J145303J014769M22180j01268j00494K95639M88043K75731K06888
1346.1G61350155N20110P13587M28021o199r6917L5226k17378q03590r09448o35743
1366.5G60377824n53548o49869j035393j279473q69215p98761j599968k235830j752317
1384.9G49603450p84337m16517p01428j209974j404464j218558j543462j966357k104223
$$ y = [684259415, 685182095, 686908185, 689178109, 691471338, 693782330, 696575701, 699931622, 703292251, 706307709, 709365964, 712904513, 716705203, 720267475, 723560452, 727026999, 730790079, 734288692, 737051368, 739407301, 741890907, 744326711, 746169448, 747413814, 748576581, 749940455, 751214385, 752009690, 752516925, 753364265, 754662454, 755872190, 756774962, 757703364, 758848667, 759863436, 760285616, 760184348, 760083854, 760379493, 760867536, 761143267, 761350155, 761870265, 762583852, 763011873, 763005674, 762908757, 762943983, 762726605, 761923015, 761013567, 760377824, 759824276, 759174407, 758139014, 756859541, 755990326, 755191565, 753591597, 751355767, 749603450, 748819113, 748402596, 747701168, 746491194, 745086730, 743868172, 742324710, 740358353, 738254130]
1403.2G38254130k184391k010048k089202k250373j789093j215995j457274j902640
1419.5G23355114j143097l69311k28882m99308q43763m09186K28763R9599R3400P43568
1439.9G21026897J239956J390934J234293J259386J920164K549052K640426K927840
1456.2G36188948M315078M809142M352629M199922M186451M024625M122317M792333
1472.6G70991445M775583L948689L355503K819836K107024J151264L13222r9659m1008
1490.9G89321899j50501r70543j878917j709402j321852j589179l110349n124867l207207
1509.3G70259082j960456k536833k931238k582013k023876k489626k376437j640440
1525.6G51718163j449882j244009j730681k343237j355052r20355k349973k236307
$$ y = [738254130, 736069739, 734059691, 731970489, 729720116, 727931023, 726715028, 725257754, 723355114, 722212017, 721842706, 721613824, 721114516, 720270753, 719861567, 720090330, 720189929, 720283329, 721026897, 722266853, 723657787, 724892080, 726151466, 728071630, 730620682, 733261108, 736188948, 740504026, 745313168, 749665797, 753865719, 758052170, 762076795, 766199112, 770991445, 775767028, 779715717, 783071220, 785891056, 787998080, 789149344, 789462566, 789362907, 789321899, 789171398, 788200855, 786321938, 784612536, 783290684, 781701505, 778591156, 773466289, 770259082, 768298626, 765761793, 762830555, 760248542, 758224666, 755735040, 753358603, 751718163, 750268281, 749024272, 747293591, 744950354, 743595302, 742674947, 740324974, 738088667]
1541.9G38088667l34918M63605L74794r0361p6055K72631K25425r70125j121879L65794
1562.3G37197578P8201q67188k152800l050149k326190k706945m730523m476607l581464
1580.7G13383913l979802m515469n072951n443693n385637n253911n493641n655825
1597F72582984n468547n300820n306244n382002n505442n531907n171240m833936n708695
1615.3F24374151o672203m588664l606677m694939m616141l923178l268599k078891
1631.6E90924859j685083j919329l62098J227855J688838J793802K215445L385306
1648E97269595L588140L505110M958451N187214M668355M699945N092383N482792N105675
1666.3F39557660N207240O025672N832017N875706O531775O256402N675614N728602
$$ y = [738088667, 737753749, 738217354, 738592148, 738501787, 738425732, 738698363, 738923788, 737953663, 736831784, 737197578, 737275779, 736408591, 734255791, 731205642, 728879452, 726172507, 721441984, 716965377, 713383913, 709404111, 704888642, 699815691, 694371998, 688986361, 683732450, 678238809, 672582984, 667114437, 661813617, 656507373, 651125371, 645619929, 640088022, 634916782, 630082846, 624374151, 617701948, 613113284, 609506607, 604811668, 600195527, 596272349, 593003750, 590924859, 589239776, 587320447, 586958349, 588186204, 589875042, 591668844, 593884289, 597269595, 600857735, 604362845, 609321296, 614508510, 619176865, 623876810, 628969193, 634451985, 639557660, 644764900, 650790572, 656622589, 662498295, 669030070, 675286472, 680962086, 686690688]
1682.6F86690688P368088P533610O559074O515741N921006O017626O725967O890118
1699G40221918P820606O932437N997300O019116N194604M329264L799499L464221L567636
1717.3G87346601L664673L255725K905071K710282K264738J876891J655340J784742
1733.6H07464063K229333J993418J713931J897216K074957J929045J739204J910031
1749.9H22951198K361416K198041J716375J491547J379073J371443J342833J020253
1766.3H35832179P08818O40571P42376J022398J016796P98464P52389Q31247P20381
1784.6H43065619N79775M99904L12805L87728O47128O28471N16296N43713N73934M50074
1805H48205447L57509M06742M49300L65972L08633M11511N39243L49641j0193P093
$$ y = [686690688, 694058776, 701592386, 708151460, 714667201, 720588207, 726605833, 733331800, 740221918, 748042524, 754974961, 760972261, 766991377, 772185981, 776515245, 780314744, 783778965, 787346601, 791011274, 794266999, 797172070, 799882352, 802147090, 804023981, 805679321, 807464063, 809693396, 811686814, 813400745, 815297961, 817372918, 819301963, 821041167, 822951198, 825312614, 827510655, 829227030, 830718577, 832097650, 833469093, 834811926, 835832179, 836540997, 837181568, 837923944, 838946342, 839963138, 840761602, 841513991, 842345238, 843065619, 843645394, 844145298, 844458103, 844845831, 845492959, 846121430, 846637726, 847181439, 847755373, 848205447, 848562956, 848969698, 849418998, 849784970, 850093603, 850505114, 851044357, 851393998, 851383805, 851390898]
1825.4H51390898L10362L54230L19779L54707L76463M32611L13103m5359k05636K73466
1845.8H53874624N76198L23534J18136K26975L89874K37703l0696J430K14219J33634
1866.2H56065631j65522k6286M03524M84228K47299k3722n0664J88172L02136O4313
1886.6H57489109k18391m6313K75612J90854k1994j7941J51515K26318M4942j80065
1907H57893646j25408J38580J90735p2658k55525l4690J71125O7473l8386j1980Q2910
1929.4H58005822R7751n1260j69575j01209l7550j38283j93775q8215M3094Q6129m2140
1951.9H57410789k21014k11299o5803k8551j38104k46108k15411m5955P331j64628
1972.3H56081247k54392r6262L1769r7811k60710j91033j6928j1146k07126l03269
$$ y = [851390898, 851701260, 852055490, 852375269, 852729976, 853106439, 853539050, 853852153, 853806794, 853601158, 853874624, 854450822, 854774356, 854892492, 855119467, 855509341, 855747044, 855716348, 855717778, 855931997, 856065631, 855900109, 855873823, 856277347, 856761575, 857008874, 856985152, 856934488, 857122660, 857424796, 857489109, 857270718, 857224405, 857500017, 857690871, 857668877, 857650936, 857802451, 858028769, 858073711, 857893646, 857768238, 857906818, 858097553, 858024895, 857769370, 857734680, 857905805, 857973278, 857934892, 857922912, 858005822, 858103573, 858052313, 857882738, 857781529, 857743979, 857605696, 857411921, 857323706, 857366800, 857452929, 857410789, 857189775, 856978476, 856912673, 856884122, 856746018, 856499910, 856284499, 856238544, 856245875, 856081247, 855826855, 855730593, 855762362, 855664551, 855403841, 855212808, 855195880, 855184734, 854977608, 854674339]
1992.6H54674339j09613N3883m2975k18332k29955n9127r54k04504l54886k06112j4484
2015.1H53287280q6844k81513k75850n8234M4882j38700l31342k02954M2975l934k39312
2037.5H51756454l01421j29759N543r8586k69115k00689J2457J8060j91032k67446
2057.9H50334466p8917N1618j02580k60711j40190P2301R0420r7752k21669q5056Q0228
2080.3H49642158M947j44065j05083N0843P8678r1374k02119n3406J29223O2823j07765
2102.8H49264860j02699K9624M9651p5341j17063K4020J38879N4181p6950m2617J01387
2125.2H49247932J37747M1425j9252K3961P8022O7353N2989O2108O5327P5102Q0645
2147.7H49913359M2855J0252N2751R6738Q4221N9724L5405M0114R5666J10566P7844
$$ y = [854674339, 854564726, 854618609, 854575634, 854357302, 854127347, 854068220, 854067266, 853862762, 853507876, 853301764, 853287280, 853200436, 852918923, 852643073, 852584839, 852629721, 852491021, 852159679, 851956725, 851999700, 851995766, 851756454, 851455033, 851325274, 851330817, 851232231, 850963116, 850762427, 850774884, 850792944, 850601912, 850334466, 850255549, 850307167, 850204587, 849943876, 849803686, 849875987, 849966407, 849868655, 849646986, 849561930, 849642158, 849647105, 849503040, 849397957, 849448800, 849527478, 849436104, 849233985, 849180579, 849309802, 849372625, 849264860, 849162161, 849191785, 849241436, 849166095, 849049032, 849073052, 849211931, 849266112, 849189162, 849146545, 849247932, 849385679, 849427104, 849407852, 849431813, 849509835, 849577188, 849630177, 849692285, 849757612, 849832714, 849913359, 849956214, 849966466, 850019217, 850115955, 850200176, 850259900, 850295305, 850335419, 850431085, 850541651, 850619495]
2170.1H50619495Q7440J24097J03414J3828l0577M5717J44779J37210L3379k7955L9339
2192.5H51290166J20879P8678j5021j4662N9604O4075j7941n4419J6868J00971P5936
2215H51705134l9816q2374K9028J26183L7908p9214k2054P7486M4704n9903p7069K9922
2239.4H51689935Q9526l994q5055k4736P3373O6519k9385n0366J5616L2306J4186N781
2263.9H51793706K4975R5129R7275l0280j20282m1544J01149J06156K1219M2140J42694
2286.3H52232337K10285J74046Q5056J25467K85745L64780K94269K46942L66270N42402
2306.7H54927599N36085L62932L09587M58240O45340P10904O04153M66645N05149O01232
2327.1H60127866M85778K07126P6115J56105K02179J79768J56283q4818o79910p35461
$$ y = [850619495, 850706935, 850831032, 850934446, 850948274, 850917697, 850963414, 851108193, 851245403, 851278782, 851250827, 851290166, 851411045, 851489723, 851474702, 851460040, 851519644, 851583719, 851565778, 851511359, 851528227, 851629198, 851705134, 851665318, 851582944, 851611972, 851738155, 851776063, 851696849, 851674795, 851752281, 851796985, 851737082, 851660013, 851689935, 851779461, 851775467, 851690412, 851665676, 851739049, 851805568, 851776183, 851725817, 851741433, 851773739, 851787925, 851793706, 851818681, 851913810, 852011085, 851980805, 851860523, 851818979, 851920128, 852026284, 852047503, 852089643, 852232337, 852442622, 852616668, 852701724, 852827191, 853112936, 853477716, 853771985, 854018927, 854385197, 854927599, 855463684, 855826616, 856136203, 856594443, 857239783, 857950687, 858554840, 859021485, 859526634, 860127866, 860613644, 860820770, 860896885, 861052990, 861255169, 861434937, 861591220, 861506402, 860826492, 860091031]
2347.5H60091031J52170J213193J713574J414418P97272K92897k7835l55482p41482
2365.9H64549756j037180j115263j045287j026332j052797r28342p00057n54084m66407
2384.2H56624007l16024q8632R5368Q6844k0087K0683J53184J71244P8618k3067l1232
2406.7H56750906M8041P2539J3172j0788N4598J18792Q2850k4676r8348n3823O0439
2429.1H57013702Q7560k4677j05679k7537M8578j2577r2387n7340L6299M3571m9352
2451.5H56860161q6665K0206J09553J7166j49846j47819Q583N6862n7995j44064q6785
2474H56399357L0518K4021j27137j69397k145R5725m2081j89185j12951M2617K2948
2496.4H55972290j22070j58489k4915N9545n9008j79768r9719M5121K5153j33812j77383
$$ y = [860091031, 860243201, 861456394, 863169968, 864584386, 865381658, 865674555, 865646720, 865291238, 864549756, 863512576, 862397313, 861352026, 860325694, 859272897, 858344555, 857644498, 857090414, 856624007, 856307983, 856219351, 856314719, 856401563, 856381476, 856402159, 856555343, 856726587, 856805205, 856782138, 856750906, 856798947, 856871486, 856884658, 856873870, 856928468, 857047260, 857130110, 857105434, 857007086, 856953263, 857013702, 857101262, 857076585, 856970906, 856943369, 856991947, 856979370, 856886983, 856829643, 856865942, 856909513, 856860161, 856773496, 856793702, 856903255, 856920421, 856770575, 856622756, 856631339, 856688201, 856630206, 856486142, 856399357, 856429875, 856453896, 856326759, 856157362, 856155217, 856250942, 856208861, 856019676, 855906725, 855949342, 855972290, 855850220, 855691731, 855666816, 855726361, 855667353, 855487585, 855387866, 855432987, 855458140, 855324328, 855146945]
2518.9H55146945l7432M0114p7367j87636q2552Q5175L1114j59979j81854k2232M7147
2541.3H54601443q5831k07424j50979l3795r120q2612j34051q7619k6941o0260j47105
2563.7H53575706j62065r1135m5657j16646j94788j42456o8843j13904k14339k40802
2584.1H52185071j84536j36912j46687j91450k17379j81377j64032k17676k65479k54750
2604.5H50224793k00629k00033k63811k99036k87116k37405k27630k94089k97010k10166
2624.9H47707868k12551l20613l47793k71916k23101k41756k93016l08514k48850k00569
2645.3H45039189k47717l19362l18110k79128k77877l00646k68400j99437k03907k75553
2665.7H42349052l14116k84612k54035k70307k86460k71976k55466k83897l44157l49700
$$ y = [855146945, 855109513, 855149627, 855072260, 854884624, 854802072, 854887247, 854918361, 854758382, 854576528, 854554296, 854601443, 854515612, 854308188, 854157209, 854123414, 854114294, 854031682, 853897631, 853810012, 853783071, 853722811, 853575706, 853413641, 853322506, 853276849, 853160203, 852965415, 852822959, 852754116, 852640212, 852425873, 852185071, 852000535, 851863623, 851716936, 851525486, 851308107, 851126730, 850962698, 850745022, 850479543, 850224793, 850024164, 849824131, 849560320, 849261284, 848974168, 848736763, 848509133, 848215044, 847918034, 847707868, 847495317, 847174704, 846826911, 846554995, 846331894, 846090138, 845797122, 845488608, 845239758, 845039189, 844791472, 844472110, 844154000, 843874872, 843596995, 843296349, 843027949, 842828512, 842624605, 842349052, 842034936, 841750324, 841496289, 841225982, 840939522, 840667546, 840412080, 840128183, 839784026, 839434326]
2686.1H39434326k85268k48492k93612l50833l21389k40445k47359l21209l51191l60072
2706.5H36414456l65734l46184l30626l24190l20614l19421l05891l28064l65794l87847
2726.9H33020091m23551l98576l25620l00288l09885l27646l30568l30508l34322l00646
2747.3H29638481k93374l72946m48406m29153l49284l15904l84212m75883m55082l80218
2767.7H25734019l99053m27007l88146l94762m75227n67556o16848n60045m30465l91722
2788.1H21083188n21302o38902n83828m83990n44309p15017p61271o96182o78182o90758
2808.5H14769447p39157p83265p38442p48336q64446r02415q40008q36611r25421r76801
2828.9H06414545r49979r72629j111328j301647j585722j974702k299189k570212k770364
$$ y = [839434326, 839149058, 838900566, 838606954, 838256121, 837934732, 837694287, 837446928, 837125719, 836774528, 836414456, 836048722, 835702538, 835371912, 835047722, 834727108, 834407687, 834101796, 833773732, 833407938, 833020091, 832596540, 832197964, 831872344, 831572056, 831262171, 830934525, 830603957, 830273449, 829939127, 829638481, 829345107, 828972161, 828523755, 828094602, 827745318, 827429414, 827045202, 826569319, 826114237, 825734019, 825334966, 824907959, 824519813, 824125051, 823649824, 823082268, 822465420, 821905375, 821474910, 821083188, 820561886, 819922984, 819339156, 818855166, 818310857, 817595840, 816834569, 816138387, 815460205, 814769447, 814030290, 813247025, 812508583, 811760247, 810895801, 809993386, 809153378, 808316767, 807391346, 806414545, 805464566, 804491937, 803380609, 802078962, 800493240, 798518538, 796219349, 793649137, 790878773]
2847.2G90878773k576649j905084j165331p25507n21541m62294o22272r22561j225590
2865.6G80751944j437009j446724j296401j229763j279354j149714q86261q32796r50873
2883.9G70243049j011789j028836j117885j223505j246214j275360j366854j416147
2900.2G60556459j439988j505673j560331j662611j915932k250612k505481k500415
2916.6G45215416k255321j915395j445711r29832m72248j07109M530R4771M71056Q74817
2937G39534974J097322J283764J424611J308501Q84950M40598K24292J4603k39670
2955.3G45973945k55764o7413J18971J93834K12849K39610K54035L41833M44949M34219
2975.7G47891068M45009M49478K67923J09315J64151K54870K95043K16543r1731l43800
$$ y = [790878773, 788302124, 786397040, 785231709, 784506202, 783984661, 783522367, 782900095, 781977534, 780751944, 779314935, 777868211, 776571810, 775342047, 774062693, 772912979, 772026718, 771193922, 770243049, 769231260, 768202424, 767084539, 765861034, 764614820, 763339460, 761972606, 760556459, 759116471, 757610798, 756050467, 754387856, 752471924, 750221312, 747715831, 745215416, 742960095, 741044700, 739598989, 738669157, 738196909, 738089800, 738094330, 738189101, 738660157, 739534974, 740632296, 741916060, 743340671, 744649172, 745534122, 745974720, 746199012, 746213615, 745973945, 745718181, 745650768, 745769739, 745963573, 746176422, 746416032, 746670067, 747011900, 747456849, 747891068, 748336077, 748785555, 749053478, 749162793, 749326944, 749581814, 749876857, 750093400, 750001669, 749657869]
2996.1G49657869m67658o61909p66874p67171p92086p40349n90623n63323p69794r95338
3016.5G42542744j052916j020372j008630j079619j196980j159728j031399j039862
3032.8G33953238j214326j352548j227260j109600j304031j552581j565636j428365
3049.1G23198891j395703j518726j591265j562774j558841j551926j463711j332700
3065.5G11223245j325310j509249j628518j498878j270294j189411j369953j574278
3081.8F99857354j593768j592577j609266j603901j665890j704991j619458j518250
3098.1F86949253j571476j735092j749694j627445j621604j753688j762927j627087
3114.4F73500240j644492j816869k034128k248287k231598k027631j906573j951695
$$ y = [749657869, 749190211, 748528302, 747761428, 746994257, 746202171, 745461822, 744871199, 744307876, 743538082, 742542744, 741489828, 740469456, 739460826, 738381207, 737184227, 736024499, 734993100, 733953238, 732738912, 731386364, 730159104, 729049504, 727745473, 726192892, 724627256, 723198891, 721803188, 720284462, 718693197, 717130423, 715571582, 714019656, 712555945, 711223245, 709897935, 708388686, 706760168, 705261290, 703990996, 702801585, 701431632, 699857354, 698263586, 696671009, 695061743, 693457842, 691791952, 690086961, 688467503, 686949253, 685377777, 683642685, 681892991, 680265546, 678643942, 676890254, 675127327, 673500240, 671855748, 670038879, 668004751, 665756464, 663524866, 661497235, 659590662, 657638967]
3130.7F57638967k092779k126574k002239j975716k177715k330482k283037k223789
3147F40426636k140165k030015k172887k506018k620101k496659k390862k374470k393842
3165.4F19301617k390444k384246k423763k483845k527236k535165k471030k434730
3181.7E99651158k495766k521336k475321k479017k546787k583921k577484k532601
3198E79438925k461493k416134k408862k394498k382814k405286k394319k317309k268553
3216.4E57989657k282202k295971k306342k290428k267361k240121k091766j928806
3232.7E40286660k011299k175569k102077j930416j838148j752436j711428j759231
3249E25006056j755893j684130j638293j640260j663447j678288j688599j660347j564086
$$ y = [657638967, 655546188, 653419614, 651417375, 649441659, 647263944, 644933462, 642650425, 640426636, 638286471, 636256456, 634083569, 631577551, 628957450, 626460791, 624069929, 621695459, 619301617, 616911173, 614526927, 612103164, 609619319, 607092083, 604556918, 602085888, 599651158, 597155392, 594634056, 592158735, 589679718, 587132931, 584549010, 581971526, 579438925, 576977432, 574561298, 572152436, 569757938, 567375124, 564969838, 562575519, 560258210, 557989657, 555707455, 553411484, 551105142, 548814714, 546547353, 544307232, 542215466, 540286660, 538275361, 536099792, 533997715, 532067299, 530229151, 528476715, 526765287, 525006056, 523250163, 521566033, 519927740, 518287480, 516624033, 514945745, 513257146, 511596799, 510032713]
3267.4E10032713j467466j540601j709938j767159j758337j736283j728356j741081
3283.7D96583492j725585j688659j631498j620859j740277j913816k032280k007693
3300D82222825j808911j633525j717270k015560k253831k269059k193839k145797k090186
3318.4D64094847k034545j992672j997322k118558k235234k209842k155751k089083
3334.7D47261840j979262k021998k192855k268314k260804k136678j926273j994639
3351D30481017k305180k362579k116919j947373j977444j969695j764566j633673j835764
3369.3D12567824k126187k093345j778155j573951j518547j477122j383245j194269
3385.7C99423003r12905o05732o44088j012623j001000m72904j77413n48243r74953
$$ y = [510032713, 508565247, 507024646, 505314708, 503547549, 501789212, 500052929, 498324573, 496583492, 494857907, 493169248, 491537750, 489916891, 488176614, 486262798, 484230518, 482222825, 480413914, 478780389, 477063119, 475047559, 472793728, 470524669, 468330830, 466185033, 464094847, 462060302, 460067630, 458070308, 455951750, 453716516, 451506674, 449350923, 447261840, 445282578, 443260580, 441067725, 438799411, 436538607, 434401929, 432475656, 430481017, 428175837, 425813258, 423696339, 421748966, 419771522, 417801827, 416037261, 414403588, 412567824, 410441637, 408348292, 406570137, 404996186, 403477639, 402000517, 400617272, 399423003, 398510098, 397904366, 397260278, 396247655, 395246655, 394773751, 394596338, 394048095, 393073142]
3404C93073142p42734k38776o8098j40638k51054k65301p9512R0956J47164L32773
3424.4C91857922O44654Q68410Q30054Q20697J042842J001746O67065O59764J034558
3442.8C99427712J337409J462877J516968J567781J648336J773090J944989K070218
3459.1D12749380J977265J971841K365023K603650K230942J687229J659870K091705
3475.4D29336905K514005K506286K153576K134561K441704K459705K330005K470285
3491.7D48347032K634078K656341K623528K613485K602726K490670K388209K480030
3508D68836099K756774L054679L024399K732992K696336K900660L136217L116280K870560
3526.4D95124996K881467L134906L322840L407240L364086L282607L478527L707111
$$ y = [393073142, 392330408, 392091632, 392023534, 391882896, 391631842, 391366541, 391287029, 391377985, 391525149, 391857922, 392502576, 393370986, 394201040, 395021737, 396064579, 397066325, 397733390, 398393154, 399427712, 400765121, 402227998, 403744966, 405312747, 406961083, 408734173, 410679162, 412749380, 414726645, 416698486, 419063509, 421667159, 423898101, 425585330, 427245200, 429336905, 431850910, 434357196, 436510772, 438645333, 441087037, 443546742, 445876747, 448347032, 450981110, 453637451, 456260979, 458874464, 461477190, 463967860, 466356069, 468836099, 471592873, 474647552, 477671951, 480404943, 483101279, 486001939, 489138156, 492254436, 495124996, 498006463, 501141369, 504464209, 507871449, 511235535, 514518142, 517996669, 521703780]
3542.7E21703780L625750L368914L319145L468752L602385L683686L756762L879547
3559E50408721L926873L712774L483414L995180M714132M585683M253030M292369M512250
3577.4E87884426M733980M892111M805445M504264M431486M878044N018651M865885
3593.7F26014292M969597N187690N193472N154610N050600M701852M661143M968643
3610F65901899N092919N132318M961073M846454N338371N409598M771531M008829L823817
3628.4G09286809M778802N030036M635811M384935M185319M011214L800869L379047
3644.7G43492842K824366K950251L870487L855467L225684L269076L468931K937556
3661G69894660K351641K160669J795768J338780J739919J853943J282573J722634K210736
$$ y = [521703780, 525329530, 528698444, 532017589, 535486341, 539088726, 542772412, 546529174, 550408721, 554335594, 558048368, 561531782, 565526962, 570241094, 574826777, 579079807, 583372176, 587884426, 592618406, 597510517, 602315962, 606820226, 611251712, 616129756, 621148407, 626014292, 630983889, 636171579, 641365051, 646519661, 651570261, 656272113, 660933256, 665901899, 670994818, 676127136, 681088209, 685934663, 691273034, 696682632, 701454163, 705462992, 709286809, 714065611, 719095647, 723731458, 728116393, 732301712, 736312926, 740113795, 743492842, 746317208, 749267459, 753137946, 756993413, 760219097, 763488173, 766957104, 769894660, 772246301, 774406970, 776202738, 777541518, 779281437, 781135380, 782417953, 784140587, 786351323]
3679.4G86351323J898646J435280P94947j77145p17580M11749J862168K472699K481401
3697.7G96813488K111673J732529J599073J356363P96855K07782L03864J127660J368523
3716.1H07417810R90570N79237L81232L66449M93348P28965N31852m4823k16365M26770
3736.5H11655045J039624P64906j90019o19889L27468M47214o9857N18620J061738
3754.8H14934850P50243L78013M64320M79400K16782J50145J94430L68416N96106M58360
3775.2H18991065J26839m7863J42455L09229K61247K85149L04520K37763N8889j99735
3795.6H20469558k23219l18766l14772L71158M41790K72274N91397M93884j08182m54962
3816H21220160j62781j85013J8835N78404M05133J74105O1452q1777k4736k40505n13732
$$ y = [786351323, 788249969, 789685249, 790480196, 790303051, 789585471, 789997220, 791859388, 794332087, 796813488, 798925161, 800657690, 802256763, 803613126, 804409981, 804617763, 804921627, 806049287, 807417810, 808408380, 808987617, 809368849, 809735298, 810228646, 810957611, 811489463, 811444640, 811228275, 811655045, 812694669, 813459575, 813269556, 812649667, 812977135, 813424349, 813354492, 813873112, 814934850, 815685093, 816063106, 816527426, 817006826, 817223608, 817373753, 817568183, 817936599, 818532705, 818991065, 819117904, 819070041, 819212496, 819521725, 819782972, 820068121, 820372641, 820610404, 820669293, 820469558, 820246339, 819927573, 819612801, 819983959, 820425749, 820698023, 821289420, 821783304, 821675122, 821220160, 821057379, 820872366, 820891201, 821469605, 821874738, 822048843, 822110295, 822028518, 822003782, 821763277, 821249545]
3838.4H21249545K1338N41151O11841N30899J90198n49793j428425n26011J091718
3856.8H21732461J005471K28584l58462k06709J00851j94788j73628K77638M61698
3875.2H22873116M21822m8638k40564P2062N1439J28388P5400k24710J03832M21524
3895.5H23633671K8074m67241n18441j99795L31402O14226M04000J28686k3663k18391
3915.9H23712528k65181k8372P9512k0504L0458J21057P093j0252J72556J73032N0366
3938.4H24022293k9504j09852j370J15394J1206P629J60814K08973J18792K4260q524
3960.8H24520111L874R001J1444L3021M0292K9326K1696M1723P3254J27554J62661
3983.2H25073957J14441L219p2002n722N0842M2558R6023
$$ y = [821249545, 821270883, 821812034, 822423875, 822954774, 823144972, 822595179, 821166754, 820640743, 821732461, 822737932, 822966516, 822608054, 822401345, 822502196, 822307408, 822133780, 822411418, 822873116, 823294938, 823246300, 823005736, 823077798, 823129237, 823257625, 823333025, 823108315, 823212147, 823633671, 823661745, 823194504, 822676063, 822476268, 822807670, 823421896, 823825896, 823954582, 823930919, 823712528, 823447347, 823418975, 823498487, 823477983, 823508441, 823629498, 823636591, 823626339, 823798895, 823971927, 824022293, 823992789, 823882937, 823881567, 823996961, 824008167, 824015796, 824176610, 824385583, 824504375, 824528635, 824520111, 824523985, 824532986, 824544430, 824577451, 824617743, 824647069, 824668765, 824710488, 824783742, 824911296, 825073957, 825188398, 825191617, 825119615, 825113893, 825164735, 825207293, 825303316]
3997.5H25303316
$$ y = [825303316]
##END=$$ End of the data block
