##TITLE=$$ Begin of the data block
##JCAMP-DX=5.00 $$ ACD/SpecManager v 10.08
##SPECTROMETER/DATA SYSTEM=Alpha
##DATE=07 Apr 2014 11:14:18
##DATA TYPE=INFRARED SPECTRUM
##DATA CLASS=XYDATA
##ORIGIN=
##OWNER=
##NPOINTS=1765
##FIRSTX=399.75695801
##LASTX=3997.56933594
##MAXX=3997.56933594
##MINX=399.75695801
##MAXY=0.86567271
##MINY=0.39142647
##XFACTOR=1.0000000000
##YFACTOR=1.000000000000000e-9
##FIRSTY=0.68389618
##DELTAX=2.03957629
##XUNITS=1/CM
##YUNITS=ARBITRARY UNITS
##XYDATA=(X++(Y..Y))
399.8F83896184J67191l72350j071990r92834l1054j73450j337409j649916j010358
$$ 683896184 684063375 683691025 682619035 681626201 681595147 681421697 680084288 678434372 677424014
418.1F77424014J43706K58267o01828p55846M5001L59416m12822j015245k32161P53940
$$ 677424014 677567720 677825987 677224159 676468313 676513314 676872730 676459908 675444663 675212502 675966442
438.5F75966442R7334j060069n41687P37906M00901j112938j303852J57953P71284
$$ 675966442 676063776 675003707 674462020 675199926 675600827 674487889 673184037 673341990 674113274
456.9F74113274n88477j621008o54280O64174L2127j665473j561939L23832N93900
$$ 674113274 673524797 671903789 671249509 671913683 671945810 670280337 668718398 669042230 669636130
475.2F69636130j224816j779258j94847R44376k43068j705766p77960Q01564J85907
$$ 669636130 668411314 666632056 666437209 667381585 667138517 665432751 664654791 665456355 665642262
493.6F65642262j587570j622737j45077K66492q94070j533091m50551O53505k13623
$$ 665642262 664054692 662431955 662286878 662553370 661659300 660126209 659675658 660329163 660115540
511.9F60115540j680553j497805r8765J55866j200139j897037q20816J81556o24061
$$ 660115540 658434987 656937182 656838417 656994283 655794144 653897107 653076291 653257847 652633786
530.3F52633786j882672j635969l90589n0664r75966j523257p44164M3810k91884j100302
$$ 652633786 650751114 649115145 648724556 648673892 647697926 646174669 645430505 645474315 645182431 644082129
550.7F44082129j208127m72724k20716j143694j902521j477778p66515j001418j891851
$$ 644082129 642874002 642401278 642180562 641036868 639134347 637656569 636890054 635888636 633996785
569F33996785k003491j159251q08954j584292k324760j838565p49647p29382j772404
$$ 633996785 631993294 630834043 630025089 628440797 626116037 624277472 623527825 622798443 621026039
587.4F21026039k196908j209319l61025j228392k395689j970172r56118j360894k583146
$$ 621026039 618829131 617619812 617258787 616030395 613634706 611664534 610708416 609347522 606764376
605.8F06764376k507269p81477M26770k67804r39191O16611L051459L534615K314866
$$ 606764376 604257107 603475630 603902400 603634596 602695405 603312016 606363475 609898090 612212956
624.1F12212956J902938L003478L670096K766431J678466K159060L170192K549767
$$ 612212956 614115894 617119372 620789468 623555899 625234365 627393425 630563617 633113384
640.4F33113384P68781M27306K208590L280342J894593L6359k7478J747191L403008
$$ 633113384 633882165 634309471 636518061 639798403 641692996 641729355 641701877 643449068 646852076
658.8F46852076L407121K926528L057361L740489L326774J383483J628101K760351
$$ 646852076 650259197 653185725 656243086 659983575 663310349 664693832 666321933 669082284
675.1F69082284K691030J614631J138329J724482K133906J541793P26104O91771J191020
$$ 669082284 671773314 673387945 674526274 676250756 678384662 679926455 680652559 681344330 682535350
693.5F82535350J253307N77986J51158P59423J642644J610577Q56102P11917J588166
$$ 682535350 683788657 684366643 684517801 685277224 686919868 688530445 689386547 690098464 691686630
711.8F91686630K299190J832723R69470J095951K027452K161502J159668O28472J516759
$$ 691686630 693985820 695818543 696788013 697883964 699911416 702072918 703232586 703861058 705377817
730.2G05377817K371192J647413L45588M81724J782000K075255R49204L43800J363456
$$ 705377817 707749009 709396422 709742010 710223734 712005734 714080989 715030193 715373993 716737449
748.5G16737449K519965K040327P31468P97331K142609K419471J064122J63555R92418
$$ 716737449 719257414 721297741 722029209 722826540 724969149 727388620 728452742 728616297 729608715
766.9G29608715K001285J280964k70665l91424P10130P90357o55114j569748o03616
$$ 729608715 731610000 732890964 732620299 732228875 732939005 733729362 733074248 731504500 730900884
785.2G30900884P68721P36058R8824Q13484K692878L759087L320455K903044L621877
$$ 730900884 731669605 732405663 732504487 733317971 736010849 739769936 743090391 745993435 749615312
803.6G49615312M356026L744006K356828J769483K190113K189994R35137m30107o68705
$$ 749615312 753971338 757715344 760072172 761841655 764031768 766221762 767156899 766726792 766058087
821.9G66058087m18067j005530k367079l113866k608538j924515k161383k782226k522349
$$ 766058087 765640020 764634490 762267411 759153545 756545007 754620492 752459109 749676883 747154534
840.3G47154534j499474j124323j625239j469315K35677K423346L634870L991783M756331
$$ 747154534 745655060 744530737 742905498 741436183 741671860 744095206 747730076 751721859 756478190
858.7G56478190O131828O787300N903960M626095M438281M719317L849447K089619
$$ 756478190 762610018 769397318 775301278 779927373 784365654 789084971 792934418 795024037
875G95024037J208604J597225J627565K77579j162887j128256l34263n12540j427412
$$ 795024037 796232641 797829866 799457431 799735010 798572123 797443867 797109604 796597064 795169652
893.3G95169652j282633K04861J318157J016378L98577Q18789J576125J073838m67241
$$ 795169652 793887019 794091880 795410037 796426415 796824992 797643781 799219906 800293744 799826503
911.7G99826503j394928j282990j393437k385199l087282k347768q26835M6968Q6308
$$ 799826503 798431575 797148585 795755148 793369949 790282667 787934899 787108064 787155032 787241340
930G87241340K84910Q93533J063168M47810k19345k69294q8632l57032j055717j718760
$$ 787241340 787526250 788419783 789482951 789930761 789711416 789442122 789353490 788996458 787940741 786221981
950.4G86221981k073884k431273l202200m205168n045294n772710o651700p745445
$$ 786221981 784148097 781716824 778514624 774309456 769264162 763491452 756839752 749094307
966.8G49094307q776247r230554q874178p972658o973922o074131n196333m261374
$$ 749094307 740318060 731087506 722213328 714240670 707266748 701192617 695996284 691734910
983.1F91734910l436506l086149l021896k595723j853824j431107j426757j247465
$$ 691734910 688298404 685212255 682190359 679594636 677740812 676309705 674882948 673635483
999.4F73635483o64056l42786q80778j848578k440274k653718l048181l680587l915191
$$ 673635483 672971427 672628641 671747863 669899285 667459011 664805293 661757112 658076525 654161334
1017.7F54161334l476977l038585l194094l540278l349662k741158k430617k543331
$$ 654161334 650684357 647645772 644451678 640911400 637561738 634820580 632389963 629846632
1034.1F29846632k489328j971662j509786j656413k083957k157211j909018j821160
$$ 629846632 627357304 625385642 623875856 622219443 620135486 617978275 616069257 614248097
1050.4F14248097j951516j744866q80540J08958L64661j38521p30336j227915j972914
$$ 614248097 612296581 610551715 609671175 609780133 610144794 610006273 609275937 608048022 606075108
1068.7F06075108l016174l887474m171551m095792m265905m718661m901707m621208
$$ 606075108 603058934 599171460 594999909 590904117 586638212 581919551 577017844 572396636
1085E72396636m331708m342556m256368l492891k158463j065731o65248n61774l34918
$$ 572396636 568064928 563722372 559466004 555973113 553814650 552748919 552083671 551521897 551186979
1103.4E51186979j33157k86758p67410j093566j102150j397073k502203l926575m306912
$$ 551186979 551053822 550767064 549999654 548906088 547803938 546406865 543904662 539978087 535671175
1121.8E35671175k931118j056314j08361M50909R73046R44674Q49724J268744K009153
$$ 535671175 532740057 531683743 531575382 532026291 532999337 533944011 534793735 536062479 538071632
1140.1E38071632K598524K596081K047479J604974J679421J917898J885593J742363
$$ 538071632 540670156 543266237 545313716 546918690 548598111 550516009 552401602 554143965
1156.4E54143965K016127K831400L691196M241526M784882N585671O280243O399691
$$ 554143965 556160092 558991492 562682688 566924214 571709096 577294767 583575010 589974701
1172.7E89974701O072045N812108N796194N662084N075097M248440L572643L003299
$$ 589974701 596046746 601858854 607655048 613317132 618392229 622640669 626213312 629216611
1189.1F29216611K185822J178145N31912N73456J087428J652658K122223K654552L140450
$$ 629216611 631402433 632580578 633112490 633685946 634773374 636426032 638548255 641202807 644343257
1207.4F44343257L134489K577186J930177J646221J719594J724660J481652J324713
$$ 644343257 647477746 650054932 651985109 653631330 655350924 657075584 658557236 659881949
1223.7F59881949J518012J847624J932025J776338J776218K069772K289176K100229
$$ 659881949 661399961 663247585 665179610 666955948 668732166 670801938 673091114 675191343
1240.1F75191343J704633J554012J562655J261115O50406K45631L57032O24359N83589
$$ 675191343 676895976 678449988 680012643 681273758 681924164 682169795 682526827 683151186 683734775
1258.4F83734775M99308R32812J730562K252996K291441K331018K800763L327787L339648
$$ 683734775 684234083 685166895 686897457 689150453 691441894 693772912 696573675 699901462 703241110
1276.8G03241110L027320L069520L538251L796398L562451L309428L482402L756881
$$ 703241110 706268430 709337950 712876201 716672599 720235050 723544478 727026880 730783761
1293.1G30783761L486871K759755K354860K470017K429843J865804J277268J204192
$$ 730783761 734270632 737030387 739385247 741855264 744285107 746150911 747428179 748632371
1309.4G48632371J380384J228810P64727N44370Q92818J309156J203239Q84831Q98957
$$ 748632371 750012755 751241565 752006292 752550662 753443480 754752636 755955875 756840706 757739663
1327.8G57739663J129449J026749M50015q3267j01626K94864M83751K73883K22564
$$ 757739663 758869112 759895861 760345876 760262609 760160983 760455847 760939598 761213481 761436045
1346.1G61436045N20289O96957M32313P450q5175N6863k02477q24511r58085o49929
$$ 761436045 761956334 762653291 763085604 763093054 763007879 763064742 762862265 762037754 761079669 760429740
1366.5G60429740n12123o08564j030862j305222q90255p90120j598656k258301j777768
$$ 760429740 759917617 759309053 758278191 756972969 756082714 755292594 753693938 751435637 749657869
1384.9G49657869p83801l77238o64234j189291j407623j246155j555681j966417k109289
$$ 749657869 748874068 748496830 747832596 746643305 745235682 743989527 742433846 740467429 738358140
1403.2G38358140k189219k020717k115369k255976j742422j159251j427889j919329
$$ 738358140 736168921 734148204 732032835 729776859 728034437 726875186 725447297 723527968
1419.5G23527968j171112l63767k12312m90963q50559m22477K34484J08898P0989P21395
$$ 723527968 722356856 721993089 721780777 721289814 720439255 720016778 720251262 720360160 720431149 721152544
1439.9G21152544J243949J390099J219333J238942J906216K572417K706707K996146
$$ 721152544 722396493 723786592 725005925 726244867 728151083 730723500 733430207 736426353
1456.2G36426353M294277M745423M323841M183292M152298L997684M130780M830003
$$ 736426353 740720630 745466053 749789894 753973186 758125484 762123168 766253948 771083951
1472.6G71083951M787564L898025L305971K838850K164543J195967L51072q2255p0572
$$ 771083951 775871515 779769540 783075511 785914361 788078904 789274871 789625943 789543688 789473116
1490.9G89473116j87993r73463j866519j729489j327335j544536l028214n060970l261864
$$ 789473116 789285123 788311660 786445141 784715652 783388317 781843781 778815567 773754597 770492733
1509.3G70492733k057970k570987k874791k519072k012670k482712k353787j624942
$$ 770492733 768434763 765863776 762988985 760469913 758457243 755974531 753620744 751995802
1525.6G51995802j454651j272262j743674k306759j310885r00209k363563k251267
$$ 751995802 750541151 749268889 747525215 745218456 743907571 743007362 740643799 738392532
1541.9G38392532l50177M00543L27289p7546m3213K90453K44141r52005j154125L39389
$$ 738392532 738042355 738442898 738770187 738692641 738649428 738939881 739184022 738232017 737077892 737417281
1562.3G37417281O5744q81672k140105l019512k310991k690017m721701m497290l601372
$$ 737417281 737483025 736601353 734461248 731441736 729130745 726440728 721719027 717221737 713620365
1580.7G13620365l993571m529178n062938n427361n410552n296886n519151n674899
$$ 713620365 709626794 705097616 700034678 694607317 689196765 683899879 678380728 672705829
1597F72705829n492449n306303n282581n363584n527615n590022n203724m803419n651772
$$ 672705829 667213380 661907077 656624496 651260912 645733297 640143275 634939551 630136132 624484360
1615.3F24484360o664216m646540l670692m719079m589856l899812l258646k049088
$$ 624484360 617820144 613173604 609502912 604783833 600193977 596294165 593035519 590986431
1631.6E90986431j655043j945197m21226J191914J683354J824081K255559L384173
$$ 590986431 589331388 587386191 586964965 588156879 589840233 591664314 593919873 597304046
1648E97304046L575564L559589N061090N203605M657626M705012N103469N497455N138934
$$ 597304046 600879610 604439199 609500289 614703894 619361520 624066532 629170001 634667456 639806390
1666.3F39806390N255759O048917N813837N841732O484509O219387N665779N756021
$$ 639806390 645062149 651111066 656924903 662766635 669251144 675470531 681136310 686892331
1682.6F86892331P422924P524013O533325O523549N920649O014884O740391O885350
$$ 686892331 694315255 701839268 708372593 714896142 720816791 726831675 733572066 740457416
1699G40457416P792234O905675N976558O016194N200923M317403L787696L480971L599823
$$ 740457416 748249650 755155325 761131883 767148077 772349000 776666403 780454099 783935070 787534893
1717.3G87534893L657162L224790K900719K725780K293051J915812J674414J767456
$$ 787534893 791192055 794416845 797317564 800043344 802336395 804252207 805926621 807694077
1733.6H07694077K196968J980841J716137J902759K081931J940548J747549J883268
$$ 807694077 809891045 811871886 813588023 815490782 817572713 819513261 821260810 823144078
1749.9H23144078K317131K181470J698494J465619J400828J426160J366914J023769
$$ 823144078 825461209 827642679 829341173 830806792 832207620 833633780 835000694 836024463
1766.3H36024463P17282O53148P46846R90212R69053P93457P77244Q17836O83784N68807
$$ 836024463 836741745 837394893 838141739 839131951 840101004 840894461 841671705 842489541 843173325 843742132
1786.7H43742132N20170L49164L83198O09696O11067N18560N62728N80728M42743L69668
$$ 843742132 844262302 844611466 844994664 845604360 846215427 846733987 847296715 847877443 848320186 848689854
1807H48689854M27961M54009L67582L08692L88027N03659L34203O914M5121L40819
$$ 848689854 849117815 849571824 849939406 850248098 850636125 851139784 851473987 851480901 851526022 851866841
1827.4H51866841L59536L16441L56793L71516M20689K97785m8220j84834K80619N80430
$$ 851866841 852226377 852542818 852899611 853271127 853691816 853989601 853941381 853756547 854037166 854617596
1847.8H54617596L50535J36196K24173L71337K22087k6703l755J96755J31071j46866
$$ 854617596 854968131 855104327 855328500 855699837 855921924 855895221 855891466 856088221 856219292 856072426
1868.2H56072426k0325L93450M88043K57075k563l1949J55151K35320L1948k10226
$$ 856072426 856052101 856445551 856933594 857190669 857188106 857156157 857311308 857546628 857578576 857368350
1888.6H57368350l6180K99811K29359j2219l9458J21414J93239L4988j46747q3983
$$ 857368350 857332170 857631981 857861340 857849121 857809663 857931077 858124316 858159304 858012557 857928574
1909H57928574J56581J92523o3180k38002l6359J45197L8266l9935o377N8293Q7023
$$ 857928574 858085155 858277678 858214498 857976496 857940137 858085334 858123600 858083665 858077288 858135581 858222604
1931.5H58222604k6465j50799r2030j7047j22130k13682j28866J6392P3611m6193k11120
$$ 858222604 858196139 858045340 857953310 857936263 857814133 857600451 857471585 857487977 857561588 857515395 857304275
1953.9H57304275k17617r7930m6492j41441k36392j76490L398K2828j80185k65538
$$ 857304275 857086658 856988728 856942236 856800795 856564403 856387913 856391311 856414139 856233954 855968416
1974.3H55968416j05620K7180p9274k30849j73390k2411l7313k38657l09169q7798
$$ 855968416 855862796 855889976 855810702 855579853 855406463 855384052 855346739 855108082 854798913 854711115
1994.7H54711115P5579l9279k31207k38120n8949p630k05099l40522k01344k6941r7752
$$ 854711115 854786694 854747415 854516208 854278088 854219139 854211509 854006410 853665888 853464544 853437603 853339851
2017.1H53339851k65658k31922k6166K9981j71542l30627j98305J5199j9192k19286
$$ 853339851 853074193 852842271 852816105 852846086 852674544 852343917 852145612 852160811 852141619 851922333
2037.5H51922333k77638j17183N305j03712k71023k19404o974M1902j63793k85030
$$ 851922333 851644695 851527512 851532817 851429105 851158082 850938678 850931704 850973606 850809813 850524783
2057.9H50524783q7261R6440o2108k77877j82628N1677Q3029j18911k47777j02222
$$ 850524783 850437522 850533962 850471854 850193977 850011349 850063026 850146055 850027144 849779367 849677145
2078.3H49677145P3731K0922j04308p5698M3630N3823j05500j94490l8981J19686M1127
$$ 849677145 849750876 849771798 849667490 849591792 849635422 849689245 849583745 849389255 849350274 849469960 849511087
2100.7H49511087r0778n6565M2379J7762j10984j20580L4273J28984M2260o2227k2352
$$ 849511087 849420309 849363744 849406123 849423885 849312901 849192321 849226594 849355578 849397838 849335611 849313259
2123.2H49313259R2507J33395N9724j6034K6941R9302O9320K4974L2544N4598Q8036
$$ 849313259 849405766 849539161 849598885 849582851 849609792 849709094 849778414 849803388 849835932 849890530 849978566
2145.6H49978566Q5950K7180J2100P6890J14381Q2075M6313L7909N5671R6201J08362
$$ 849978566 850064516 850091696 850103796 850180686 850295067 850377142 850423455 850461364 850517035 850613236 850721598
2168H50721598P8201O6578J07527J30117N8174o020M8459J36494J32859K9624k8909
$$ 850721598 850799799 850866377 850973904 851104021 851162195 851156175 851204634 851341128 851473987 851503611 851474702
2190.5H51474702O2049J44124O7293n6564n6863M7505Q0704l874n1439L3558J34587
$$ 851474702 851536751 851680875 851748168 851691604 851634741 851682246 851762950 851759076 851707637 851741195 851875782
2212.9H51875782Q4937n7698q8393L1471J14262K0862p7963l696J05083N9843q6307
$$ 851875782 851960719 851903021 851814628 851846099 851960361 851981223 851903260 851899564 852004647 852064490 851978183
2235.4H51978183j17779O139Q1241J2875o5744j1086J09315P8737q0466j08480J8060
$$ 851978183 851860404 851866543 851947784 851960659 851894915 851883829 851993144 852071881 851991415 851882935 851900995
2257.8H51900995P9274L8028J8179N5432R6679N9784p0036j33991j7405J08183P5340
$$ 851900995 851980269 852018297 852036476 852091908 852188587 852248371 852178335 852044344 852026939 852135122 852210462
2280.2H52210462K146N5611J95682K65181J84715P1347J00553K39968L21865K79427
$$ 852210462 852212608 852268219 852463901 852729082 852913797 852985144 853085697 853325665 853647530 853926957
2300.6H53926957K37584L47554N24998N36144L73781L00169M69803O96958P14302N47945
$$ 853926957 854164541 854512095 855037093 855573237 855947018 856247187 856716990 857413948 858128250 858676195
2321H58676195M39108M92096N45442M45127K40147J64807K14994J53422Q4103J25050
$$ 858676195 859115303 859607399 860152841 860597968 860838115 861002922 861217916 861371338 861455441 861580491
2341.4H61580491m7147o31452o66499K06173J198709J674711J381755P08938K17497
$$ 861580491 861533344 860901892 860235393 860441566 861640275 863314986 864696741 865405679 865623176
2359.8H65623176M9532k06113p07269j115859j157641j024127r82583r82880q88705
$$ 865623176 865672708 865466595 864759326 863643467 862485826 861461699 860479116 859496236 858607531
2378.1H58607531p22111n71727m48108k98381q2135J04844J13190J9133J8000J07229
$$ 858607531 857885420 857313693 856865585 856567204 856485069 856589913 856703103 856722236 856740236 856847465
2398.5H56847465J41740P9572N603M649N7757P2539O616m5657P868Q6009O5506k8849
$$ 856847465 856989205 857068777 857074380 857079029 857136786 857209325 857215941 857170284 857178152 857264161 857329667 857300818
2423H57300818p9453l0339N7340O9082j4007o4969k921N7816q702j05500p2599K8611
$$ 857300818 857221365 857191026 857248366 857317448 857303441 857238472 857235551 857293367 857284665 857179165 857106566 857135177
2447.5H57135177L9279m1723q8692J908J30593O7890j26660j67668l9935K5630n9068
$$ 857135177 857174456 857132733 857044041 857045949 857176542 857244432 857117772 856950104 856910169 856935799 856876731
2469.9H56876731j39654o8307N8294K1338j44482j53005J8001O7651p7069j67727o6876
$$ 856876731 856737077 856668770 856727064 856748402 856603920 856450915 856468916 856536567 856459498 856291771 856224895
2492.3H56224895N6445L100j52052j71959q047P9274o6936j92344r9361N5969N0068
$$ 856224895 856281340 856284440 856132388 855960429 855952382 856031656 855964720 855772376 855673015 855728984 855779052
2514.8H55779052j28627k15054o6578M7445o6220j84238r8110N4837L4093j15931j72257
$$ 855779052 855650425 855435371 855368793 855416238 855350018 855165780 855067670 855122507 855156600 855040669 854868412
2537.2H54868412p7486J3351n6505j65820j29521k6643j7166j18494j64330o9738n364
$$ 854868412 854790926 854804277 854747772 854581952 854452431 854425788 854408622 854290128 854125798 854056060 854050696
2559.6H54050696o2585j48892j69576q2731j3769r3042j88828j55210j00136j50800
$$ 854050696 853988111 853839219 853669643 853586912 853573143 853480101 853291273 853136063 853035927 852885127
2580H52885127k13385j87397j42276j44660j82569k18511k05457j61290j75178k51592
$$ 852885127 852671742 852484345 852342069 852197409 852014840 851796329 851590872 851429582 851254404 851002812
2600.4H51002812k88307k34545j82151k09511k65956k94029k67327k15292k30730k88367
$$ 851002812 850714505 850479960 850297809 850088298 849822342 849528313 849260986 849045694 848814964 848526597
2620.8H48526597k77162k09152k19405l25561l60369k75612j90139k07722l10838l51549
$$ 848526597 848249435 848040283 847820878 847495317 847134948 846859336 846669197 846461475 846150637 845799088
2641.2H45799088k79724k12014k27928k84553l11315l05473k94924l02792k92420k26617
$$ 845799088 845519364 845307350 845079422 844794869 844483554 844178081 843883157 843580365 843287945 843061328
2661.6H43061328k00331k57790l04520k90990k54095k46763k74599k75671k38240k63095
$$ 843061328 842860997 842603207 842298687 842007697 841753602 841506839 841232240 840956569 840718329 840455234
2682H40455234l46541l72589l24011k70843k53618k71201k99633l06070l16739l44515
$$ 840455234 840108693 839736104 839412093 839141250 838887632 838616431 838316798 838010728 837693989 837349474
2702.4H37349474l56912l44455l27886l28421l21925l05950l16442l22878k97367l00408
$$ 837349474 836992562 836648107 836320221 835991800 835669875 835363925 835047483 834724605 834427238 834126830
2722.8H34126830l43919m10020m47094l99709l49760l33727l10898l00705l21388l55303
$$ 834126830 833782911 833372891 832925797 832526088 832176328 831842601 831531703 831230998 830909610 830554307
2743.2H30554307l40760k68162k75671l93093m62949m35352l80159l54469l99887m61638
$$ 830554307 830213547 829945385 829669714 829276621 828813672 828378320 827998161 827643692 827243805 826782167
2763.6H26782167m24802l50952l66509m24743m25995m02748m49717n48780o06418n74052
$$ 826782167 826357365 826006413 825639904 825215161 824789166 824386418 823936701 823387921 822781503 822207451
2784H22207451m58241l84509m86315o28054n98907m89414n46515p19309p61628p04169
$$ 822207451 821749210 821364701 820878386 820250332 819651425 819162011 818615496 817896187 817134559 816430390
2804.4H16430390o96182p00415p11143p53104p54655p74622q53955q58546p91132q07524
$$ 816430390 815734208 815033793 814322650 813569546 812814891 812040269 811186314 810327768 809536636 808729112
2824.8H08729112r33528r98795r62853r86576j126051j314462j600086j997471k324820
$$ 808729112 807795584 806796789 805833936 804847360 803721309 802406847 800806761 798809290 796484470
2843.1G96484470k576589k751589k539218j876533j164436p23421n20170m88997o68049
$$ 796484470 793907881 791156292 788617074 786740541 785576105 784852684 784332514 783843517 783175468
2861.5G83175468r63330j214564j381814j421452j310408j256585j296222j139522
$$ 783175468 782212138 780997574 779615760 778194308 776883900 775627315 774331093 773191571
2877.8G73191571q78453q31723r33647r92299j019895j119911j222790j236021j287937
$$ 773191571 772313118 771481395 770547748 769555449 768535554 767415643 766192853 764956832 763668895
2896.2G63668895j403451j434386j423359j476705j538455j642287j909256k263665
$$ 763668895 762265444 760831058 759407699 757930994 756392539 754750252 752840996 750577331
2912.5G50577331k516807k526938k291799j927733j430870q79228m50313j79887n2690
$$ 750577331 748060524 745533586 743241787 741314054 739883184 739003956 738553643 738373756 738321066
2930.8G38321066J30594N12123Q96871J130164J299679J422345J301110Q82209M45604
$$ 738321066 738451660 738963783 739860654 740990818 742290497 743712842 745013952 745896161 746341765
2949.2G46341765K16424L040k70307l11494p6592J73450K66671K61605K53677K50340
$$ 746341765 746558189 746561229 746290922 745979428 745902836 746076286 746342957 746604562 746858239 747108579
2969.6G47108579L16918M28259M35352M13418M17054K93314J58012J80721K30849K74301
$$ 747108579 747425497 747853756 748289108 748702526 749119580 749412894 749570906 749751627 749982476 750256777
2990G50256777K33531o6579l43024m88878o90758p79033p76469q27313p59721n56886
$$ 750256777 750490308 750423729 750080705 749591827 748901069 748122036 747345567 746518254 745758533 745201647
3010.4G45201647n17368p45595r74416j039446j036405j015127j061082j191318j173615
$$ 745201647 744684279 743938684 742964268 741924822 740888417 739873290 738812208 737620890 736447275
3028.7G36447275j036704j009464j180470j373828j283764j140297j280785j517772
$$ 736447275 735410571 734401107 733220637 731846809 730563045 729422748 728141963 726624191
3045.1G26624191j583934j460910j414418j546741j583218j519680j534462j526535
$$ 726624191 725040257 723579347 722164929 720618188 719034970 717515290 715980828 714454293
3061.4G14454293j420319j308203j342058j545191j642763j477063j244306j185894
$$ 714454293 713033974 711725771 710383713 708838522 707195759 705718696 704474390 703288496
3077.7G03288496j384140j598536j602233j567662j581490j602888j679361j715541
$$ 703288496 701904356 700305820 698703587 697135925 695554435 693951547 692272186 690556645
3094F90556645j633942j526773j576841j749217j754761j605928j576721j747787j807988
$$ 690556645 688922703 687395930 685819089 684069872 682315111 680709183 679132462 677384675 675576687
3112.4F75576687j647771j640617j823306k027572k209365k198100k035558j952947
$$ 675576687 673928916 672288299 670464993 668437421 666228056 664029956 661994398 660041451
3128.7F60041451j996696k077937k084195j991809j977205k199650k379894k309144
$$ 660041451 658044755 655966818 653882623 651890814 649913609 647713959 645334065 643024921
3145F43024921k211809k092957j999200k207100k519250k557218k428234k367496k398133
$$ 643024921 640813112 638720155 636720955 634513855 631994605 629437387 627009153 624641657 622243524
3163.4F22243524k446831k432525k395928k431988k514065k538442k504051k455235
$$ 622243524 619796693 617364168 614968240 612536252 610022187 607483745 604979694 602524459
3179.7F02524459k433300k469659k503514k486527k494991k567947k596378k565563
$$ 602524459 600091159 597621500 595117986 592631459 590136468 587568521 584972143 582406580
3196E82406580k535104k480209k408445k368271k375901k431512k448738k370238k317786
$$ 582406580 579871476 577391267 574982822 572614551 570238650 567807138 565358400 562988162 560670376
3214.3E60670376k322257k309918k311409k331018k295375k254188k206326k032280
$$ 560670376 558348119 556038201 553726792 551395774 549100399 546846211 544639885 542607605
3230.7E42607605j888871k007723k171754k116204j961827j866579j783729j710593
$$ 542607605 540718734 538711011 536539257 534423053 532461226 530594647 528810918 527100325
3247E27100325j760066j806378j705408j603663j627267j679063j667440j648783j627863
$$ 527100325 525340259 523533881 521828473 520224810 518597543 516918480 515251040 513602257 511974394
3265.3E11974394j565516j510203j591205j733720j753390j718641j715719j726330
$$ 511974394 510408878 508898675 507307470 505573750 503820360 502101719 500386000 498659670
3281.6D98659670j736194j742601j732171j692503j664072j715422j857340k000243
$$ 498659670 496923476 495180875 493448704 491756201 490092129 488376707 486519367 484519124
3298D84519124j984537j783758j630068j746505k067954k289623k254814k135604k100587
$$ 484519124 482534587 480750829 479120761 477374256 475306302 473016679 470761865 468626261 466525674
3316.3D66525674k118707k107054k015710j965195k140879k306521k222151k114922
$$ 466525674 464406967 462299913 460284203 458319008 456178129 453871608 451649457 449534535
3332.6D49534535k060592j959443j983970k168536k286911k312392k195508j962274
$$ 449534535 447473943 445514500 443530530 441361994 439075083 436762691 434567183 432604909
3348.9D32604909j993895k255112k311796k120852j962602k006292k021701j770049
$$ 432604909 430611014 428355902 426044106 423923254 421960652 419954360 417932659 416162610
3365.3D16162610j609117j844287k149254k097189j759648j528621j486391j519531
$$ 416162610 414553493 412709206 410559952 408462763 406703115 405174494 403688103 402168572
3381.6D02168572j443267j176983q34256n59450o61134j035273j031369n14836j71929
$$ 402168572 400725305 399548322 398714066 398154616 397493482 396458209 395426840 394912004 394740075
3399.9C94740075n11587r39965p41094l13282j42664j44750k28584k49028m2647J43617
$$ 394740075 394228488 393288523 392547429 392234147 392091483 391946733 391718149 391469121 391426474 391570091
3420.3C91570091J61171L02494O23613Q83997Q62270Q54463J042157R71914O72400
$$ 391570091 391731262 392033756 392657369 393541366 394403636 395258099 396300256 397272170 397944570
3438.7C97944570O61373R88602J326710J487226J492202J553953J673787J755894J915484
$$ 397944570 398605943 399594545 400921255 402408481 403900683 405454636 407128423 408884317 410799801
3457D10799801K098561K021610J983494K361774K604396K236157J700551J670807K046764
$$ 410799801 412898362 414919972 416903466 419265240 421869636 424105793 425806344 427477151 429523915
3475.4D29523915K446175K529800K201169K115846K428591K453119K311319K463371
$$ 429523915 431970090 434499890 436701059 438816905 441245496 443698615 446009934 448473305
3491.7D48473305K640753K717883K681911K580047K557396K476484K369076K493829
$$ 448473305 451114058 453831941 456513852 459093899 461651295 464127779 466496855 468990684
3508D68990684K797156L029674K970219K718985K697379K952903L213763L093750K798795
$$ 468990684 471787840 474817514 477787733 480506718 483204097 486157000 489370763 492464513 495263308
3526.4D95263308K894014L207446L370404L422498L351450L244281L453851L683329
$$ 495263308 498157322 501364768 504735172 508157670 511509120 514753401 518207252 521890581
3542.7E21890581L575503L353417L360689L513396L635347L716647L779412L891468
$$ 521890581 525466084 528819501 532180190 535693586 539328933 543045580 546824992 550716460
3559E50716460L943920L721416L467619L982187M738152M620969M272997M288137M455686
$$ 550716460 554660380 558381796 561849415 565831602 570569754 575190723 579463720 583751857 588207543
3577.4E88207543M666209M880548M820644M518986M478038M931151N010069M832625
$$ 588207543 592873752 597754300 602574944 607093930 611571968 616503119 621513188 626345813
3593.7F26345813M977763N220413N219341N160093N063951M731953M648268M896999
$$ 626345813 631323576 636543989 641763330 646923423 651987374 656719327 661367595 666264594
3610F66264594N045771N197048N076647M902601N332470N380452M716516L964662L886223
$$ 666264594 671310365 676507413 681584060 686486661 691819131 697199583 701916099 705880761 709766984
3628.4G09766984M876375N065024M635036M338622M133225M001379L805041L361940
$$ 709766984 714643359 719708383 724343419 728682041 732815266 736816645 740621686 743983626
3644.7G43983626K803147K955854L941715L956854L268123L196597L337145K876997
$$ 743983626 746786773 749742627 753684342 757641196 760909319 764105916 767443061 770320058
3661G70320058K382576K207160J846075J398683J747489J805007J196087J659810K223909
$$ 770320058 772702634 774909794 776755869 778154552 779902041 781707048 782903135 784562945 786786854
3679.4G86786854J960755J488208P97332j88112p66516L21567J854539K497732K418995
$$ 786786854 788747609 790235817 791033149 790845037 790078521 790400088 792254627 794752359 797171354
3697.7G97171354K020300J742899J668930J366198P70390K42472M07279J192450J339316
$$ 797171354 799191654 800934553 802603483 803969681 804740071 804982543 805389822 806582272 807921588
3716.1H07921588R05753N03242L43978L82245N65469P56264M83095m8697j34945N00381
$$ 807921588 808827341 809330583 809674561 810056806 810622275 811378539 811861634 811812937 811677992 812178373
3736.5H12178373J070619P73489k18868p21574J90795L73661J6690P06374J159728
$$ 812178373 813248992 814022481 813803613 813082039 813272834 813646495 813663185 814369559 815529287
3754.8H15529287P10606K64764M33266N54085K52485P1347P6831L14891O10411M82857
$$ 815529287 816239893 816504657 816937923 817492008 817744493 817815840 817892671 818207562 818817973 819300830
3775.2H19300830J46747j1921J64330K71320K10166K93613L53098K40862J6570j83522
$$ 819300830 819447577 819435656 819599986 819871306 820081472 820375085 820728183 820969045 820985615 820802093
3795.6H20802093j27733k81930l90291L49640N04375K77698N39243N01216m0889m15146
$$ 820802093 820674360 820392430 820002139 820351779 820856154 821133852 821673095 822174311 822133422 821718276
3816H21718276j86861k42889n5313M93109L91543K90811J81496m9233n4062l05771
$$ 821718276 821531415 821288526 821233213 821726322 822117865 822408676 822590172 822540939 822486877 822181106
3836.4H22181106n29945M708M61758N94437N50091J72973n62132j414537m66228J109362
$$ 822181106 821651161 821655869 822117627 822712064 823262155 823435128 822872996 821458459 820992231 822101593
3856.8H22101593R29236K25842k34663j64330L9995k34902j50979L42608M95433M05372
$$ 822101593 823030829 823256671 823022008 822857678 822897673 822662771 822511792 822854400 823349833 823755205
3877.2H23755205p2062k25008J09971N7995Q6546K7060k41637Q2791L81112M17m85539
$$ 823755205 823683143 823458135 823568106 823626101 823712647 823739707 823498070 823580861 823961973 823962390 823476851
3899.6H23476851n49972j99139M12047O87837M27068J22368q7977k85625k30849N1856
$$ 823476851 822926879 822727740 823139787 823827624 824254692 824377060 824289083 824003458 823772609 823824465
3920H23824465J08123m9770r119Q4400l9518j3828K00808J80900M9651k5750o2883
$$ 823824465 823932588 823882818 823873699 823958099 823918581 823904753 824105561 824286461 824336112 824310362 824247479
3942.5H24247479J9372N2154r179M5597J58251J48415M1187j4067P749O7294J04367
$$ 824247479 824266851 824319005 824309826 824355423 824513674 824662089 824703276 824689209 824696958 824764252 824868619
3964.9H24868619M9115q464L874K3425O3419J26600P4387J1921O9618N1141o5208p6115
$$ 824868619 824917734 824909270 824913144 824936569 824999988 825126588 825200975 825212896 825282514 825333655 825268447 825192332
3989.4H25192332M6969J23739R2745P2121
$$ 825192332 825239301 825363040 825455785 825527906
3997.5H25527906
$$ 825527906
##END=$$ End of the data block
