##TITLE=$$ Begin of the data block
##JCAMP-DX=5.00 $$ ACD/SpecManager v 10.08
##SPECTROMETER/DATA SYSTEM=Alpha
##DATE=07 Apr 2014 11:14:18
##DATA TYPE=INFRARED SPECTRUM
##DATA CLASS=XYDATA
##ORIGIN=
##OWNER=
##NPOINTS=1765
##FIRSTX=399.75695801
##LASTX=3997.56933594
##MAXX=3997.56933594
##MINX=399.75695801
##MAXY=0.86594111
##MINY=0.39184687
##XFACTOR=1.0000000000
##YFACTOR=1.000000000000000e-9
##FIRSTY=0.68557078
##DELTAX=2.03957629
##XUNITS=1/CM
##YUNITS=ARBITRARY UNITS
##XYDATA=(X++(Y..Y))
399.8 685570776 685771763 685490012 684372067 683315814 682936847 682559907 681266487 679639816 678853631
418.1 678853631 679159164 679107368 677936852 676927328 677266955 677873731 677334964 676104069 675861716
436.5 675861716 676742017 676791310 675393343 674508333 675237000 675823390 674812853 673554957 673702180
454.8 673702180 674390078 673774958 672203302 671650290 672376990 672318101 670587540 669080317 669364691
473.2 669364691 669897139 668720722 666933119 666699708 667710066 667535365 665818572 665083170 666033566
491.5 666033566 666202307 664414883 662703097 662670374 663187921 662426651 660774946 660097241 660585642
509.9 660585642 660380661 658800066 657368124 657267392 657366335 656142056 654283822 653382301 653391778 652814150
530.3 652814150 651160359 649648011 649246812 649179101 648204267 646684825 645928979 645984888 645609498 644318521
550.7 644318521 643145442 642777801 642441690 641206622 639361978 638064325 637583852 636736631 634780288
569 634780288 632542253 631073713 630152404 628644288 626373351 624590397 623905778 623125136 621283531
587.4 621283531 619119644 617886007 617477775 616362989 614077926 612089813 611072302 609591603 606933475
605.8 606933475 604530752 603869796 604286730 603985429 603091955 603791893 606853724 610292554 612533867
624.1 612533867 614539564 617768586 621499240 624084949 625623047 627837896 631105840 633649468
640.4 633649468 634422779 634924591 637116730 640314221 642130554 642060101 642015874 643890083 647428155
658.8 647428155 650854707 653703868 656732678 660534799 663810194 665075898 666688979 669444799
675.1 669444799 672174156 673935413 675198615 676928699 679009020 680529594 681255519 681948781 683164835
693.5 683164835 684463799 685107648 685276270 685934067 687458456 688980043 689795554 690597296 692262232
711.8 692262232 694490075 696245611 697246015 698378921 700367332 702505291 703750670 704452872 705906272
730.2 705906272 708232522 709947228 710362852 710828185 712566853 714660466 715650082 716017008 717337847
748.5 717337847 719745755 721720755 722500205 723393798 725582421 727984309 728999197 729170203 730226159
766.9 730226159 732200325 733437300 733226418 732857466 733475864 734225035 733648777 732125580 731475472
785.2 731475472 732153773 732808471 732900977 733740032 736415982 740148485 743498147 746473074 750151038
803.6 750151038 754540682 758241653 760471582 762173653 764385641 766632020 767637670 767215431 766510725
821.9 766510725 766135573 765182793 762762964 759584010 757018983 755185902 753014445 750149488 747564256
840.3 747564256 745978594 744754136 743137300 741826594 742219329 744662583 748265862 752264440 756977260
858.7 756977260 762993872 769709706 775589824 780211151 784692764 789453208 793289781 795376837
875 795376837 796652496 798294842 799835145 800005615 798845232 797738373 797362924 796803117 795373499
893.3 795373499 794115424 794360220 795740724 796807528 797221839 798049867 799633801 800687909 800196111
911.7 800196111 798780918 797451258 796003640 793587685 790538013 788297236 787514508 787477016 787493169
930 787493169 787799418 788711190 789739311 790127635 789857686 789544344 789452612 789148092 788141847 786468267
950.4 786468267 784408450 781941116 778702676 774453700 769358933 763582706 756962597 749240100
966.8 749240100 740466177 731230736 722386897 714463890 707496941 701380312 696141601 691878676
983.1 691878676 688458562 685383976 682395220 679855049 678025961 676562011 675072432 673786461
999.4 673786461 673118651 672740459 671794713 669914544 667492628 664885283 661860287 658185005 654296041
1017.7 654296041 650839388 647796154 644601524 641086280 637763381 635039926 632626593 630072057
1034.1 630072057 627551854 625565112 624070227 622458160 620392084 618216872 616298497 614467978
1050.4 614467978 612517655 610787630 609914899 610031486 610412538 610291004 609549582 608306766 606341600
1068.7 606341600 603327990 599444211 595293820 591216743 586975753 582294703 577401936 572772622
1085 572772622 568441272 564088285 559807479 556284249 554085195 552993655 552338660 551788628 551488101
1103.4 551488101 551431954 551193237 550430000 549331307 548216820 546798766 544261634 540306449 535986364
1121.8 535986364 533041477 531974852 531849742 532304704 533318639 534276426 535086751 536323011 538345397
1140.1 538345397 540959001 543539345 545571387 547187805 548891783 550818980 552681923 554396451
1156.4 554396451 556408644 559230328 562901437 567141593 571911812 577446222 583693683 590113521
1172.7 590113521 596208334 602001011 607768178 613414526 618475497 622719169 626296818 629300535
1189.1 629300535 631477118 632640839 633164525 633751631 634847105 636478543 638601184 641294062 644451499
1207.4 644451499 647562861 650123179 652068555 653747261 655478835 657167435 658585429 659868181
1223.7 659868181 661400735 663284183 665216029 666974604 668769717 670897663 673234522 675346076
1240.1 675346076 677051544 678616107 680217028 681520998 682175338 682407975 682754040 683375239 683974385
1258.4 683974385 684494138 685433984 687162340 689399779 691638589 693904340 696690083 700043976 703379512
1276.8 703379512 706371188 709408879 712930977 716731250 720306158 723630130 727119207 730871856
1293.1 730871856 734352231 737123787 739514530 742025197 744480669 746339023 747609079 748837471
1309.4 748837471 750245929 751479626 752230167 752772331 753665686 754957795 756156385 757047892 757949173
1327.8 757949173 759083331 760103583 760537326 760465384 760396659 760685563 761146367 761441469 761697054 762216091
1348.1 762216091 762880623 763278842 763278484 763190746 763244748 763066471 762252152 761270404 760602951 760068893
1368.5 760068893 759445488 758458078 757235289 756371617 755534053 753889799 751626492 749884427 749161363
1386.9 749161363 748789847 748085737 746909082 745571494 744366109 742787063 740781426 738652229 736428380
1405.3 736428380 734357119 732245803 730028570 728292286 727135479 725726485 723806858 722620249
1421.6 722620249 722235084 722011924 721546829 720716834 720284700 720523775 720644951 720699608 721389771 722592890
1442 722592890 723949254 725175381 726442456 728358150 730913639 733585894 736567199 740879357 745640516
1460.3 745640516 749984145 754175186 758297801 762271106 766444862 771363139 776175797 780045927
1476.6 780045927 783324540 786142826 788295686 789508104 789905548 789853930 789755285 789527357 788549483
1495 788549483 786704361 784985721 783645391 782108843 779178917 774215102 770858884 768708706 766136587
1513.4 766136587 763293862 760787845 758775473 756314695 753993094 752384901 750910878 749619007
1529.7 749619007 747902095 745612442 744282603 743412077 741160929 738967717 738561034 738887429 739184380
1548 739184380 739101410 739073455 739428043 739758790 738880217 737650156 737859249 737879217 737015903 734897792
1568.4 734897792 731843829 729487121 726806581 722107291 717586815 713955879 709952354 705416739
1584.7 705416739 700333416 694897234 689498544 684196889 678659976 672987938 667515576 662216306
1601.1 662216306 656911790 651512384 645965934 640385568 635185599 630374670 624730289 618073523
1617.4 618073523 613447309 609822690 605102718 600443959 596495092 593214273 591151357 589525104
1633.7 589525104 587638021 587215424 588359058 589996755 591828287 594172478 597641110 601259112
1650 601259112 604898691 609958887 615042150 619636536 624353647 629495740 634994268 640128613 645416021
1668.4 645416021 651491404 657324374 663195908 669665873 675857246 681569517 687410712 694833100
1684.7 694833100 702318013 708820164 715288937 721188128 727220654 733960867 740848541 748660684
1701 748660684 755594254 761592746 767564535 772685170 776978314 780793965 784303367 787913442 791531563
1719.3 791531563 794700861 797595322 800348520 802655160 804575086 806279004 808085620 810258925
1735.7 810258925 812209129 813932955 815842152 817912281 819832444 821587920 823528349 825866878
1752 825866878 828012824 829670250 831106186 832496047 833912134 835273921 836323380 837076485 837750852
1770.3 837750852 838491797 839447677 840404212 841205776 841969728 842765629 843448758 844028890 844561875 844933748
1790.7 844933748 845341444 845946550 846541703 847071350 847649753 848209560 848635018 849016309 849461555 849923193
1811.1 849923193 850268900 850536227 850907564 851424396 851783454 851824582 851902366 852258503 852603137 852865815
1831.5 852865815 853174269 853538454 853966773 854263186 854228437 854073524 854382038 854972482 855288267 855370343
1851.9 855370343 855553746 855916262 856170356 856166661 856162131 856372297 856538415 856410265 856369019 856725395
1872.3 856725395 857179165 857425213 857435405 857400715 857530951 857768714 857842624 857675850 857650876 857929349
1892.7 857929349 858140588 858129084 858094215 858209074 858386457 858419180 858292699 858218849 858351111 858517468
1913.1 858517468 858452320 858214855 858171940 858331263 858385205 858331740 858315766 858384669 858479321 858465612 858334005
1935.5 858334005 858235836 858203769 858090758 857886612 857750177 857759416 857828796 857781768 857585311 857399821 857334971
1958 857334971 857297122 857143164 856897533 856714666 856681466 856653631 856467783 856234133 856162608 856209755 856125474
1980.4 856125474 855871975 855688035 855687261 855668128 855419517 855086565 854976773 855042100 854991615 854746878 854519248
2002.8 854519248 854497552 854518533 854311049 853937566 853703856 853679061 853587270 853301287 853047431 853008986
2023.2 853008986 853034556 852882385 852578402 852379322 852393687 852393687 852170169 851869762 851759613 851791382 851697564
2045.7 851697564 851427853 851220667 851209104 851203680 850996852 850714386 850629032 850692213 850599647 850337744 850216031
2068.1 850216031 850307047 850378752 850252748 850035727 849966586 850041687 850040793 849900007 849801421 849850416 849902093
2090.5 849902093 849797368 849636436 849623799 849740446 849771976 849656403 849565387 849604964 849651098 849554300 849423885
2113 849423885 849464238 849633694 849710166 849646389 849613607 849696636 849807858 849860847 849858999 849873781 849950135 850029707
2137.5 850029707 850067914 850094140 850147963 850232005 850304902 850342095 850368202 850427628 850527942 850626588 850691259
2159.9 850691259 850730836 850786746 850889266 851002157 851076424 851135433 851252019 851396739 851449668 851424515 851453424
2182.3 851453424 851573467 851683259 851710021 851701796 851756573 851891756 851974964 851927936 851881206 851948380 852037907
2204.8 852037907 852021575 851945281 851960540 852086544 852182925 852166891 852109253 852127314 852205634 852197111 852113485
2227.2 852113485 852130234 852249265 852312505 852249920 852163792 852182448 852258682 852257729 852169573 852133095 852226675 852313161
2251.7 852313161 852256298 852169096 852197945 852264464 852272809 852265477 852304935 852400303 852480769 852449656 852347612 852345347
2276.1 852345347 852473617 852564812 852544487 852554023 852720618 852969348 853121996 853163004 853272200 853556275
2296.5 853556275 853920341 854213536 854456484 854801238 855303705 855818748 856186926 856498241 856950521 857577801
2316.9 857577801 858264148 858862579 859340906 859847605 860423386 860895991 861137450 861245394 861393631 861554980
2337.3 861554980 861675918 861781776 861669540 860991538 860301375 860517025 861739576 863363743 864668727
2355.7 864668727 865464091 865849257 865941107 865691125 864958882 863881469 862752378 861700714 860680640
2374 860680640 859669149 858795345 858122349 857575476 857132375 856850505 856780469 856874585 856957257 856944025
2394.4 856944025 856957674 857089102 857258320 857347608 857353687 857362330 857408345 857447982 857443035 857412934 857431829 857533336
2418.9 857533336 857625365 857614875 857532859 857488513 857535899 857592642 857567847 857520998 857560635 857635736 857607365
2441.3 857607365 857476115 857386768 857406020 857432306 857380450 857322156 857361317 857458591 857473731 857339382 857183158
2463.8 857183158 857170641 857219815 857151985 857001305 856938541 856998563 857016563 856877387 856722236 856730103 856811345
2486.2 856811345 856755018 856566668 856454670 856503665 856536806 856401980 856226563 856203675 856268466 856220424 856055677
2508.7 856055677 855972528 856046677 856082141 855933130 855751872 855713189 855735302 855645180 855464816 855368674 855403781
2531.1 855403781 855415821 855275810 855094492 855054915 855100632 855035543 854844391 854698122 854675531 854659319 854550600
2553.5 854550600 854426384 854373515 854349732 854268789 854115427 853964329 853883445 853824437 853672147 853460371
2573.9 853460371 853343546 853304148 853181005 852950633 852728903 852580369 852452457 852274477 852051139 851826668
2594.3 851826668 851636529 851470947 851276875 851034522 850788414 850583136 850385427 850136697 849845171 849573731
2614.7 849573731 849337459 849078059 848775148 848495424 848274827 848041952 847742498 847431898 847171783 846948028
2635.1 846948028 846713185 846425653 846111059 845859110 845662057 845399916 845038593 844682634 844410002 844167471
2655.5 844167471 843879819 843593955 843386948 843198776 842936516 842620075 842321396 842062831 841805100 841542780
2675.9 841542780 841302097 841056228 840761364 840420067 840078533 839777231 839494944 839197099 838895857 838606477
2696.3 838606477 838308930 837971389 837629676 837323070 837001622 836657584 836326480 835991681 835649729 835314870
2716.7 835314870 834994137 834700286 834397852 834054589 833663702 833243668 832858801 832504451 832157612 831840158
2737.1 831840158 831535518 831215024 830860555 830493867 830190301 829918027 829549611 829097450 828686655 828359723
2757.5 828359723 828034401 827612996 827118278 826678634 826319277 825932026 825507283 825108290 824697614 824213147
2777.9 824213147 823656678 823064566 822509646 822065532 821684539 821197093 820567906 819957137 819431424 818868756
2798.3 818868756 818185866 817476213 816808224 816127419 815417230 814667761 813891172 813139319 812345207 811457276
2818.7 811457276 810592055 809810519 808996797 808048546 807022572 806036413 805077076 804002821 802724779
2837 802724779 801139474 799143076 796797752 794147074 791324079 788789928 786971211 785870135 785169661
2855.4 785169661 784630775 784145176 783508718 782563925 781354129 779967844 778547704 777264774 776045322
2873.7 776045322 774774134 773634970 772745371 771903157 770939231 769915879 768891573 767772675 766541004
2892.1 766541004 765289485 763994098 762606323 761178493 759732485 758247912 756714106 755052388
2908.4 755052388 753131866 750899315 748424470 745928764 743665338 741763771 740336359 739414215
2924.7 739414215 738936603 738814771 738816857 738909960 739352822 740207970 741334140 742662609 744115829 745449483
2945.1 745449483 746352255 746781170 746982455 746987879 746737957 746449888 746347070 746472359 746710598 746927917
2965.5 746927917 747129560 747403562 747810304 748277009 748697102 749137402 749595165 749877572 749997556 750152469
2985.9 750152469 750389934 750681162 750905931 750837684 750530183 750075221 749394476 748606861 747816265 746986330
3006.3 746986330 746230721 745683074 745177627 744445026 743464112 742384732 741318226 740299225 739254057
3024.7 739254057 738085806 736925602 735918224 734921694 733704746 732332826 731091261 729959965
3041 729959965 728664935 727133751 725569248 724151850 722761035 721227884 719633043 718049824 716457546
3059.3 716457546 714934826 713538229 712230742 710898221 709387720 707768440 706304669 705080271
3075.6 705080271 703889549 702471733 700851738 699253678 697689950 696098268 694496632 692835271
3092 692835271 691129684 689482450 687910855 686286449 684513450 682784855 681275249 679776728 678027689
3110.3 678027689 676188648 674530566 672917426 671118557 669097126 666912556 664726794 662652791
3126.6 662652791 660664976 658649206 656528771 654425263 652460754 650502622 648327231 645991802
3143 645991802 643681169 641427219 639303267 637299657 635119021 632618904 630044758 627599657 625233054
3161.3 625233054 622838080 620404422 617965460 615529716 613086462 610589445 608047783 605520010
3177.6 605520010 603056729 600630522 598149002 595638633 593178749 590717852 588173330 585590780
3193.9 585590780 583041728 580527544 578036785 575562894 573131979 570780039 568419814 565984666
3210.3 565984666 563552141 561173499 558837175 556535959 554273784 552012444 549724400 547437012
3226.6 547437012 545201182 543122172 541185617 539150715 536979318 534892380 532948554 531093061
3242.9 531093061 529318094 527574718 525767565 523937345 522229135 520633042 519005299 517326951
3259.2 517326951 515638709 513930559 512284100 510769069 509324372 507776797 506035864 504223764
3275.5 504223764 502429664 500664890 498946160 497248679 495523959 493798077 492141366 490513414
3291.8 490513414 488812715 486977607 484981209 482968539 481138855 479447126 477677912 475667626
3308.2 475667626 473445445 471194267 469030648 466896951 464750588 462672114 460697591 458718508
3324.5 458718508 456580341 454318821 452099800 449937254 447839260 445866555 443889737 441752523
3340.8 441752523 439485729 437170357 434972942 433018088 431026042 428752929 426414609 424254954
3357.1 424254954 422260702 420262009 418243080 416451037 414869159 413101077 410965621 408802420
3373.4 408802420 406986147 405447423 403986484 402513087 401102275 399930000 399084985 398519963 397876859
3391.8 397876859 396876752 395859212 395306110 395061105 394504279 393567979 392862827 392639816 392570287
3410.1 392570287 392411023 392152011 391895741 391846865 391999751 392182648 392471433 393058509 393916607 394784302
3430.5 394784302 395671487 396736711 397691309 398317814 398991436 400043815 401376426 402808577 404269993
3448.9 404269993 405810326 407471299 409270406 411229044 413305610 415284663 417249799 419632077
3465.2 419632077 422247142 424437940 426115930 427846372 429954022 432403445 434905022 437085509
3481.5 437085509 439190388 441596031 444056600 446405649 448861688 451458246 454139054 456798106
3497.8 456798106 459385365 461994648 464538097 466940433 469408065 472164929 475221217 478218049
3514.2 478218049 480913699 483614445 486567646 489749461 492869556 495728374 498602062 501744509
3530.5 501744509 505088687 508521199 511930704 515265107 518757820 522441745 526041985 529402435
3546.8 529402435 532717407 536172450 539768517 543450475 547204733 551117778 555105507 558865428
3563.1 558865428 562380433 566385984 571096301 575679779 579932034 584238291 588726819 593384445
3579.4 593384445 598277509 603174210 607733488 612184107 617119253 622186184 627051473 631998062
3595.7 631998062 637187421 642414868 647598267 652679980 657420278 662101269 667096972 672239363
3612.1 672239363 677423775 682426453 687287450 692608774 697983265 702714622 706739008 710692942
3628.4 710692942 715587676 720605493 725159407 729462028 733573794 737489760 741215944 744611561
3644.7 744611561 747577608 750684381 754539967 758346081 761602342 764850318 768177211 770997047
3661 770997047 773318529 775503993 777391315 778857052 780621648 782426059 783703506 785420001 787562907
3679.4 787562907 789406180 790845156 791645885 791475952 790768027 791109324 792907774 795375466 797812760
3697.7 797812760 799856007 801614046 803286433 804669559 805462420 805685699 806040049 807178915 808503985
3716.1 808503985 809470952 810057521 810422003 810800552 811343014 812078655 812643409 812733233 812680662 813115299
3736.5 813115299 814016581 814695656 814507067 813852072 814087451 814510345 814467371 814979374 816046119 816810787
3756.9 816810787 817136228 817543447 818045735 818291426 818406820 818532467 818841159 819405138 819886386 820085943
3777.3 820085943 820075154 820159674 820389211 820621848 820905387 821203947 821440339 821508586 821362436 821287990
3797.7 821287990 821125567 820801198 821075439 821504474 821778476 822326779 822791100 822663128 822174191 822030067
3818 822030067 821903527 821891725 822402477 822836399 823089421 823176682 823091567 823116779 822948933 822480023 822473407
3840.5 822473407 822887957 823387027 823865175 824043334 823531747 822152078 821675062 822784185 823735178
3858.8 823735178 823942065 823647559 823457897 823536754 823347867 823153317 823391914 823813438 824214995 824204564
3879.2 824204564 824029863 824155688 824228764 824313045 824342489 824108005 824154139 824487925 824495614 824076116 823591650
3901.7 823591650 823415160 823785365 824400365 824787438 824928343 824934065 824744880 824492872 824460268 824551523
3922.1 824551523 824555695 824578762 824656069 824638784 824637711 824806511 824961960 824989676 824942112 824841857 824829698
3944.5 824829698 824894965 824882448 824893177 825036466 825222433 825338066 825357020 825341225 825372040 825446010 825487435
3966.9 825487435 825478017 825464606 825486898 825604439 825782895 825858295 825886309 826008618 826089919 826020360 825953960
3989.4 825953960 826001525 826075435 826157331 826289654
3997.5 826289654
##END=$$ End of the data block
