##TITLE=$$ Begin of the data block
##JCAMP-DX=5.00 $$ ACD/SpecManager v 10.08
##SPECTROMETER/DATA SYSTEM=Alpha
##DATE=07 Apr 2014 11:14:18
##DATA TYPE=INFRARED SPECTRUM
##DATA CLASS=XYDATA
##ORIGIN=
##OWNER=
##NPOINTS=1765
##FIRSTX=399.75695801
##LASTX=3997.56933594
##MAXX=3997.56933594
##MINX=399.75695801
##MAXY=0.86525989
##MINY=0.39223439
##XFACTOR=1.0000000000
##YFACTOR=1.000000000000000e-9
##FIRSTY=0.68358052
##DELTAX=2.03957629
##XUNITS=1/CM
##YUNITS=ARBITRARY UNITS
##XYDATA=(X++(Y..Y))
399.8F83580518K1517l94404j031577j168848m06503J04785m07875j067579j125216
418.1F78104818m15266k05457p37905o09816L42906N94616m55380j281142l44932R63092
438.5F75955534K23041j257778p98523O92665N61238j028180j447678n5849N77807
456.9F73422277p07746j575827m35174R83119K51949j606047j492560L83794M77791
475.2F69701576j463651j967311k08676R91881k04027j608968p80880O86943J82748
493.6F65329635j437664j472831J7405N22673q30948j719237o26802N08547l51072
511.9F59939706j669764j261056R3401M7445j378953j838744p03454K4557q75056j986325
532.3F50391757j618266l02910l8088r32097j273871o25610o7294m16875j162052j148164
$$ y = [683580518, 683602035, 683207631, 682176054, 681007206, 680600703, 680705488, 680297613, 679230034, 678104818, 677689552, 677484095, 676746190, 676136374, 676479280, 677073896, 676618516, 675337374, 674992442, 675955534, 676178575, 674920797, 674122274, 674814939, 675376177, 674347997, 672900319, 672844470, 673422277, 672714531, 671138704, 670703530, 671686649, 671938598, 670332551, 668839991, 669223785, 669701576, 668237925, 666270614, 666061938, 667053819, 666849792, 665240824, 664459944, 665146887, 665329635, 663891971, 662419140, 662436545, 662959218, 662128270, 660409033, 659782231, 660290778, 659939706, 658269942, 657008886, 657102287, 657149732, 655770779, 653932035, 653228581, 653253138, 652378082, 650391757, 648773491, 648470581, 648432493, 647500396, 646226525, 645600915, 645533621, 645116746, 643954694, 642806530]
552.7F42806530m24027k44797j148760j957238j532972o77466r16123j932562k056956
571.1F31915629j198173q33749j557231k291203j773953o17385p07805j843930k084434
589.4F19007766j055717m27902j276374k309561j990437j089156j490533k642274k384663
607.8F04341149o09338M77135k63095r01580P09951L064573L405571K247632J921415
626.1F14393413L062785L740072K749443J668155K237439L293097K569318O44148M08113
644.5F34765983K334773L397405J872719j26243o1393J877964L469765L357291K831876
662.9F53720140L008426L769397L335417J329541J596391K753377K710939J711487
679.2F73935115J242519J724958K119959J616835P82848O38246J168728J334965O06954
$$ y = [642806530, 642382503, 642137706, 640988946, 639031708, 637498736, 636821270, 635905147, 633972585, 631915629, 630717456, 629883707, 628326476, 626035273, 624261320, 623643935, 622936130, 621092200, 619007766, 617952049, 617524147, 616247773, 613938212, 611947775, 610858619, 609368086, 606725812, 604341149, 603731811, 604208946, 603945851, 603044271, 603754222, 606818795, 610224366, 612471998, 614393413, 617456198, 621196270, 623945713, 625613868, 627851307, 631144404, 633713722, 634357870, 634765983, 637100756, 640498161, 642370880, 642244637, 642183244, 644061208, 647530973, 650888264, 653720140, 656728566, 660497963, 663833380, 665162921, 666759312, 669512689, 672223628, 673935115, 675177634, 676902592, 679022551, 680639386, 681422234, 682060480, 683229208, 684564173, 685171127]
697.5F85171127M8697O41048J599133J607955Q87215P79748J638234K310037J808822
715.9F96492016R38475J146734K134919K197624J145839N83411J431584K361119J738250
734.2G10169971M35889M68671J662195J985133R37938L74079J386762K452254J930535
752.6G21803427O98983Q34167K174735K397120J006842K06113J123846K023995J232922
771G33502150k67983l72887P19727P76708o85335j570403o04749P20501P02739J02639
791.4G33023107P82788K633035L726423L324747K933323L668428M389763L752172K323508
809.7G60557294J719534K216220K229512Q79705n13077o37889k71022r62556k455651
828.1G62762070l125191k519846j872718k226115k872645k521754j463532j151562
$$ y = [685171127, 685219824, 685860872, 687460005, 689067960, 689955175, 690734923, 692373157, 694683194, 696492016, 697430491, 698577225, 700712144, 702909768, 704055607, 704639018, 706070602, 708431721, 710169971, 710605860, 711074531, 712736726, 714721859, 715659797, 716033876, 717420638, 719872892, 721803427, 722502410, 723336577, 725511312, 727908432, 728915274, 729121387, 730245233, 732269228, 733502150, 733234167, 732861280, 733581007, 734357715, 733672380, 732101977, 731497228, 732217729, 732920468, 733023107, 733805895, 736438930, 740165353, 743490100, 746423423, 750091851, 754481614, 758233786, 760557294, 762276828, 764493048, 766722560, 767602265, 767089188, 766451299, 766180277, 765217721, 762762070, 759636879, 757117033, 755244315, 753018200, 750145555, 747623801, 746160269, 745008707]
844.4G45008707j660943j407921L42905K445519L566563L925145M727900O112218O697118
862.7G69757211N769313M613280M528046M749298L820777K110242J290560J633942
879.1G98272669J531363J29580j205146j078188l11315n19932j411676j256824J94729
897.4G94345260J287400J040638M78506Q71599J545429J005530m87148j389504j321614
915.8G97376096j457333k390504k997816k226412p92205n6982m0710K36868R00209
934.1G88551211J064837M19021k56240k94388o5863l13163j049161j720965k096712
952.5G84238577k472758l200829m207790n118490n840659o632149p674932q721114
968.8G40369856r197175q834303p941901o980479o112993n217731m238188l407896
$$ y = [745008707, 743347764, 741939843, 742282748, 744728267, 748294830, 752219975, 756947875, 763060093, 769757211, 775526524, 780139804, 784667850, 789417148, 793237925, 795348167, 796638727, 798272669, 799804032, 799933612, 798728466, 797650278, 797338963, 796819031, 795407355, 794150531, 794345260, 795632660, 796673298, 797151804, 798023403, 799568832, 800574362, 800087214, 798697710, 797376096, 795918763, 793528259, 790530443, 788304031, 787511826, 787454844, 787414134, 787651002, 788551211, 789616048, 790035069, 789778829, 789484441, 789418578, 789105415, 788056254, 786335289, 784238577, 781765819, 778564990, 774357200, 769238710, 763398051, 756765902, 749090970, 740369856, 731172681, 722338378, 714396477, 707415998, 701303005, 696085274, 691847086, 688439190]
985.1F88439190l062784l015101k625406j891971j457989j438439j250088o95705m06146
1003.5F72595561r22978j849950k410292k622307l067434l729105l928303l453195
1019.8F50611997l004372l159583l503263l298819k676070k381146k557337k538681
1036.1F27492726j971483j466155j636982k111495k185941j881122j762390j925886
1052.4F12551272j734436q57055J00732L31998j56164p42913j222193j966476l024638
1070.8F03280127l871083m146695m066348m182518m633069m898667m650891m328191
1087.1E68502665m322708m254580l526151k217710j098037o47306n42998k98381o1929
1105.4E51532865k50996p69317j103937j125098j409292k507269l944159m303574k919615
$$ y = [688439190, 685376406, 682361305, 679735899, 677843928, 676385939, 674947500, 673697412, 673001707, 672595561, 671672583, 669822633, 667412341, 664790034, 661722600, 657993495, 654065192, 650611997, 647607625, 644448042, 640944779, 637645960, 634969890, 632588744, 630031407, 627492726, 625521243, 624055088, 622418106, 620306611, 618120670, 616239548, 614477158, 612551272, 610816836, 609959781, 610060513, 610392511, 610236347, 609493434, 608271241, 606304765, 603280127, 599409044, 595262349, 591196001, 587013483, 582380414, 577481747, 572830856, 568502665, 564179957, 559925377, 556399226, 554181516, 553083479, 552436173, 551893175, 551594794, 551532865, 551281869, 550512552, 549408615, 548283517, 546874225, 544366956, 540422797, 536119223, 533199608]
1123.8E33199608j135051k58148M05133J060248J018047Q48234J245617K001703K599597
1142.2E40984988K594769K045214J606048J670599J892030J868188J744747K011836
1158.5E56418419K808094L654838M202008M770636N596161O296456O400764O029487
1174.8E96176863N752384N761207N640506N043567M217982L566503K988220K125322
1191.1F31272554J126409N53787O32643J100958J617789K101898K670408L163099L147006
1209.5F47386551K575457J917481J643956J715601J711189J478792J325547J522959
1225.8F61277533J864790J946331J788735J816153K142013K355098K124131J698017
1242.1F77012801J551569J592934J306891O70254K61069L88920O41406N69224M68850
$$ y = [533199608, 532064557, 531806409, 532211542, 533271790, 534289837, 535138071, 536383688, 538385391, 540984988, 543579757, 545624971, 547231019, 548901618, 550793648, 552661836, 554406583, 556418419, 559226513, 562881351, 567083359, 571853995, 577450156, 583746612, 590147376, 596176863, 601929247, 607690454, 613330960, 618374527, 622592509, 626159012, 629147232, 631272554, 632398963, 632952750, 633585393, 634686351, 636304140, 638406038, 641076446, 644239545, 647386551, 649962008, 651879489, 653523445, 655239046, 656950235, 658429027, 659754574, 661277533, 663142323, 665088654, 666877389, 668693542, 670835555, 673190653, 675314784, 677012801, 678564370, 680157304, 681464195, 682134449, 682395518, 682784438, 683425844, 683995068, 684463918]
1260.4F84463918R02772J706362K229512K251804K267956K752185L333569L351330
1276.8G03259408K989710L011107L502310L778934L565073L364146L539383L738284
1293.1G30748355L443838K769172K391755K506912K478302J911640J299977J219571
1309.4G48769522J407444J240492P53105N67257R46224J324117J173139Q55207R15349
1327.8G57951856J172483J031637M21166o8009l5882K91348M10080K30551K20239N48959
1348.1G62174428P14957L99888j5140o2704Q9228j63495q00729r75430o77645n45085
1368.5G60138273o28769r92417j250089r00447q44777j646042k269268j727521p04289
1386.9G49174654l75032p13527j168192j311302j186549j600028k036929k111673k175272
$$ y = [684463918, 685366690, 687073052, 689302564, 691554368, 693822324, 696574509, 699908078, 703259408, 706249118, 709260225, 712762535, 716541469, 720106542, 723470688, 727010071, 730748355, 734192193, 736961365, 739353120, 741860032, 744338334, 746249974, 747549951, 748769522, 750176966, 751417458, 752170563, 752737820, 753684044, 755008161, 756181300, 757036507, 757951856, 759124339, 760155976, 760577142, 760509133, 760473251, 760764599, 761174679, 761405230, 761625469, 762174428, 762889385, 763289273, 763274133, 763211429, 763300657, 763137162, 762336433, 761361003, 760683358, 760138273, 759509504, 758517087, 757266998, 756366551, 755521774, 753875732, 751606464, 749878943, 749174654, 748799622, 748086095, 746917903, 745606601, 744420052, 742820024, 740783095, 738671422, 736496150]
1405.3G36496150k049803k117396k221048j731157j145482j393795j913309j175940
1421.6G22748220l58641k40088n46932q93354m20571K85149J46151K6106O59645J211345
1442G22617030J370430J197994J203954J888394K588988K739668L053486M317522M693329
1460.3G45670795M283488M191935M175127M016220M194141M912913M777789L838718
1476.6G80061126L263771K807081K144575J226783M49717Q941q5295k53379j001835
1495G88621485j852929j735211j364827j527607k876640m896283l340423k186477k601028
1513.4G66240060k820015k467095j992226k447844k324462j637995j515031j311481
1529.7G49723911j707017k270401j315713q53598k255141k227366l96967L54826L09289
$$ y = [736496150, 734446347, 732328951, 730107903, 728376746, 727231264, 725837469, 723924160, 722748220, 722389579, 722149491, 721602559, 720709205, 720288634, 720573783, 720719934, 720746040, 721405685, 722617030, 723987460, 725185454, 726389408, 728277802, 730866790, 733606458, 736659944, 740977466, 745670795, 749954283, 754146218, 758321345, 762337565, 766531706, 771444619, 776222408, 780061126, 783324897, 786131978, 788276553, 789503336, 789953053, 789961994, 789876699, 789623320, 788621485, 786768556, 785033345, 783668518, 782140911, 779264271, 774367988, 771027565, 768841088, 766240060, 763420045, 760952950, 758960724, 756512880, 754188418, 752550423, 751035392, 749723911, 748016894, 745746493, 744430780, 743577182, 741322041, 739094675, 738697708, 739052534, 739361823]
1548G39361823n3168K742L43800L16083q63135j182496K46048J8656q84116k132654
1568.4G35173583l061473k365351k702057m729808m528522l629268m010736m535258
1584.7G05611110n067647n431473n412519n308986n557775n733729n529344n321562
1601.1F62248075n324125n428970n544126n535066n161822m822731n714536o740272
1617.4F17976427m652202l596366m665136m626512l943921l277301k067685j650513
1633.7E89496791j917123m43578J134634J658320J870692K367914L457427L577232
1650F01202309L581882N063414N139649M642308M781067N208373N530298N146384N307615
1668.4F45603299O100059N841314N882383O487548O191850N702913N860150P448434
$$ y = [739361823, 739308655, 739311397, 739655197, 739971280, 739108145, 737925649, 738171697, 738190353, 737306237, 735173583, 732112110, 729746759, 727044702, 722314894, 717786372, 714157104, 710146368, 705611110, 700543463, 695111990, 689699471, 684390485, 678832710, 673098981, 667569637, 662248075, 656923950, 651494980, 645950854, 640415788, 635253966, 630431235, 624716699, 617976427, 613324225, 609727859, 605062723, 600436211, 596492290, 593214989, 591147304, 589496791, 587579668, 587136090, 588270724, 589929044, 591799736, 594167650, 597625077, 601202309, 604784191, 609847605, 614987254, 619629562, 624410629, 629619002, 635149300, 640295684, 645603299, 651703358, 657544672, 663427055, 669914603, 676106453, 681809366, 687669516, 695117950]
1684.7F95117950P435918O433010O435156N911172O070494O788016O940484P811308
1701G48943508O862580N930365N933582N115629M316568L858268L547669L590583L582120
1719.3G91680872L177882K895891K726853K294302J943767J745820J841009K158940
1735.7H10465336J912236J699865J892865K080440J970589J783192J897872K277732
1752H25980127K133012J694798J471818J389444J394629J337528J038373P57932O93560
1770.3H37891221P67052R64463R28342P72953P75755P95007O31868N48423N75244M52876
1790.7H45103204M28021N41628N49137N42462N99384N50270L97921L57688M37557M48704
1811.1H49955976L31759K75732L85642N29050L78967O5624Q0705L46780L55065K64704
$$ y = [695117950, 702553868, 708986878, 715422034, 721333206, 727403700, 734191716, 741132200, 748943508, 755806088, 761736453, 767670035, 772785664, 777102232, 780960500, 784508169, 788098752, 791680872, 794858754, 797754645, 800481498, 802775800, 804719567, 806465387, 808306396, 810465336, 812377572, 814077437, 815970302, 818050742, 820021331, 821804523, 823702395, 825980127, 828113139, 829807937, 831279755, 832669199, 834063828, 835401356, 836439729, 837197661, 837891221, 838658273, 839622736, 840551078, 841324031, 842099786, 842894793, 843526661, 844075084, 844650328, 845103204, 845531225, 846072853, 846621990, 847164452, 847763836, 848314106, 848712027, 849069715, 849507272, 849955976, 850287735, 850563467, 850949109, 851478159, 851857126, 851922750, 852003455, 852350235, 852705300, 852970004]
1831.5H52970004L03269L68535M10140K70783k3245j16408L19660N54382K87056R9838
1851.9H55444014K11597L51429K15172j4603J5378K31207J88708j16646m6313L68118
1872.3H56848061M70400K16961n0962m6075J81318K83420Q3268j76967l3617K81275
1892.7H58057082K05099n5372q0169J24276K24292N4241j52231r2983J67966K13563
1913.1H58665764n7697k47002m1902J43528K3008p6354k7060P6234J12116o437j37746
1935.5H58426452j16825n0068j05501j78933j18017Q762O6280m7922k24471k17557
1955.9H57442200p3552l4630j48833k54095j87993n185P748j76310k47181r6261J1086
1978.4H56236994j14917k47300j60217P450p748k36571l29972r1672Q8036n7756k72274
$$ y = [852970004, 853273273, 853641808, 854051948, 854322731, 854299486, 854183078, 854502738, 855057120, 855344176, 855444014, 855655611, 856007040, 856222212, 856207609, 856222987, 856454194, 856642902, 856526256, 856479943, 856848061, 857318461, 857535422, 857484460, 857438385, 857619703, 857903123, 857986391, 857809424, 857775807, 858057082, 858262181, 858206809, 858126640, 858250916, 858475208, 858529449, 858377218, 858284235, 858452201, 858665764, 858608067, 858361065, 858319163, 858462691, 858485699, 858409345, 858382285, 858458519, 858570635, 858564198, 858426452, 858309627, 858259559, 858154058, 857975125, 857857108, 857865870, 857932150, 857884228, 857659757, 857442200, 857368648, 857334018, 857185185, 856931090, 856743097, 856737912, 856745660, 856569350, 856322169, 856225908, 856236994, 856122077, 855874777, 855714560, 855722010, 855714262, 855477691, 855147719, 855056047, 855144083, 855086327, 854814053]
2000.8H54814053k40028j7226K3365k07841l45409j87993k4558j22845k86936k31743
2021.2H53172839l3140p213k08258l25322j69158L1173k4498k33948k58982o5446J6391
2043.6H51894438j38819k76446j80602J3053j132k15233k72274p1287N2094r9957k66611
2066.1H50437224j41680J03235J05560j14918k06888n8353N4598m3511j53959p5161
2086.5H49906147N7339L3200j16169j56045P450J39892K6405j26600o9261N0426J5080
2108.9H49767864j04726j12474K9445J39296N5909n5015o199J05679J25647M4525j9074
2131.3H49970877J6749Q1301O6519J8239K1696O7949R9301P7486L6061L3021P3433
2153.8H50562632J01268R2447O1214K8134M0829R1254J11580R6381R2387J24455J20401
$$ y = [854814053, 854574025, 854556799, 854580164, 854372323, 854026914, 853838921, 853814363, 853691518, 853404582, 853172839, 853139699, 853132486, 852924228, 852598906, 852429748, 852460921, 852436423, 852202475, 851943493, 851878047, 851894438, 851755619, 851479173, 851298571, 851311624, 851310492, 851095259, 850822985, 850751698, 850803792, 850703835, 850437224, 850295544, 850398779, 850504339, 850389421, 850182533, 850124180, 850178778, 850135267, 849981308, 849906147, 849963486, 849996686, 849880517, 849724472, 849731922, 849871814, 849898219, 849771619, 849702358, 849752784, 849767864, 849663138, 849550664, 849580109, 849719405, 849775314, 849720299, 849714100, 849819779, 849945426, 849989951, 849970877, 849987626, 850068927, 850135446, 850153685, 850175381, 850243330, 850342631, 850420117, 850456178, 850489199, 850562632, 850663900, 850756347, 850817561, 850845695, 850886524, 850977778, 851089358, 851185739, 851278126, 851402581, 851522982]
2176.2H51522982K7895l3855M3392J59919J42455J5199l7312N6922J41383O7830m3989
2198.6H52062821k2709O7711O6042j9074m7087M1008J22726O8962m5776o7949L4570
2221.1H52261245R7811j5139j09911j490J21176O9737n3703p2480K4856Q7142K7060
2243.5H52436304n6624k2889Q2553N4598r5308j00791M9948R1315J0907k9087J4186
2265.9H52435112Q8334Q6844j6093q8394j0788R6976P9334K2471P3373J94490K33055
2288.4H53194714J35302M7684J15394K58923L22223K58088K21789L56853N11527M91798
2308.8H55914295L60965L14355L98040N26607O17445N83470M60922M18544M27604L63707
2329.2H60385954K37584J79649K11775J81139J21474R6321j02937n87046n66781K38836
$$ y = [851522982, 851550877, 851517022, 851560414, 851720333, 851862788, 851877987, 851840675, 851897597, 852038980, 852106810, 852062821, 852040112, 852107823, 852173865, 852154791, 852107704, 852148712, 852271438, 852340400, 852294624, 852226675, 852261245, 852359056, 852343917, 852234006, 852232516, 852353692, 852423429, 852369726, 852297246, 852322102, 852409244, 852436304, 852379680, 852356791, 852439344, 852493942, 852398634, 852297843, 852347791, 852439106, 852450013, 852420926, 852435112, 852523446, 852610290, 852594197, 852505803, 852495015, 852591991, 852671325, 852693796, 852767169, 852961659, 853194714, 853330016, 853377700, 853493094, 853752017, 854074240, 854332328, 854554117, 854910970, 855422497, 855914295, 856275260, 856589615, 856987655, 857514262, 858131707, 858715177, 859176099, 859594643, 860022247, 860385954, 860623538, 860803187, 861014962, 861196101, 861317575, 861413896, 861310959, 860723913, 860157132, 860395968]
2349.6H60395968J125097J519323J260638P08103K49147J610k82586o52790q97705
2367.9H63426805r61781r20594r13381r34244q15033o09875m84109m15504k92480p5340
2388.3H57004464J06156Q3684j4662L3200J42514J42753N2214n96L9935P2539L2067
2410.8H57694268l1352m3511K9206Q4758L5703l0041l6835J2874P3374M8339m2200
2433.2H57794583p7367k0325L7372p868r1195p7724J9550N0068m8757j01149N841J09017
2457.7H57592046K3306j75536j79648M0650J09732p0095j76966o1393P8559K4557j34170
2480.1H57071042j32859L338J6511j17004j86086p3969Q2075L5346j52230j55092J8299
2502.5H56409371N2571r2923j72317o8367O3419J7107j53482j91867l9638N5671n5849
$$ y = [860395968, 861521065, 863040388, 864301026, 865009129, 865258276, 865259886, 864977300, 864324510, 863426805, 862465024, 861544430, 860631049, 859696805, 858881772, 858271897, 857787788, 857372284, 857079804, 857004464, 857110620, 857194304, 857179642, 857212842, 857355356, 857498109, 857550323, 857549727, 857589662, 857662201, 857694268, 857662916, 857619405, 857648611, 857733369, 857769072, 857739031, 857702196, 857715070, 857788444, 857836783, 857794583, 857717216, 857696891, 857734263, 857726395, 857635200, 857557476, 857577026, 857627094, 857578337, 857477188, 857483029, 857592046, 857615352, 857439816, 857260168, 857300818, 857410550, 857340455, 857163489, 857102096, 857180655, 857205212, 857071042, 856938183, 856941521, 856958032, 856841028, 856654942, 856580973, 856663048, 856698394, 856546164, 856391072, 856409371, 856461942, 856369019, 856196702, 856128335, 856191754, 856208861, 856055379, 855863512, 855823874, 855879545, 855823696]
2525H55823696j71543r2864M7863J4186j41621j72853n1379J5020o7830j62006j27315
2547.4H54913354k5392k0384j18018j39176n4956k6584j04308j74105j45674p0691
2567.8H54034066m8935j23859j87099j24454p8917j55806k18809j83940j29342j30057
2588.2H52652848j67191k05398k23398j94311j69754k11180k66969k63869k14875k00033
2608.6H50535870k32280k69293k73228k31981k41220l10779k91765j93298k13086l43561
2629H47935379l67344k89738k34425k11299k40624l02493l00348k39253k37465l00526
2649.4H45211864l12984k81871k86996k90811k34902j79589k13385l01480l32117k79784
2669.8H42497945k42353k71141k92063k73585k48015k56896l10183l24964k79010k70605
$$ y = [855823696, 855652153, 855559289, 855607152, 855621338, 855479717, 855306864, 855255485, 855270505, 855202675, 855040669, 854913354, 854887962, 854867578, 854749560, 854610384, 854555428, 854528844, 854424536, 854250431, 854104757, 854034066, 853985131, 853861272, 853674173, 853549719, 853470802, 853314996, 853096187, 852912247, 852782905, 852652848, 852485657, 852280259, 852056861, 851862550, 851692796, 851481616, 851214647, 850950778, 850735903, 850535870, 850303590, 850034297, 849761069, 849529088, 849287868, 848977089, 848685324, 848492026, 848278940, 847935379, 847568035, 847278297, 847043872, 846832573, 846591949, 846289456, 845989108, 845749855, 845512390, 845211864, 844898880, 844617009, 844330013, 844039202, 843804300, 843624711, 843411326, 843109846, 842777729, 842497945, 842255592, 841984451, 841692388, 841418803, 841170788, 840913892, 840603709, 840278745, 839999735, 839729130]
2690.2H39729130l17931l41535l22043l16620l34978l22462k91645k96831l18289l38435
2710.6H36528361l56794l40044l23594l28421l02196k74241l06725l97444m38988l86417
2731H33073497l57211l67880l42548k94685k96116l37004l24905k69473k87473l92258
2751.4H29803944m59910m17292l52323l50833m18425m86075m30823l40104l77059m36246
2771.8H25734854l94106l80874m86314n95451o06596n11289m08411m19378n36680o29187
2792.2H20766568n75006m64856n41807p49409p81119o69121o45400o97016p42019p58707
2812.5H14142108p47025p84576q66830q59321q01324q52585r59516r67204r10640r52482
2832.9H05440605j126945j321018j582205j975239k346039k637803k782703k539277
$$ y = [839729130, 839411199, 839069664, 838747621, 838431001, 838096023, 837773561, 837481916, 837185085, 836866796, 836528361, 836171567, 835831523, 835507929, 835179508, 834877312, 834603071, 834296346, 833898902, 833459914, 833073497, 832716286, 832348406, 832005858, 831711173, 831415057, 831078053, 830753148, 830483675, 830196202, 829803944, 829344034, 828926742, 828574419, 828223586, 827805161, 827319086, 826888263, 826548159, 826171100, 825734854, 825340748, 824959874, 824473560, 823878109, 823271513, 822760224, 822351813, 821932435, 821395755, 820766568, 820191562, 819726706, 819184899, 818435490, 817654371, 816985250, 816339850, 815642834, 814900815, 814142108, 813395083, 812610507, 811743677, 810884356, 810083032, 809230447, 808270931, 807303727, 806393087, 805440605, 804313660, 802992642, 801410437, 799435198, 797089159, 794451356, 791668653, 789129376]
2849.3G89129376j883328j168847p21573m89355m13835o05166r44793j233697j428902
2867.6G80239880j438618j275241j213431j283288j164735q92162q16584r33945j018524
2886G70203352j047492j118839j232803j281619j281380j336217j390159j418531j471878
2904.3G58624434j539289j685858j956225k266943k496243k506435k275109j903772
2920.6G41994560j406670q84890m67837j59443m0590R1970M90605Q98719J128614J314521
2941G42959559J459539J352310R06289M26292J92821O914k19345k58982q4817J48356
2961.4G46888936K54988K21789K05338K50101L59655M54545M37259M53294M81486L13103
2981.8G50320494J16289J34229K54512L37601K56300r0063l85761n14150o69181p43568
$$ y = [789129376, 787246048, 786077201, 785355628, 784866273, 784452438, 783847272, 782902479, 781668782, 780239880, 778801262, 777526021, 776312590, 775029302, 773864567, 772972405, 772155821, 771221876, 770203352, 769155860, 768037021, 766804218, 765522599, 764241219, 762905002, 761514843, 760096312, 758624434, 757085145, 755399287, 753443062, 751176119, 748679876, 746173441, 743898332, 741994560, 740587890, 739703000, 739235163, 739075720, 739035130, 739127100, 739617705, 740516424, 741645038, 742959559, 744419098, 745771408, 746677697, 747103989, 747296810, 747303724, 747084379, 746825397, 746740580, 746888936, 747143924, 747365713, 747571051, 747821152, 748180807, 748635352, 749072611, 749525905, 750007391, 750320494, 750436783, 750571012, 750825524, 751163125, 751419425, 751329362, 750943601, 750429451, 749760270, 749016702]
3002.2G49016702p63714q20935p47979n55873n28872p49766r69112j029313j005113
3020.6G41846025r72152j048922j209438j181185j035393j022935j174986j313508
3036.9G32887506j220107j128614j316726j565218j588762j432478j413047j559496
3053.2G21663058j587033j528144j518786j507461j444698j328230j325488j525342
3069.5G09897876j651108j501143j234055j150072j366078j594961j622081j598418
3085.8F98179960j574933j571477j663327j717627j643121j547992j593709j755357
3102.2F85112417j756132j586914j551390j727938j773417j585782j589775j827836
3118.5F71713233k049148k227426k238929k056897j908540j953543k116262k141476
$$ y = [749016702, 748252988, 747432053, 746684074, 746128201, 745599329, 744849563, 743880451, 742851138, 741846025, 740873873, 739824951, 738615513, 737434328, 736398935, 735376000, 734201014, 732887506, 731667399, 730538785, 729222059, 727656841, 726068079, 724635601, 723222554, 721663058, 720076025, 718547881, 717029095, 715521634, 714076936, 712748706, 711423218, 709897876, 708246768, 706745625, 705511570, 704361498, 702995420, 701400459, 699778378, 698179960, 696605027, 695033550, 693370223, 691652596, 690009475, 688461483, 686867774, 685112417, 683356285, 681769371, 680217981, 678490043, 676716626, 675130844, 673541069, 671713233, 669664085, 667436659, 665197730, 663140833, 661232293, 659278750, 657162488, 655021012]
3134.8F55021012j997590j968801k185107k358317k306521k216577k118051k024234
3151.1F37845814k178311k495766k592385k489030k412915k377987k378166k414822
3167.4F18506432k440751k446473k472698k495230k508878k508283k472579k468884
3183.7E98692656k488077k494335k530933k574205k563477k547919k547265k490162
3200.1E78456283k414644k389848k384246k411902k445340k409756k349377k295434
3216.4E59355736k264977k283036k303243k287984k265096k230227k101958j958370
3232.7E41660845k036929k180695k113820j977324j893580j791835j721382j768410
3249E26176870j778484j664340j598775j647532j691342j712262j731337j657366j511574
$$ y = [655021012, 653023422, 651054621, 648869514, 646511197, 644204676, 641988099, 639870048, 637845814, 635667503, 633171737, 630579352, 628090322, 625677407, 623299420, 620921254, 618506432, 616065681, 613619208, 611146510, 608651280, 606142402, 603634119, 601161540, 598692656, 596204579, 593710244, 591179311, 588605106, 586041629, 583493710, 580946445, 578456283, 576041639, 573651791, 571267545, 568855643, 566410303, 564000547, 561651170, 559355736, 557090759, 554807723, 552504480, 550216496, 547951400, 545721173, 543619215, 541660845, 539623916, 537443221, 535329401, 533352077, 531458497, 529666662, 527945280, 526176870, 524398386, 522734046, 521135271, 519487739, 517796397, 516084135, 514352798, 512695432, 511183858]
3267.4E11183858j432836j551926j745284j796722j756311j700580j684904j738816
3283.7D97776479j795084j768052j641810j584679j716495j900047k010733j988053
3300D83371526j815706j670957j760721k026141k242804k284705k181143k097487k100080
3318.4D65191782k095312k036065k013117k145857k253354k183288k115279k078295
3334.7D48271215k002776k039164k202272k267212k234936k144128j969337j989216
3351D31422174k261937k370983k184689k008289k005518j962870j728177j598328j812220
3369.3D13489163k153695k171695j829386j587540j510143j456529j375049j178503
3385.7D00226623q71897n65797n94914r60529j038343n78492k10226m96954r24140
$$ y = [511183858, 509751022, 508199096, 506453812, 504657090, 502900779, 501200199, 499515295, 497776479, 495981395, 494213343, 492571533, 490986854, 489270359, 487370312, 485359579, 483371526, 481555820, 479884863, 478124142, 476098001, 473855197, 471570492, 469389349, 467291862, 465191782, 463096470, 461060405, 459047288, 456901431, 454648077, 452464789, 450349510, 448271215, 446268439, 444229275, 442027003, 439759791, 437524855, 435380727, 433411390, 431422174, 429160237, 426789254, 424604565, 422596276, 420590758, 418627888, 416899711, 415301383, 413489163, 411335468, 409163773, 407334387, 405746847, 404236704, 402780175, 401405126, 400226623, 399354726, 398788929, 398194015, 397233486, 396195143, 395616651, 395406425, 394909471, 393985331]
3404C93985331p32422k73138r9361j18077k16633k53797n7518J23799J64240L50684
3424.4C92873108O56695Q46058Q14289Q48591J087934J042962P06881O68824R94384
3442.8D00539726J294136J408547J435280J540005J690239J790315J926124K086699
3459.1D13711071K017856J991689K355128K601594K260029J714051J674414K052784
3475.4D30378616K433002K485752K163440K098441K409399K483755K364695K458841
3491.7D49275941K610981K675384K630592K576560K587586K495289K400041K524852
3508D69777226K800763L059268L005385K711475K684862K938360L217697L166079K861500
3526.4D96222615K834827L087014L343880L516793L457010L280699L463269L742456
$$ y = [393985331, 393252909, 392979771, 392880410, 392762333, 392545700, 392291903, 392234385, 392358184, 392522424, 392873108, 393529803, 394375861, 395190150, 396038741, 397126675, 398169637, 398876518, 399545342, 400539726, 401833862, 403242409, 404677689, 406217694, 407907933, 409698248, 411624372, 413711071, 415728927, 417720616, 420075744, 422677338, 424937367, 426651418, 428325832, 430378616, 432811618, 435297370, 437460810, 439559251, 441968650, 444452405, 446817100, 449275941, 451886922, 454562306, 457192898, 459769458, 462357044, 464852333, 467252374, 469777226, 472577989, 475637257, 478642642, 481354117, 484038979, 486977339, 490195036, 493361115, 496222615, 499057442, 502144456, 505488336, 509005129, 512462139, 515742838, 519206107, 522948563]
3542.7E22948563L648162L327310L281474L490150L647089L705442L755987L910899
3559E51715076M006088L775477L509998L996015M686117M562557M275501M341841M492104
3577.4E89360774M676222M927755M910648M597604M481673M859805M952848M853487
3593.7F27620816N051255N259455N220294N183100N111218M785478M702091M927814
3610F67861521N069912N201399N040765M867971N298674N377889M793286M086494L947139
3628.4G11545050M795432M927993M526019M311502M156828L991544L790260L452778
3644.7G45497406L018260L076791L761709L736496L181517L202558L363490K859711
3661G71697938K331078K182663J867115J463056J792431J819253J265943J650155K066493
$$ y = [522948563, 526596725, 529924035, 533205509, 536695659, 540342748, 544048190, 547804177, 551715076, 555721164, 559496641, 563006639, 567002654, 571688771, 576251328, 580526829, 584868670, 589360774, 594036996, 598964751, 603875399, 608473003, 612954676, 617814481, 622767329, 627620816, 632672071, 637931526, 643151820, 648334920, 653446138, 658231616, 662933707, 667861521, 672931433, 678132832, 683173597, 688041568, 693340242, 698718131, 703511417, 707597911, 711545050, 716340482, 721268475, 725794494, 730105996, 734262824, 738254368, 742044628, 745497406, 748515666, 751592457, 755354166, 759090662, 762272179, 765474737, 768838227, 771697938, 774029016, 776211679, 778078794, 779541850, 781334281, 783153534, 784419477, 786069632, 788136125]
3679.4G88136125J823544J445353Q18551j26541p09772K95997J805424K502442K444923
3697.7G98436046K005994J679420J638711J444578Q91388K59757L01182J134515J341819
3716.1H09133410R14515N58912M21465M11749N19096O89030N02348M7386o4016M11034
3736.5H13544929Q98778P61509n1260n58674K58327M23729o2406N10573J089394P30217
3756.9H17545116K26498L21149M75347K64943J41204J31905K89082N43535M58181J77800
3777.3H20574760N2095J90556K43962J76072K47776L02554K35259N5552j39296o0142
3797.7H21879148j65164l10242L26395M33445J60873M40895M79997m1306m10736r5725
3818H22697580j06394l7790M53770L73483K35379J59561L5108P9929j82926m77553
$$ y = [788136125, 789959669, 791405022, 792223573, 792097032, 791387260, 791683257, 793488681, 795991123, 798436046, 800442040, 802121460, 803760171, 805204749, 806096137, 806355894, 806657076, 807791591, 809133410, 810047925, 810606837, 811028302, 811440051, 811959147, 812648177, 813150525, 813197911, 813133895, 813544929, 814443707, 815205216, 815153956, 814595282, 814853609, 815277338, 815214932, 815725505, 816814899, 817545116, 817771614, 818092763, 818568110, 818833053, 818974257, 819106162, 819395244, 819938779, 820396960, 820574760, 820626855, 820817411, 821061373, 821237445, 821485221, 821787775, 822023034, 822078586, 821939290, 821879148, 821713984, 821403742, 821730137, 822163582, 822324455, 822765350, 823245347, 823204041, 822793305, 822697580, 822591186, 822553396, 823007166, 823380649, 823616028, 823775589, 823810697, 823890626, 823707700, 823230147]
3838.4H23230147k8431L48866M25458M45783J86324m53174j317322n38230J056135
3856.8H23355556R75191K51651k85029j98484J20223j21773k06053J45555L76045M16935
3877.2H24829817Q881j72079R6262K9623O5446M0889k15173R6083M22060Q5175l87489
3899.6H24899495n30303k70426L21925O00874L52561Q8394n5015j93179j44362O8247
3920H25138211J02043l3736j8239N2750k3305L7551K22504J66774R358r6083j40846
3942.5H25416982M9949J53243k7537m5955J10507J70350J28746K9564l6955R537R6023
3964.9H26054454J00672K3484j2219L0280Q1479R1910P0811P9691Q4460J8656q1956
3987.3H26541722m6969Q8632O3420L7312J31190
$$ y = [823230147, 823201716, 823550582, 823976040, 824421823, 824608147, 824154973, 822837651, 822299421, 823355556, 824330747, 824582398, 824297369, 824098885, 824219108, 824097335, 823891282, 824036837, 824412882, 824829817, 824838698, 824666619, 824762881, 824792504, 824857950, 824898839, 824683666, 824779749, 825201809, 825286984, 824899495, 824369192, 824098766, 824420691, 825021565, 825374126, 825462520, 825407505, 825214326, 825069964, 825138211, 825240254, 825206518, 825188279, 825241029, 825217724, 825255275, 825477779, 825644553, 825653911, 825557828, 825416982, 825466931, 825620174, 825592637, 825546682, 825657189, 825827539, 825956285, 825985849, 825948894, 825958431, 826054454, 826155126, 826178610, 826166391, 826196671, 826278150, 826370060, 826440871, 826520562, 826605022, 826623678, 826541722, 826494753, 826583385, 826646805, 826684117, 826815307]
3997.5H26815307
$$ y = [826815307]
##END=$$ End of the data block
