##TITLE=$$ Begin of the data block
##JCAMP-DX=5.00 $$ ACD/SpecManager v 10.08
##SPECTROMETER/DATA SYSTEM=Alpha
##DATE=07 Apr 2014 11:14:18
##DATA TYPE=INFRARED SPECTRUM
##DATA CLASS=XYDATA
##ORIGIN=
##OWNER=
##NPOINTS=1765
##FIRSTX=399.75695801
##LASTX=3997.56933594
##MAXX=3997.56933594
##MINX=399.75695801
##MAXY=0.88020074
##MINY=0.47004676
##XFACTOR=1.0000000000
##YFACTOR=1.000000000000000e-9
##FIRSTY=0.75332624
##DELTAX=2.03957629
##XUNITS=1/CM
##YUNITS=ARBITRARY UNITS
##XYDATA=(X++(Y..Y))
399.8G53326237j919210k346635J279056J636267k419233k778948J430035K046943
416.1G50254512k560198l321290J768052J805723k078712j915515J694501J527607
432.4G47174680j958132j880049J620114J516819j941860j800597J567602J377106
448.7G45675683j848936j709282J428604R43482k462805j612961J654685J066684k205431
467.1G40929723k081156R12964Q65400j794576j201153J631796J138806j836180j565993
485.4G36999631J376212J213550j603603j620770R77278J056194j511693j962602M29213
503.8G35353410Q48055j356661j644433O33657J000524j410485k091467J07229Q22663
522.1G32262492j028180j867115j00792P82669q78334j836241l35216O85274n70714
$$ y = [753326237, 751407027, 749060392, 750339448, 751975715, 749556482, 746777534, 748207569, 750254512, 747694314, 744373024, 746141076, 747946799, 745868087, 743952572, 745647073, 747174680, 745216548, 743336499, 744956613, 746473432, 744531572, 742730975, 744298577, 745675683, 743826747, 742117465, 743546069, 744489551, 742026746, 740413785, 742068470, 743135154, 740929723, 738848567, 739761531, 740626931, 738832355, 737631202, 739262998, 740401804, 738565624, 736999631, 738375843, 739589393, 737985790, 736365020, 737342298, 738398492, 736886799, 734924197, 735353410, 736201465, 734844804, 733200371, 733834028, 734834552, 733424067, 731332600, 731439829, 732262492, 731234312, 729367197, 729266405, 730049074, 729170740, 727334499, 726999283, 727684557, 727113843]
540.5G27113843j518488k76089P75695m99010j727521o98448M27127m58955j530707
558.8G21607447p12157M16398l67343j829684j481890j85729n29646j856506j550496
577.2G13510394M530R9659j250505j442969m8042L12925j051069j399457R4712N26607
597.6G09356785j157105k038360q41141j87695j364529j905918l44395Q35657n2691
616G02300608m65810J503467L157676K247095J050412K203465L595710K407133O93083
634.3G18692839J511872L031969K034545j9729M91440K582610K316773K90334L55124
652.7G31287777K046586J965880P01547J413822L363013K940595M13537K37286L004015
671G47374058K805650O90639L31938K413869K800942N25772j94609J846552K506316
$$ y = [727113843, 725595355, 725319266, 726094961, 725595951, 723868430, 723169982, 723597109, 723138154, 721607447, 720895290, 721311688, 720944345, 719114661, 717632771, 717447042, 716917396, 715060890, 713510394, 713514924, 713614583, 712364078, 710921109, 710873067, 711185992, 710134923, 708735466, 708830178, 709356785, 708199680, 706161320, 705320179, 705132484, 703767955, 701862037, 701517642, 702353299, 702300608, 701834798, 703338265, 706495941, 708743036, 709793448, 711996913, 715592623, 717999756, 718692839, 720204711, 723236680, 725271225, 725251496, 725742936, 728325546, 730642319, 730932653, 731287777, 733334363, 735300243, 736001790, 737415612, 740778625, 743719220, 744132757, 744370043, 747374058, 750179708, 750870347, 751202285, 753616154, 756417096, 756942868, 756748259, 758594811, 761101127]
689.4G61101127K75373p74503J205862K275288L37064q50558J053035K536834R47356
707.7G68106878n09143J061082K749562J370013m03643R30071K854407J634896k70009
726.1G77524114P01725K526760J604796m51684J44064K139390J668989l37422N4241
744.4G85574973K164125K054453O5982P6533K047479K191067L02851K5689J760006
762.8G96263158J970828N9068n19395J206279J742125k40684j286626J68145J016497
781.2H00379395m51982j456856R060J499295P59601n6624J375973L148198K709330
799.5H07915390J502990K147377L463805K748429R92716J049220K249241J761794k6762
817.9H23804200l08097O82712J73986j696229k150059j000464q20935k055287k364159
$$ y = [761101127, 761376500, 760601997, 761807859, 764083147, 764420211, 763569653, 764622688, 767159522, 768106878, 767597735, 768658817, 771408379, 772778392, 772374749, 773304820, 776159227, 777794123, 777524114, 778225839, 780752599, 782357395, 781905711, 782049775, 784189165, 785858154, 785520732, 785574973, 787739098, 789793551, 789859533, 789936066, 791983545, 794174612, 794477463, 794503152, 796263158, 798233986, 798293054, 797773659, 798979938, 800722063, 800481379, 799194753, 799362898, 800379395, 799927413, 798470557, 798479617, 799978912, 800738513, 800681889, 802057862, 805206060, 807915390, 809418380, 811565757, 815029562, 817777991, 818770707, 819819927, 822069168, 823830962, 823804200, 823496103, 824178815, 824352801, 822656572, 820506513, 819506049, 818685114, 816629827, 814265668]
836.2H14265668j056909l64959j341343j905382o18875O98328M99368N10454K273500
854.6H12959850L979921L706694K869487L468394M387796L614187K021134J784623
870.9H38792086K484500J987577N30004K62499J040280P10249p62582j222134l45587
889.3H43476892j48356j101852j225352K02954J163601N06282l099Q82864J502514
907.6H45256448M59313p52449n61356j52588j100481k279281j860679o63936n59449
926H37785542r97722k09153J141131R59039k69115l19481N93424M00424q26836j105428
946.4H37151825l24308m62056j857280k572894k071202k196372l582418m520833m292012
964.7H15272450m427611n716026o551564n795181m773676m694760m629135l585041
$$ y = [814265668, 813208759, 812843800, 811502457, 809597075, 808978200, 809676528, 810175896, 810686350, 812959850, 816939771, 820646465, 823515952, 826984346, 831372142, 834986329, 837007463, 838792086, 841276586, 843264163, 843794167, 844056666, 845096946, 845807195, 845044613, 843822479, 843476892, 843328536, 842226684, 841001332, 841204286, 842367887, 842874169, 842871070, 843753934, 845256448, 845715761, 844963312, 844401956, 844249368, 843148887, 840869606, 839008927, 838344991, 837785542, 836787820, 836578667, 837719798, 838678837, 838409722, 838090241, 838683665, 839084089, 838257253, 837151825, 836827517, 836365461, 834508181, 831935287, 829864085, 827667713, 824085295, 819564462, 815272450, 810844839, 805128813, 798577249, 792782068, 788008392, 783313632, 778684497, 775099456]
981G75099456k528011k608777k972185k309919j268029j222312j678884j258195l12328
999.4G58940816k17378q88825j103043q51155j273453k370357k838314k383351k197683
1017.7G44817257k686143k782047k126992j793503k242685k474367j910806j425505
1034.1G27375209j629889j813233j347661q85963j177907j687408j596152j189232
1050.4G16047764j127422j112223m96924L59953N49674P0274l11017m91917j080156
1068.7G12408006j987099k391935k166688k029777k258122k300680j973450j873851
1085F95426404k231001k445221k102554j571834j313269j158595p95782n13673o26802
1103.4F82667673q63791q37207p03275q55565j172125j286626j364947j775741k148628
$$ y = [775099456, 772571445, 769962668, 766990483, 764680564, 763412535, 762190223, 760511339, 759253144, 758940816, 758723438, 757834613, 756731570, 755880415, 754606962, 752236605, 749398291, 747014940, 744817257, 742131114, 739349067, 737222075, 735428572, 733185887, 730711520, 728800714, 727375209, 725745320, 723932087, 722584426, 721698463, 720520556, 718833148, 717236996, 716047764, 714920342, 713808119, 713311195, 713671148, 714220822, 714291096, 713980079, 713488162, 712408006, 710420907, 708028972, 705862284, 703832507, 701574385, 699273705, 697300255, 695426404, 693195403, 690750182, 688647628, 687075794, 685762525, 684603930, 683808148, 683294475, 682667673, 681803882, 680966675, 680263400, 679407835, 678235710, 676949084, 675584137, 673808396, 671659768]
1121.8F71659768j810968j135052o03616L87252J420199J536549J375258J478314J610875
1140.1F75918579J697779J668513J406729J093089J042903J209021J306951J306235
1156.4F86649799J469493J865447K270400K617896L104329L712177M106999M173577
1172.7G09970117M169046M257858M277766M073918L775835L504634L137469K555311
1189.1G39721954J852095J294911R83179P28189N28217O37472J060724J426339J462936
1207.4G49696016J354218J325309J229107R31502O60300O60122P97808P98344P12037
1225.8G58164763Q06749J045704J092375R48607R70066J156986J165271R47952P68304
1244.1G67066777P15673N70357K08914n7578L6239K08795J84894K35617O41287J139998
$$ y = [671659768, 669848800, 668713748, 668110132, 668497384, 669917583, 671454132, 672829390, 674307704, 675918579, 677616358, 679284871, 680691600, 681784689, 682827592, 684036613, 685343564, 686649799, 688119292, 689984739, 692255139, 694873035, 697977364, 701689541, 705796540, 709970117, 714139163, 718397021, 722674787, 726748705, 730524540, 734029174, 737166643, 739721954, 741574049, 742868960, 743852139, 744580328, 745108545, 745746017, 746806741, 748233080, 749696016, 751050234, 752375543, 753604650, 754536152, 755196452, 755856574, 756654382, 757452726, 758164763, 758971512, 760017216, 761109591, 762058198, 763028264, 764185250, 765350521, 766298473, 767066777, 767782450, 768352807, 768561721, 768504143, 768540382, 768749177, 768934071, 769169688, 769810975, 770950973]
1264.5G70950973J343489J353144J578629J961589K063692J914263J944303K204180
1280.8G85314262K269685K075792K087175K373219K436042K115309J865387J928389
1297.2H02465260J869977J448869J143098J211524J205623Q24094M64678N43654O96540
1315.5H11873317M79817L10540O15538R77516Q88705N65588N29886O55174L98874j31488
1335.9H17163467k51829K20120N09441K76267J75238L99589M02332J0848k30789n1797
1356.3H18622887k8491n25653q63135m93765k77460o28650q82745p52031n29886o56962
1376.7H12984109j189351j726270j823068j157343p1883N97775M61578k26795r35436
1395.1H06913316r54091o29783p24614j337409j651764j174509r45211j255869j305044
$$ y = [770950973, 772294462, 773647606, 775226235, 777187824, 779251516, 781165779, 783110082, 785314262, 787583947, 789659739, 791746914, 794120133, 796556175, 798671484, 800536871, 802465260, 804335237, 805784106, 806927204, 808138728, 809344351, 810168445, 810633123, 811176777, 811873317, 812353134, 812663674, 813279212, 814256728, 815145433, 815711021, 816240907, 816896081, 817294955, 817163467, 816911638, 817131758, 817641199, 817917466, 818092704, 818492293, 818894625, 818905473, 818674684, 818622887, 818594396, 818068743, 817205608, 816711843, 816434383, 815805733, 814922988, 814170957, 813641071, 812984109, 811794758, 810068488, 808245420, 807088077, 807016194, 807613969, 808075547, 807848752, 806913316, 805959225, 805329442, 804604828, 803267419, 801615655, 800441146, 799495935, 798240066, 796935022]
1413.4G96935022j005948r86933j108110p38383k60949m2617l31700o32525j83880
1431.8G91643977K23041P6651K91527Q79824J117885Q85188N57125Q85427J552045
1450.1G98112690J524449J071811J511156L317893L329336K309978K330125K988398
1466.4H16495836K800166K295673K755583L521621L175676K256214J590371J441837
1482.8H36332977J076460K28524k66910K46346M43995m14431j266837r58145n10871
1501.1H34911108r53794k334177l260553j430035r16123j653314j966774j614273j430809
1519.5H19351256j816094j351476o89983p84218j064718j417041j341999q06689j259804
1537.8H08819234k210080j130402J25169M9770j94132j22845P2360k00749p23958r82463
$$ y = [796935022, 795929074, 794942141, 793834031, 793095648, 792834699, 792792082, 792460382, 791827857, 791643977, 791867018, 791943669, 792235196, 793115020, 794232905, 795118093, 795675218, 796560645, 798112690, 799637139, 800708950, 802220106, 805537999, 808867335, 811177313, 813507438, 816495836, 819296002, 821591675, 824347258, 827868879, 831044555, 833300769, 834891140, 836332977, 837409437, 837637961, 837371051, 837617397, 838061392, 837646961, 836380124, 835421979, 834911108, 833957314, 831623137, 828362584, 826932549, 826016426, 824363112, 822396338, 820782065, 819351256, 817535162, 816183686, 815493703, 814709485, 813644767, 812227726, 810885727, 810079038, 808819234, 806609154, 805478752, 805603921, 805653691, 805459559, 805336714, 805409074, 805208325, 804484367, 803501904]
1558.2H03501904P5340L48032n48899j083076j481176j891732j880348k384722l173172
1576.6G91482151k808810k750396l218353l366471l677249m190504m383981m301727
1592.9G62784660m470408m750908m783451m665673m640937m763245m893780m869402
1609.2G24946856m668116m639328n322158n590081l817320l272295m000306l636658
1625.5F90000594k967000k534807j817226j290858m43936J019955J608610J894176
1641.8F85469508K158940K914369L998518L328979L455162O063461N265713L872454
1658.2G16527104L969074M577338M761517L918231L923476M940152M637599M407763
1674.5G51662254M915536M498720L781199L828168N523324N631149M474342M312217
$$ y = [803501904, 803577244, 803925276, 803376377, 802293301, 800812125, 798920393, 797040045, 794655323, 791482151, 788673341, 785922945, 782704592, 779338121, 775660872, 771470368, 767086387, 762784660, 758314252, 753563344, 748779893, 744114220, 739473283, 734710038, 729816258, 724946856, 720278740, 715639412, 710317254, 704727173, 700909853, 697637558, 693637252, 690000594, 687033594, 684498787, 682681561, 681390703, 680946767, 681966722, 683575332, 685469508, 687628448, 690542817, 694541335, 697870314, 701325476, 707388937, 712654650, 716527104, 720496178, 725073516, 729835033, 733753264, 737676740, 742616892, 747254491, 751662254, 756577790, 761076510, 764857709, 768685877, 774209201, 779840350, 784314692, 788626909]
1690.8G88626909L801883L862261M420758M424929N164206M564107L670275L601313
1707.1H22136641L157854K687096K226949J728833J929164K514302K253771J726628
1723.4H40361238J508891J431763J380742J156926J219928J800895J726031J492560
1739.7H52078974J462519J482010J466990J326561J286864J537681J490473J166583
1756.1H63298655Q85069O81639Q31782J017035O56068K25127K07483N19693P97987
1774.4H69120538O77824N43595N83171N25117L57271L92496L73841N4478M9234M80115
1794.8H73157680O14047L51846J31905L23654N36859L56912J3054N6207M27127M69207
1815.2H76438498J56224L5107J82033J92106r299j13785J15335N14865M08709L4392
$$ y = [788626909, 792428792, 796291053, 800711811, 805136740, 810300946, 814865053, 818535328, 822136641, 825294495, 827981591, 830208540, 831937373, 833866537, 836380839, 838634610, 840361238, 841870129, 843301892, 844682634, 845839560, 847059488, 848860383, 850586414, 852078974, 853541493, 855023503, 856490493, 857817054, 859103918, 860641599, 862132072, 863298655, 864183724, 864865363, 865697145, 866714180, 867370248, 867595375, 867802858, 868322551, 869120538, 869798362, 870341957, 870925128, 871450245, 871807516, 872200012, 872573853, 872628331, 872677565, 873157680, 873771727, 874123573, 874255478, 874579132, 875115991, 875472903, 875485957, 875542164, 875969291, 876438498, 876594722, 876629829, 876811862, 877003968, 876994669, 876880884, 876996219, 877511084, 877919793, 877954185]
1835.6H77954185P7605K59280J7763k85089J05381N45680L75688J9849m6969J43469
1856H79166842J48594l0100l219J64091K8909k61247o2764L59118L41713J2219j05679
1878.4H79758477J17362K21610j6987k56002j70052J38044J15037j24455L2127K83182
1898.8H80098343J02401k08497j73509M3451L3617j14679n5969Q6248k2113k29776
1919.2H79559517k08855M1127J78040n2214j88887K7954J22786j18077k74181j51694
1939.6H78935516o2347j25765j67609l1709J13547o2764l05534j66595P0453n7220
1960H78139973l12925k62558m3512j7345j75654j90854j8180k3842k32219k32518J192
1982.5H76631558K5153k26676l30866j57177L099o5744j76012q1480L2842r6380k42949
$$ y = [877954185, 878031790, 878291070, 878308833, 878023744, 878129125, 878674805, 879050493, 879070342, 879023373, 879166842, 879315436, 879285336, 879282117, 879446208, 879475117, 879213870, 879151106, 879510224, 879851937, 879864156, 879758477, 879875839, 880097449, 880080462, 879824460, 879654408, 879792452, 879907489, 879783034, 879815161, 880098343, 880200744, 879992247, 879818738, 879862189, 879895806, 879781127, 879725158, 879811406, 879789293, 879559517, 879350662, 879391789, 879569829, 879517615, 879328728, 879356682, 879479468, 879361391, 879087210, 878935516, 878873169, 878747404, 878579795, 878548086, 878661633, 878598869, 878293335, 878126740, 878197193, 878139973, 877827048, 877564490, 877520978, 877503633, 877327979, 877137125, 877118945, 877095103, 876862884, 876630366, 876631558, 876656711, 876430035, 876099169, 875941992, 875945091, 875879347, 875703335, 875621855, 875654697, 875558317, 875315368]
2004.9H75315368j31011M649j36733l28719k29001J907j6213k07781j94252k7537n2631
2027.3H73998046j98186j33216L0577l0398k21193k08557M173N1021j27792j87814
2047.7H72976661l8028L3915r0182j64389m1187O0737m7088j67012o0022Q9288j1921
2070.2H72540772j73926q3208R8586O9558p5161o6281O6460O7412p0154p5042Q8810
2092.6H72387826J32561k8610q1658P3373J27375j9312r3341K1935J06156M2975j5796
2115H72653484L1770R3877N8412j2218K8371J15157P1764l5942k325J24932J34885
2137.5H73262167L0875K980R6977J18196J9312k3663O0797J34766R4592N6446Q3923
2159.9H73937368R3341M4346R477N8294J26957J26243O2585L2842Q4043R7155J3173
$$ y = [875315368, 875184357, 875189006, 875052273, 874723554, 874494553, 874496460, 874480247, 874272466, 874078214, 874050677, 873998046, 873799860, 873666644, 873697221, 873666823, 873445630, 873237073, 873241246, 873292267, 873164475, 872976661, 872938633, 872972548, 872882366, 872717977, 872676790, 872737527, 872690439, 872523427, 872463405, 872552693, 872540772, 872366846, 872283638, 872382224, 872451782, 872376621, 872310340, 872376800, 872444212, 872374058, 872299016, 872387826, 872520387, 872491777, 872410119, 872483492, 872610867, 872591555, 872498214, 872520149, 872626305, 872669280, 872653484, 872685254, 872779131, 872837543, 872825325, 872853696, 872968853, 873040617, 873004675, 873002350, 873127282, 873262167, 873293042, 873296022, 873392999, 873511195, 873530507, 873506844, 873567641, 873702407, 873796999, 873853445, 873937368, 874030709, 874075055, 874084532, 874142826, 874269783, 874396026, 874458611, 874491453, 874575496, 874672651, 874685824]
2182.3H74685824r54Q2493R9003L0935K265N1499Q0883K4676k8193L7730J37627J05501
2206.8H75309289k1756n0366L6299M8041j9848j5736M9353O0022l219k8550J9490K7359
2231.3H75410378k3723l8862J6391P9573L4272o4552l0756L9339k5331q7858j5318
2253.7H75293553Q4519N9545o1810q7499L3915Q3804k1696m8816M2319N4240k7895
2276.1H75404179m3750P3910J39535K9921r3102o6281J1564k8432r5427p8857l2484
2298.6H75220776l3200j02878j52290j30534j29282j87874j99497r3222r3936l54946
2319H73743117n05030k88129p4506j19865j85668j31011q8275j25468j90138j87934
2339.4H71847093o6101J64151N72324P36057K61307m26769q18610p27833l73482j11223
$$ y = [874685824, 874684870, 874767363, 874866366, 874897301, 874899566, 874951065, 875031948, 875056624, 875028431, 875066161, 875203788, 875309289, 875287533, 875237167, 875273466, 875321507, 875301659, 875285923, 875335276, 875395298, 875392079, 875363529, 875383019, 875410378, 875386655, 875347793, 875364184, 875443757, 875478029, 875413477, 875382721, 875422060, 875396729, 875308871, 875293553, 875378072, 875437617, 875375807, 875288308, 875322223, 875406027, 875384331, 875335515, 875377834, 875432074, 875404179, 875360429, 875434339, 875573874, 875603795, 875510693, 875444412, 875455976, 875427544, 875332117, 875253260, 875220776, 875187576, 875084698, 874932408, 874801874, 874672592, 874484718, 874285221, 874191999, 874098063, 873743117, 873238087, 872949958, 872875452, 872755587, 872569919, 872438908, 872350633, 872225165, 872035027, 871847093, 871780992, 871945143, 872517467, 873253524, 873514831, 873088062, 872269452, 871541619, 871168137, 871056914]
2359.8H71056914p0929L2425M09245P77006P75695O45697P25210P92027O42180M95315
2380.2H76280785M90069M44651K37286O0022P0095J15215L7015o7174l6121Q8573R0003
2402.6H77810419l9339l3737J01388R0420o0499q9287K8967O4671m8041j11222j8358
2425H77695382O9141J6868n4359J0848P8857q047j14560p1347M7803L3796q9109r5844
2449.5H77519429n424p451p9751o3956M9532O8128q1122j47283l5644O795q0764q7976
2474H77054513K2232P1585l8624j38759n8055K0325n8711j33931p0632M7624K9982
2496.4H76747549j18375j41919j8895o020j12056j10329J5855O1989m1306j22011m8697
2518.9H76105785J3709r4473j63376m5717M4942m0829j36495p2300J7047m5300j23322
$$ y = [871056914, 870985985, 871018410, 871427655, 872204661, 872980356, 873626053, 874351263, 875143290, 875785470, 876280785, 876770854, 877215505, 877452791, 877512813, 877582908, 877698123, 877735138, 877667964, 877631843, 877720416, 877810419, 877771080, 877737343, 877838731, 877929151, 877868652, 877779365, 877808332, 877873003, 877824962, 877713740, 877695382, 877764523, 877781391, 877727032, 877737880, 877816737, 877808690, 877694130, 877622783, 877670586, 877704382, 877615273, 877519429, 877514005, 877506554, 877426803, 877362847, 877412379, 877480507, 877399385, 877252102, 877216458, 877223253, 877142489, 877054513, 877076745, 877148330, 877109706, 876970947, 876912892, 876933217, 876874506, 876740575, 876669943, 876717567, 876747549, 876629174, 876487255, 876468360, 876462340, 876350284, 876239955, 876255810, 876317799, 876276493, 876154482, 876105785, 876119494, 876025021, 875861645, 875815928, 875860870, 875820041, 875683546, 875611246, 875628293, 875582993, 875459671]
2541.3H75459671l3379O9321j5080j54913j31190k1875k2590j16288j14382K563J9610
2563.7H74941468j20401j98126q5592R358q6248j66714o4791n304j31786k05934j28389
2586.2H73757541p7784j21832j65343j16587l0219p9155k43664k69294j44660j26183
2606.6H72382820k00272j58191m4703o6817k31743k98679j73747q0288j52409k13086
2626.9H70762885j44840j08897k20418k87652j52052o0737k00987l16500k16365q3924
2647.3H68970513j34170k73704k42949r3102r5189k30014k43128j11401j05857k56956
2667.7H67184043k62797q2850k7419j73032k32518j32441j34945k93612l67880k42830
2688.1H65233719r8884j60694k88546k21789r7692j57654k93553k80678j77920j77980
$$ y = [875459671, 875426292, 875495613, 875480533, 875325620, 875194430, 875172555, 875149965, 875033677, 874919295, 874921858, 874941468, 874821067, 874622941, 874537349, 874546707, 874460459, 874293745, 874228954, 874223650, 874091864, 873885930, 873757541, 873679757, 873557925, 873392582, 873275995, 873245776, 873166621, 872922957, 872653663, 872509003, 872382820, 872182548, 872024357, 871979654, 871912837, 871681094, 871382415, 871208668, 871128380, 870975971, 870762885, 870618045, 870509148, 870288730, 870001078, 869849026, 869788289, 869587302, 869270802, 869054437, 868970513, 868836343, 868562639, 868319690, 868226588, 868131399, 867901385, 867658257, 867546856, 867440999, 867184043, 866921246, 866838396, 866810977, 866637945, 866405427, 866272986, 866138041, 865844429, 865476549, 865233719, 865134835, 864974141, 864685595, 864463806, 864366114, 864208460, 863914907, 863634229, 863456309, 863278329]
2708.5H63278329k76386k69771j43945j52528k83361k69890j19805r0242k51472l46541
2728.9H61074388k30670j45316k13921k61426k08557j73211k43187k57253j36972j14798
2749.3H59089077k66850l75331l11196j92046j96457k92539k84672j98186k24590l26931
2769.7H56420279l04401j79351k08080l91840m49241l36408k68817k81573k68161k90155
2790.1H53442252l72351m19259m10318l90410m26233n09978n50031m63546l45587m37081
2810.5H49117458o29842o19889m74930m50789n72443o41048n90086n84841o76573p06195
2830.9H43170822o23584o21200q18550j167417j509964j725495j925826k052307j853943
2849.3H30872536j357496q84295o17742l80874k20299l81887o91890q32677q28147
$$ y = [863278329, 863001943, 862732172, 862588227, 862435699, 862152338, 861882448, 861762643, 861672401, 861420929, 861074388, 860843718, 860698402, 860484481, 860223055, 860014498, 859841287, 859598100, 859340847, 859203875, 859089077, 858822227, 858446896, 858135700, 857943654, 857747197, 857454658, 857169986, 856971800, 856747210, 856420279, 856115878, 855936527, 855728447, 855336607, 854887366, 854550958, 854282141, 854000568, 853732407, 853442252, 853069901, 852650642, 852240324, 851849914, 851423681, 850913703, 850363672, 849900126, 849554539, 849117458, 848487616, 847867727, 847392797, 846942008, 846369565, 845728517, 845138431, 844553590, 843877017, 843170822, 842547238, 841926038, 841107488, 839940071, 838430107, 836704612, 834778786, 832726479, 830872536, 829515040, 828630745, 828013003, 827632129, 827411830, 827029943, 826338053, 825505376, 824677229]
2867.6H24677229q29518q30352q48830q46267p27534o48081o38604n48840n55098p78258
2888H17425847r34005q39710p08401q41797j077115j046360r05633r65178j133263
2906.4H08974385j183867j198828j430273j779140j865923j633584j367093j104891
2922.7G97410786p03275j77562J66952R8110R7572M79699Q03530Q70943R76503J153528
2943.1H01176786J035989N51641J30117N4359m530k62558l48091p8440K16126K42591
2963.5H02713990J73927K94089N06818N92172N19574M43935N31257N63263L12388J32204
2983.9H06783617K40623L34442L19719K35498L1650j26779l17335n36740m71890l90470
3004.3H06102335m96447m23789j60336j51575n05030q08537q26776p54356p19309p57098
$$ y = [824677229, 823847711, 823017359, 822168529, 821322262, 820594728, 819946647, 819308043, 818759203, 818204105, 817425847, 816491842, 815652132, 814943731, 814101934, 813024819, 811978459, 811072826, 810107648, 808974385, 807790518, 806591690, 805161417, 803382277, 801516354, 799882770, 798515677, 797410786, 796707511, 796529949, 796696901, 796795011, 796892583, 797372282, 798175812, 799046755, 800023258, 801176786, 802212775, 802764416, 802894533, 802948892, 802944362, 802681804, 802333713, 802255273, 802471399, 802713990, 802887917, 803182006, 803688824, 804280996, 804800570, 805244505, 805775762, 806339025, 806651413, 806783617, 807024240, 807358682, 807678401, 807913899, 807945549, 807818770, 807501435, 806964695, 806492805, 806102335, 805605888, 805182099, 805021763, 804870188, 804365158, 803556621, 802729845, 801975489, 801256180, 800499082]
3024.7H00499082q26598p55369o50168o65247p93517q97348q08179p32720q22246r74953
3045.1G92572737j109004j099706j006603r72033j000583j147866j247823j087666
3061.4G83901453q83758q45790r35376j031518j067161j037836q87692p60675q82625
3079.7G75569022j087547j173198j195013j144767j134336j298845j365781j188278
3096G65981257j042604j139045j302719j221240j046777j138329j379311j325488j036048
3114.4G55349696j070261j366437j554727j675785j717806j590192j413107j419008
3130.7G43542373j587510j599789j360535j281798j617968j914919j827776j632094
3147G30719984j502514j449347j634598j909077j986682j961470j903117j807451j818657
$$ y = [800499082, 799672484, 798917115, 798266947, 797601700, 796808183, 795910835, 795102656, 794369936, 793547690, 792572737, 791463733, 790364027, 789357424, 788385391, 787384808, 786236942, 784989119, 783901453, 783017695, 782171905, 781236529, 780205011, 779137850, 778100014, 777212322, 776451647, 775569022, 774481475, 773308277, 772113264, 770968497, 769834161, 768535316, 767169535, 765981257, 764938653, 763799608, 762496889, 761275649, 760228872, 759090543, 757711232, 756385744, 755349696, 754279435, 752912998, 751358271, 749682486, 747964680, 746374488, 744961381, 743542373, 741954863, 740355074, 738994539, 737712741, 736094773, 734179854, 732352078, 730719984, 729217470, 727768123, 726133525, 724224448, 722237766, 720276296, 718373179, 716565728, 714747071]
3165.4G14747071j935482j956105j838028j797736j944959k064407j972914j897693
3181.7F99339747k012431k074957j961887j909256k034783k150655k137601k087415
3198F82970762k096474k110541k040505k003551k086758k108991k019108j941442j933039
3216.4F64630353k009093k072811k046287k009392Tj945615j747250j647175j875639
3234.7F47267699k063930j899183j711070j665473j600146j562238j654446j683772
3251.1F33427441j517117j372039j429320j551032j569807j522958j455307j357258
3267.4F21652603j261949j311958j506865j645446j690447j680077j637220j616001
3283.7F09302640j604974j555443j470149j520872j762509j943410j990735j963675
$$ y = [714747071, 712811589, 710855484, 709017456, 707219720, 705274761, 703210354, 701237440, 699339747, 697327316, 695252359, 693290472, 691381216, 689346433, 687195778, 685058177, 682970762, 680874288, 678763747, 676723242, 674719691, 672632933, 670523942, 668504834, 666563392, 664630353, 662621260, 660548449, 658502162, 656492770, 654483378, 652537763, 650790513, 649143338, 647267699, 645203769, 643304586, 641593516, 639928043, 638327897, 636765659, 635111213, 633427441, 631910324, 630538285, 629108965, 627557933, 625988126, 624465168, 623009861, 621652603, 620390654, 619078696, 617571831, 615926385, 614235938, 612555861, 610918641, 609302640, 607697666, 606142223, 604672074, 603151202, 601388693, 599445283, 597454548, 595490873]
3300E95490873j836062j706779j783669k113819k471447k591610k447664k308131k345025
3318.4E75886667k377212k282322k251029k479017k735555k715707k581834k503872
3334.7E55960119k445221k510548k700567k863288k965212k856850k591372k677560
3351E34349501l058672l147006k894759k670169k730071k829433k580285k364993k606928
3369.3E09467185k979219k969563k616525k362967k268999k223611k132506j902520
3385.7D90011275j574934j277685j341164j698166j697540j183808q76665j263380
3402D79097933j669765j391530r20266p93636q42273q96990q72165o80447m64886l43800
3422.4D70222175j75416J17153L63022L79473M44948O53476N72562K61635K93284P14153
$$ y = [595490873, 593654811, 591948032, 590164363, 588050544, 585579097, 582987487, 580539823, 578231692, 575886667, 573509455, 571227133, 568976104, 566497087, 563761532, 561045825, 558463991, 555960119, 553514898, 551004350, 548303783, 545440495, 542475283, 539618433, 537027061, 534349501, 531290829, 528143823, 525249064, 522578895, 519848824, 517019391, 514439106, 512074113, 509467185, 506487966, 503518403, 500901878, 498538911, 496269912, 494046301, 491913795, 490011275, 488436341, 487158656, 485817492, 484119326, 482421786, 481237978, 480361313, 479097933, 477428168, 476036638, 475116372, 474322736, 473480463, 472583473, 471711308, 471030861, 470565975, 470222175, 470046759, 470163912, 470526934, 470906407, 471351355, 472004831, 472577393, 472839028, 473132312, 473846465]
3442.8D73846465J058609J216709J287312J327663J410872J563519J790464J966030
3459.1D85467643J871466J828075K182185K401591K007395J488536J569420K033234
3475.4E00849545K368689K336382K016664J964211K245963K319753K231360K347350
3491.7E18679917K496362K547800K468407K370656K429545K396583K192021K214312
3508E37795603K584875K927065K826035K481341K428234K665877K969742K947748K634167
3526.4E62260687K687931L011406L122926L163099L193319L109574L200889L359019
3542.7E87108850L300727L147304L097773L188252L407538L548205L513992L580868
3559F13893509L668666L367305L116846L936231M730761M328132L929913M017949M235029
$$ y = [473846465, 474905074, 476121783, 477409095, 478736758, 480147630, 481711149, 483501613, 485467643, 487339109, 489167184, 491349369, 493750960, 495758355, 497246891, 498816311, 500849545, 503218234, 505554616, 507571280, 509535491, 511781454, 514101207, 516332567, 518679917, 521176279, 523724079, 526192486, 528563142, 530992687, 533389270, 535581291, 537795603, 540380478, 543307543, 546133578, 548614919, 551043153, 553709030, 556678772, 559626520, 562260687, 564948618, 567960024, 571082950, 574246049, 577439368, 580548942, 583749831, 587108850, 590409577, 593556881, 596654654, 599842906, 603250444, 606798649, 610312641, 613893509, 617562175, 620929480, 624046326, 627982557, 632713318, 637041450, 640971363, 644989312, 649224341]
3577.4F49224341M472673M573643M306853L984630M325867M891395M589856M334927
3593.7F84704185M696726M959941M850984M728198M515886M194975M371226M695594
3610G21717715M679621M663944M315555M237950M954040M810452L768742K948404L510475
3628.4G59606898M936516M498422L768444L617049L458976L267706K985537K476632
3644.7G88616180K096653K759576L708422L152430K431930K633869K792299K255976
3661H10447335J759649J487910J039028Q40784J364171J209617Q47161J595795J941383
3679.4H22532833J622557J240909P71761L61443L62873J004696J561344J567363J190067
3697.7H32215846P16030O32405R21369P93934K53439n0068M76420J173437R77993M50372
$$ y = [649224341, 653697014, 658270657, 662577510, 666562140, 670888007, 675779402, 680369258, 684704185, 689400911, 694360852, 699211836, 703940034, 708455920, 712650895, 717022121, 721717715, 726397336, 731061280, 735376835, 739614785, 744568825, 749379277, 753148019, 756096423, 759606898, 764543414, 769041836, 772810280, 776427329, 779886305, 783154011, 786139548, 788616180, 790712833, 793472409, 797180831, 800333261, 802765191, 805399060, 808191359, 810447335, 812206984, 813694894, 814733922, 815574706, 816938877, 818148494, 818995655, 820591450, 822532833, 824155390, 825396299, 826168060, 826529503, 826892376, 827897072, 829458416, 831025779, 832215846, 832931876, 833564281, 834485650, 835279584, 835533023, 835482955, 835959375, 837132812, 838110805, 838561177]
3718.1H38561177J22130K5928J26779M12166N68390J93298k65598p1645P18653J036883
3738.5H41428161M27365n37276o26207L22879K20477p1466O73294R70304N35012K33471
3758.9H43576014L82006L92318J01984j6571N2035K65539M40955L05653J15037J07765
3779.3H45722735J53422L8207L0219K26915K61069J09017r8527k52008k55227l91961
3799.7H45543861k74539L31104L58582L10659M84407K33531k68817m37677k36869k88367
3820.1H45755875P1645N33044K96653P7784J6570L934j3948l40879m72426N6624M48525
3842.5H46433401N58913M52638p7606r36329j365602M8220J137912O71745K9087k64049
3862.9H46688330q4877j19k67923q1420L16262L21806P8916k39789n9843K06888P3313
$$ y = [838561177, 838683307, 838709235, 838836014, 839248180, 839816570, 840009868, 839744270, 839672625, 840391278, 841428161, 841855526, 841318250, 840692043, 841014922, 841235399, 841163933, 841837227, 842807531, 843342543, 843576014, 843958020, 844350338, 844452322, 844435751, 844487786, 844753325, 845194280, 845499933, 845614970, 845722735, 845876157, 845914364, 845944583, 846171498, 846432567, 846541584, 846443057, 846191049, 845935822, 845543861, 845269322, 845600426, 845959008, 846269667, 846754074, 846987605, 846718788, 846281111, 846044242, 845755875, 845827520, 846360564, 846657217, 846735001, 846751571, 846755505, 846741557, 846400678, 845928252, 845984876, 846433401, 846992314, 847444952, 847367346, 846431017, 845065415, 845113635, 846251547, 846923292, 846952379, 846688330, 846603453, 846603334, 846335411, 846253991, 846570253, 846892059, 846970975, 846731186, 846671343, 846878231, 846951544]
3885.4H46951544P5221j7106j11938J68264J89543k56956n73754l93450Q0406N16057
3905.7H46627831N71073L28600P4446j65701l31819k30968L0160J16050N4598N8592
3926.1H47132862N304q6605N8591K41876J74045J8597j38998j99199r954R0659J0252
3948.6H47297430P5161J75953R8646j1861m2081o3479j8656R5069J21534Q1420M9889
3971H47859025L7670K2411m8339o8247R0778J86205L6299p7844k6762K8312O56l9101
3995.5H48001063L8564
3997.5H48039627
$$ y = [846951544, 847026765, 847009659, 846897721, 847065985, 847255528, 846998572, 846424818, 846031368, 846111774, 846627831, 847198904, 847527504, 847601950, 847436249, 847104430, 846873462, 846903622, 847019672, 847074270, 847132862, 847138166, 847051561, 847110152, 847352028, 847526073, 847544670, 847405672, 847206473, 847196519, 847287178, 847297430, 847372591, 847548544, 847647190, 847635329, 847593248, 847529769, 847511113, 847606182, 847727716, 847809136, 847859025, 847896695, 847919106, 847870767, 847802520, 847893298, 848079503, 848115802, 848037958, 848011196, 848039508, 848040164, 848001063, 848039627]
##END=$$ End of the data block
