##TITLE=$$ Begin of the data block
##JCAMP-DX=5.00 $$ ACD/SpecManager v 10.08
##SPECTROMETER/DATA SYSTEM=Alpha
##DATE=07 Apr 2014 11:14:18
##DATA TYPE=INFRARED SPECTRUM
##DATA CLASS=XYDATA
##ORIGIN=
##OWNER=
##NPOINTS=1765
##FIRSTX=399.75695801
##LASTX=3997.56933594
##MAXX=3997.56933594
##MINX=399.75695801
##MAXY=0.88048810
##MINY=0.47008160
##XFACTOR=1.0000000000
##YFACTOR=1.000000000000000e-9
##FIRSTY=0.75428623
##DELTAX=2.03957629
##XUNITS=1/CM
##YUNITS=ARBITRARY UNITS
##XYDATA=(X++(Y..Y))
399.8G54286230j519561k233923J007021J297176k510190k665878J619220K525985
416.1G51806080j699149k848327J465320J255691k406418k005696J659810J420856
432.4G48648167k295971j992166J904785J539648k283871k035380J425028J148462
448.7G46058702j921892j503586J609206Q81076k562464j529336J790464J007974k429962
467.1G41400182k080858J278341J179934j992822j736343J400531J381814j675606
483.4G39155173j714885J294911J333415j533269j701653R37879J103997j479209j937985
501.7G35458374M29451P20859j540601j615465P92802J021265j467704k120436J22309
520.1G31800854Q03530j166403k003372j60813P39634q83281j788736k21014Q22425
$$ plain form
399.8 754286230 752766669 750532746 751539767 752836943 750326753 747660875 749280095 751806080
416.1 751806080 750106931 747258604 748723924 749979615 747573197 745567501 747227311 748648167
432.4 748648167 746352196 744360030 746264815 747804463 745520592 743485212 744910240 746058702
448.7 746058702 744136810 742633224 744242430 745123506 742561042 741031706 742822170 743830144 741400182
467.1 741400182 739319324 740597665 741777599 739784777 738048434 739448965 740830779 739155173
483.4 739155173 737440288 738735199 740068614 738535345 736833692 737771571 738875568 737396359 735458374
501.7 735458374 735887825 736608684 735068083 733452618 734245420 735266685 733798981 731678545 731800854
520.1 731800854 732604384 731437981 729434609 729273796 730013430 729130149 727341413 727120399 727942824
538.4G27942824n81622j647830l80993P51615m89235j764119o38067N89430l58582
556.8G23423421j541555q80718K43485l97801j788616j377643m7445m72128j868606
575.2G15292394j504481L8207l1531j374483j395464J8656K82347j106023j328886
593.5G08890736J98305M05311j340985k018690o83427n4479j361429j928151k70367
611.9G01836824Q86620r3341n03660J460731L115297K315819J211882K308070L502786
630.2G16041028K197147O20007J627088L134847K018630k5749N70476K648056K286672
648.6G31118202K42889L73066K085924K007246P42554J440466L335774K846777L78907
666.9G44571805L46720L104627K833605O26207K24649K337218K735138M96983j21593
$$ plain form
538.4 727942824 727361202 725713372 725332379 726083994 725594759 723830640 723192573 723782003 723423421
556.8 723423421 721881866 721001148 721244633 720846832 719058216 717680573 717633128 717161000 715292394
575.2 715292394 713787913 713826120 713794589 712420106 711024642 711043298 711325645 710219622 708890736
593.5 708890736 709089041 709494352 708153367 706134677 705451250 705396771 704035342 702107191 701836824
611.9 701836824 702723444 702630103 702126443 703587174 706702471 709018290 710230172 712538242 716041028
630.2 716041028 718238175 718858182 720485270 723620117 725638747 725612998 726183474 728831530 731118202
648.6 731118202 731361091 731734157 733820081 735827327 736569881 738010347 741346121 744192898 744571805
666.9 744571805 744918525 748023152 750856757 751482964 751707613 754044831 756779969 757276952 757155359
685.3G57155359J927197K512455L43144o62089J180828K144158K61962q24630J093447
703.7G65131831K515018Q89719m68254J177847K729475J251102m61757R27388K890945
722G76583314J674056l20077O09338K540946J686097m11809J93179K205491J669168
740.4G86429703l62754M7326K139926K032936O9797J11580K090335K183854K19703
758.7G94962406r3162J706421J998008J25944m45366J216472J680135k78532j257599
777.1G99614727K01524J028120m47929j479983j9729J501143P52568p2777J434684
795.4H02512348L221512K688050J475453K142430L383338K677023J032174J112938
811.7H20245266K253532J730740n1856l49223O43909K02596j636803k100647r64045
$$ plain form
685.3 757155359 759082556 761595011 761938155 761276066 762456894 764601052 764863014 764038384 765131831
703.7 765131831 767646849 768536568 768068314 769246161 771975636 773226738 772764981 773692369 776583314
722 776583314 778257370 777937293 778546631 781087577 782773674 782361865 782555044 784760535 786429703
740.4 786429703 786066949 786114275 788254201 790287137 790356934 790468514 792558849 794742703 794962406
758.7 794962406 794869244 796575665 798573673 798699617 798254251 799470723 801150858 800872326 799614727
777.1 799614727 799816251 800844371 800396442 798916459 798896730 800397873 801150441 801077664 802512348
795.4 802512348 805733860 808421910 809897363 812039793 815423131 818100154 819132328 820245266
811.7 820245266 822498798 824229538 824177682 823828459 824472368 824674964 823038161 820937514 819973469
830.1H19973469q54135k158820k436221j036406l04103j284718j853049o13808O58988
848.5H10091197M84705N15402K250850L959656L731787K900064L467739M381477L618479
866.8H35401356K012491J743734K443016J984060N34534K41459J037895P48098p54893
885.2H45391750j270413l69191j33455j136899j307428J56641J185477N68151M2081
903.5H43126714Q87573J502037M55797q05021o02424r3758j037001k312780j881361
921.9H39239776o28650n83708j057506k19464J162231R77039k72870l35276O02364
940.2H38883936M12643q53181j145541l56317m81903j848519k550721k051652k158820
958.6H27849925l545464m536628m340947m427969n668998o548464n851210m839301
$$ plain form
830.1 819973469 819119334 816960514 814524293 813487887 813183784 811899066 810046017 809432209 810091197
848.5 810091197 810575902 811091304 813342154 817301810 821033597 823933661 827401400 831782877 835401356
866.8 835401356 837413847 839157581 841600597 843584657 844119191 844360650 845398545 846146643 845391750
885.2 845391750 844121337 843752146 843618691 842481792 841174364 841331005 842516482 843084633 843126714
903.5 843126714 844014287 845516324 845972121 845167100 844564676 844470918 843433917 841121137 839239776
921.9 839239776 838611126 838027418 836969912 836750448 837912679 838889718 838616848 838281572 838883936
940.2 838883936 839296579 838443398 837297857 836941540 836459637 834611118 832060397 830008745 827849925
958.6 827849925 824304461 819767833 815426886 810998917 805329919 798781455 792930245 788090944
974.9G88090944m719197m601062l568172k517045k543270k888441k292634j329600
991.2G63631523j283884j683593j240790l05057k19941r28283j148998q42750j271069
1009.6G54707158k408028k854645k384961k195775k660096k780199k150536j770079
1025.9G35502839k187729k456248j910328j394094j610457j820565j333236q81732
1042.2G21908450j202166j683831j562119j153886j103103j106024m73678L84986N12064
1060.6G14520693J0490k98440m33922j074553j993000k351761k149999k065599k261221
1078.9G01902688k237618j937390j900673k268433k465844k088011j533270j311302
1095.2F86160147j198053q16703m91381n88119q32021q26955p08163q58903j192808
$$ plain form
974.9 788090944 783371747 778770685 775202513 772685468 770142198 767253757 764961123 763631523
991.2 763631523 762347639 760664046 759423256 759118199 758898258 757969975 756820977 755978227 754707158
1009.6 754707158 752299130 749444485 747059524 744863749 742203653 739423454 737272918 735502839
1025.9 735502839 733315110 730858862 728948534 727554440 725943983 724123418 722790182 721908450
1042.2 721908450 720706284 719022453 717460334 716306448 715203345 714097321 713623643 714008629 714520693
1060.6 714520693 714531183 714232743 713798821 712724268 710731268 708379507 706229508 704163909 701902688
1078.9 701902688 699665070 697727680 695827007 693558574 691092730 689004719 687471449 686160147
1095.2 686160147 684962094 684145391 683654010 683065891 682233870 681406915 680698752 679839849 678647041
1113.6F78647041j306057j373410j799226k156615j820385j185239o62803L69489J455784
1132F70168579J574456J381934J468658J587153J662493J634836J391411J105249J060664
1150.3F83035433J197934J271069J309336J504004J858890K241552K604127L075420
1166.6F98097765L663362M081547M176378M175067M255235M273057M066944L750503
1182.9G30539858L489137L162503K556026J791716J257777R91821P30515N32448O75917
1201.3G45727718J120329J462281J464247J338184J305580J206041R03606O41763O68586
1219.7G55838335Q31842Q32438P42138Q21054J023769J071453R68874J008153J172483
1238G64310539J161217R32932P49052P22587O10650K59041k1457L7372J70648J35422
$$ plain form
1113.6 678647041 677340984 675967574 674168348 672011733 670191348 669006109 668343306 668712795 670168579
1132 670168579 671743035 673124969 674593627 676180780 677843273 679478109 680869520 681974769 683035433
1150.3 683035433 684233367 685504436 686813772 688317776 690176666 692418218 695022345 698097765
1166.6 698097765 701761127 705842674 710019052 714194119 718449354 722722411 726789355 730539858
1182.9 730539858 734028995 737191498 739747524 741539240 742797017 743788838 744519353 745051801 745727718
1201.3 745727718 746848047 748310328 749774575 751112759 752418339 753624380 754527986 755169749 755838335
1219.7 755838335 756670177 757502615 758244753 759065807 760089576 761161029 762129903 763138056 764310539
1238 764310539 765471756 766404688 767153740 767876327 768486977 768746018 768724561 768761933 768932581 769068003
1258.4G69068003K29895O85215J151323J294553J325846J616538K005338K046943J856685
1276.8G81280339J920402K220571K277255K059281K072990K390027K464711K125323
1293.1G98810899J856983J910806J863062J468420J153767J191080J205146Q56280
1309.4H10316443N02408N71966P03812M81427K99215N86867R65297Q90971N64158N35130
1329.8H16417694O66738L94880j49130k52247K36153N18740K67982J43528L83973M20392
1350.2H19048703K8431k14040k8670k444m94361q55148n32031l17454o38425q68082
1370.6H15126479p41065n31375o58751j211107j747071j808644j134991n6386O22868
1388.9H07859957M90010k06113r37879r76980o46293p41184j349151j664281j202046
$$ plain form
1258.4 769068003 769297898 769983113 771134436 772428989 773754835 775371373 777376711 779423654 781280339
1276.8 781280339 783200741 785421312 787698567 789757848 791830838 794220865 796685576 798810899
1293.1 798810899 800667882 802578688 804441750 805910170 807063937 808255017 809460163 810316443
1309.4 810316443 810818851 811390817 812094629 812576056 812875271 813462138 814427435 815318406 815882564 816417694
1329.8 816417694 817084432 817479312 817330182 817077935 817314088 817832828 818100810 818244338 818628311 819048703
1350.2 819048703 819077134 818863094 818834424 818831980 818337619 817482471 816950440 816632986 815994561 815126479
1370.6 815126479 814385414 813854039 813195288 811984181 810237110 808428466 807293475 807237089 807859957
1388.9 807859957 808349967 808143854 807205975 806228995 805582702 804841518 803492367 801828086 800626040
1407.3H00626040r52542j245499j308739r97067r47058j079798p34150k81513r1970
1425.7G92987704l49462o11007j86384K14339R4533K83360Q53121J102805Q49545N13852
1446G95752406Q80659J577377J554728J123368J600743L342032L262937K281845K353549
1464.4H13729644K999425K790272K301216K776146L544450L190160K230882J544357
1480.7H35106552J431226J132369L03686k58148J88470L95954m16577j229763r29534
1499.1H35724235n13077r26197k206385l157258j550794j038968j675844j949549j583219
1517.4H21122944j372039j770556j356482p24793q31067j094342j399696j303732p84516
1535.8H10485721j217664k144217j134217O8069O020j93835r6023R0838k00093p18057
$$ plain form
1407.3 800626040 799673498 798427999 797119260 796122193 795175135 794095337 793361187 793079674 792987704
1425.7 792987704 792638242 792027235 791840851 792055190 792149723 792433083 793286204 794389009 795238554 795752406
1446 795752406 796633065 798210442 799765170 800888538 802489281 805831313 809094250 811376095 813729644
1464.4 813729644 816729069 819519341 821820557 824596703 828141153 831331313 833562195 835106552
1480.7 835106552 836537778 837670147 837973833 837715685 837904155 838300109 837883532 836653769 835724235
1499.1 835724235 835211158 834284961 832078576 828921318 827370524 826331556 824655712 822706163 821122944
1517.4 821122944 819750905 817980349 816623867 815899074 815068007 813973665 812573969 811270237 810485721
1535.8 810485721 809268057 807123840 805989623 806057692 806063712 805869877 805773854 805864692 805664599 804946542
1556.2H04946542r22859P4625K76208n76556j072168j468778j919031j929939k394020
1574.5G95014024l151477k822935k787113l250838l375828l656447m197717m454612
1590.9G67317057m369259m479707m739642m787206m684389m683554m800379m914761
1607.2G29858160m899204m679024m619658n299032n595863l858983l289521l967583
1623.5F93649292l622115k997636k548933j775027j236796m82857R23037J581907J924038
1641.8F85414910K230287L021896M056811L328323L495574O115258N240560L834903
1658.2G16738522L956974M602491M787446L941595L992319N001068M621208M391730
1674.5G52033353M938722M509747L773808L858507N582332N617202M405677M236042
$$ plain form
1556.2 804946542 804023683 804098308 804374516 803797960 802725792 801257014 799337983 797408044 795014024
1574.5 795014024 791862547 789039612 786252499 783001661 779625833 775969386 771771669 767317057
1590.9 767317057 762947798 758468091 753728449 748941243 744256854 739573300 734772921 729858160
1607.2 729858160 724958956 720279932 715660274 710361242 704765379 700906396 697616875 693649292
1623.5 693649292 690027177 687029541 684480608 682705581 681468785 680985928 681908965 683490872 685414910
1641.8 685414910 687645197 690667093 694723904 698052227 701547801 707663059 712903619 716738522
1658.2 716738522 720695496 725297987 730085433 734027028 738019347 743020415 747641623 752033353
1674.5 752033353 756972075 761481822 765255630 769114137 774696469 780313671 784719348 788955390
1690.8G88955390L776074L886759M441142M446209N192339M555464L640771L585100
1707.1H22479248L148258K676844K238512J764238J949251K474189K192437J714051
1723.4H40637028J545072J453101J382351J193881J297832J811862J677573J464486
1739.7H52463186J451015J458049J458705J353263J292110J517415J483619J146317
1756.1H63623679Q66234P09534Q59439R95636O41525K49624K38895N10216P39157O35624
1776.5H70069563N48721N95093N19096L40701L65078L84510J25944R5904M76897O21259
1796.9H74142766L53038J05083K79606M98056L51310L7789Q7381M35412M55796J63675
1817.2H76909912O6459J79350J48833k4915r1731J25706N08249L99947L2544Q4817
$$ plain form
1690.8 788955390 792731464 796618223 801059365 805505574 810697913 815253377 818894148 822479248
1707.1 822479248 825627506 828304350 830542862 832307100 834256351 836730540 838922977 840637028
1723.4 840637028 842182100 843635201 845017552 846211433 847509265 849321127 850998700 852463186
1739.7 852463186 853914201 855372250 856830955 858184218 859476328 860993743 862477362 863623679
1756.1 863623679 864489913 865199447 866058886 867054522 867696047 867945671 868184566 868694782 869433939 870069563
1776.5 870069563 870618284 871213377 871732473 872073174 872438252 872822762 872948706 873044610 873521507 874142766
1796.9 874142766 874495804 874600887 874880493 875378549 875729859 875767648 875855029 876290441 876746237 876909912
1817.2 876909912 876976371 877155721 877304554 877279639 877187908 877313614 877821863 878221810 878254354 878339171
1837.6H78339171K55049J2934k74062Q2850N12898L87371M4346m2677J27911J38045
1858H79583836k2769n961J45674K0683k30849j1802L70562L22938r53j31727P2241
1880.5H80111873J97530l159k12789j26719J30176Q8275j20580L3438K75910J14143
1900.9H80488098j93954j68204N8651N1617j27255r9957N1140j2815j94907j87695
1921.3H79664719L9756J65403m9293j71005K3424R5129j33753k61008j22428m7863
1941.7H79203081j50263j92464l1948J06395o9142l00288j85251L9696m6730k72572
1962.1H78100514k38001l0160j4603j94252k15232l4571j3947j96278k06292J1206
1982.5H76968384K5213k50280l39926j21832K0206r9659k09867r2268J8954j19329
$$ plain form
1837.6 878339171 878594220 878607154 878333092 878415942 878928840 879316211 879360557 879317880 879445791 879583836
1858 879583836 879561067 879555106 879700780 879721463 879490614 879478812 879849374 880172312 880171359 880039632 880111873
1880.5 880111873 880309403 880306244 880093455 879966736 880096912 880185187 880064607 880098045 880373955 880488098
1900.9 880488098 880294144 880125940 880184591 880236208 880108953 880008996 880060136 880047321 879852414 879664719
1921.3 879664719 879704475 879869878 879820585 879649580 879673004 879768133 879634380 879373372 879250944 879203081
1941.7 879203081 879052818 878860354 878828406 878934801 878865659 878565371 878380120 878419816 878373086 878100514
1962.1 878100514 877862513 877832353 877817750 877623498 877408266 877373695 877359748 877163470 876957178 876968384
1982.5 876968384 876993597 876743317 876403391 876281559 876301765 876202106 875992239 875899971 875918925 875799596
2002.8H75799596k51889j23203J2875j15335l01182k32280k3484l4213k00808j58489
2023.2H74371588N37o0737k32101j65403M6313J6093k12669k10643L3617O7473j55628
2045.7H73498440k25306l2067Q0883p0631j95205p6831M4346n7936j85728o4671J01209
2068.1H72816503p510j53363m8518R6440L1173r1433l5465J01209P5459p7486q8274
2090.5H72618735O8724J12832k8670o3300Q5830J25528k0683q2553L4631J10805L1113
2113H72992992n5790O080J13964P8142j2934L0040J09435N8293j4901L9160J27912
2135.4H73472393J13606K9564k39P2778J16348M6968j311O3658J24216P5698K9445
2157.9H74143124P6711J09374N4062J4961N1617J09196J18971P4386N8413Q1122P4982
$$ plain form
2002.8 875799596 875547707 875424504 875437379 875322044 875020862 874788582 874765098 874730885 874530077 874371588
2023.2 874371588 874372125 874311388 874079287 873913884 873960197 873976290 873763621 873552978 873586595 873654068 873498440
2045.7 873498440 873273134 873241067 873321950 873251319 873056114 872979283 873023629 872965693 872779965 872715294 872816503
2068.1 872816503 872808993 872655630 872607112 872703552 872734725 872643292 872607827 872709036 872784495 872707009 872618735
2090.5 872618735 872687459 872800291 872771621 872708321 872794151 872919679 872898996 872816443 872851074 872961879 872992992
2113 872992992 872937202 872943282 873057246 873135388 873122454 873152494 873261929 873320222 873305321 873344481 873472393
2135.4 873472393 873585999 873615563 873615324 873688102 873804450 873851418 873850107 873913765 874037981 874113679 874143124
2157.9 874143124 874219835 874329209 874383271 874398232 874449849 874559045 874678016 874752402 874810815 874891937 874966919
2180.3H74966919K6644K6464Q9109Q7500K4855Q106M6134O5386K5273j550O4790J24395
2204.8H75554025N6148m1247k0742N9485N8949n126j7285N1498R3580L1471l2783r536
2229.2H75778437K3901j0908n1796j4961N6505L6002m4823k6584L5405M471n5790k5630
2253.7H75704229O6280M9532p4089r2029J4305O8009K4616K325M9054M7923m2141o9260
2278.2H75748754K8431J04368M1961o3240l9101L3021k6643j16050q9825M77K1696
2300.6H75643849q3089j78754j49727j03891j33156j42753q5593j47938l66569m02331
2321H73850048j68622n4240j94848k72929r3222Q9168m6849l05235k55764L696J36614
2343.5H72687817M37379P24494L51548l56734p87258p18713l64720o140Q8334M9293
$$ plain form
2180.3 874966919 874993563 875020027 875109136 875196636 875221491 875229597 875275731 875341117 875366390 875364840 875429630 875554025
2204.8 875554025 875610173 875568926 875548184 875607669 875666618 875661492 875644207 875695705 875789285 875820756 875787973 875778437
2229.2 875778437 875802338 875791430 875739634 875724673 875781178 875817180 875772357 875745773 875781178 875785649 875729859 875704229
2253.7 875704229 875770509 875820041 875745952 875653923 875668228 875736237 875760853 875763178 875812232 875860155 875818014 875748754
2278.2 875748754 875777185 875881553 875923514 875860274 875821173 875854194 875827551 875711501 875621676 875622153 875643849
2300.6 875643849 875560760 875382006 875232279 875128388 874995232 874852479 874766886 874618948 874252379 873850048
2321 873850048 873681426 873627186 873432338 873159409 873066187 873155355 873108506 872803271 872547507 872551203 872687817
2343.5 872687817 873125196 873849690 874201238 873844504 873057246 872338533 871973813 871967673 872056007 872105300
2363.8H72105300K87414O21915O60777O33895P11203P13170N95510M63605M29511M15504
2384.2H77637804K28345J0490K7836J38521O7592p9990m6551J12712J35243r715n3823
2406.7H78168464O2465O9559n9247o6996M2022M5597n5611r4950j6213O5625J9014
2429.1H78179729o0380j3291N1975j4603j00196l1948R2507N2154q6785j00016j6093
2451.5H77953053p570q1182p3612M2081N1141j02639j59681l2604K3604o7473p5340
2474H77469778M5657O1810q1658j55747l7849O4731m9293j64092o8724O0260K2113
2496.4H77166986j21474j35660q047j847j20223j08600J9789M6611n3227j14858n8115
2518.9H76511335j9073j10090j65701l2365R7215J8120j15395q7738q166o2942j31011
$$ plain form
2363.8 872105300 872392714 873014629 873675406 874309301 875020504 875733674 876329184 876792789 877222300 877637804
2384.2 877637804 877866149 877876639 877904475 878042996 878110588 878030598 877984047 878096759 878232002 878222287 878168464
2406.7 878168464 878230929 878300488 878241241 878174245 878216267 878261864 878206253 878111303 878095090 878160715 878179729
2429.1 878179729 878119349 878106058 878158033 878143430 878043234 878011286 878103793 878155947 878069162 877969146 877953053
2451.5 877953053 877945483 877864301 877790689 877832770 877883911 877781272 877621591 877588987 877612591 877545118 877469778
2474 877469778 877515435 877577245 877495587 877339840 877301991 877366722 877317429 877153337 877084613 877144873 877166986
2496.4 877166986 877045512 876909852 876901805 876899958 876779735 876671135 876690924 876737535 876684308 876569450 876511335
2518.9 876511335 876492262 876382172 876216471 876184106 876281321 876299441 876184046 876096308 876088142 876025200 875894189
2541.3H75894189m9055L9578k4557j36316j30236l0876m768r6440j28806l7491p153
2563.7H75288069j05381j46389l8683J3172r8526j59323o5446j4901j15276j94549
2584.1H74362767j40846o5804r5546j94371j72376n1499q2314k34544k46048j12057
2604.5H72967362r2268k10464k04444n5372n1379k38479l02374j61290q2851j63197
2624.9H71405244k16067j36375q1540k08616l30031k15530p6175j56343k59161j77622
2645.3H69547784p8499j53542k78294k38061j08659j01924k07960k18809r0063r1970
2665.7H67980003k69293k80202q7023m5538k03013k49743j28627j15991k79784l51429
2686.1H65969360k37763j40667j85788k44856j75833j06037j96516l05713k67863j91808
$$ plain form
2541.3 875894189 875845134 875884712 875860155 875723839 875593603 875562727 875557959 875461519 875332713 875295222 875288069
2563.7 875288069 875182688 875036299 874997616 875010788 874912262 874752939 874687493 874672592 874557316 874362767
2584.1 874362767 874221921 874156117 874060571 873866200 873693824 873642325 873560011 873325467 873079419 872967362
2604.5 872967362 872875094 872664630 872460186 872404814 872353435 872114956 871812582 871651292 871568441 871405244
2624.9 871405244 871189177 871052802 870971262 870762646 870432615 870217085 870140910 869984567 869725406 869547784
2645.3 869547784 869469285 869315743 869037449 868799388 868690729 868588805 868380845 868162036 868071973 867980003
2665.7 867980003 867710710 867430508 867343485 867297947 867094934 866845191 866716564 866600573 866320789 865969360
2686.1 865969360 865731597 865590930 865405142 865160286 864984453 864878416 864681900 864376187 864108324 863916516
2706.5H63916516k07901k76863k56777j37985j30415k56955k64168j24157r5486k57373
2726.9H61908436l47436k20358j38521k33710l02792k45034j78635k04027k10583j09613
2747.3H59717727q1897k38419l78191l39389k18749j97172k89738l25024k54035k29955
2767.7H57165158l13103l04878j64569j93119l78906m20690l09944k52426k84135k80500
2788.1H54262888k83122l65615m38928m34280l98337m11332m78268n47290m89056l56674
2808.5H50059986m30763o20663o13034m69148m67896o03616o34313n64575n89550o85990
2828.9H44380438o92486o27876o61731q60095j168310j476467j701593j902163k030254
2847.2H33259463j865029j384139q74043n59210l45528k40326m05014o72758q03709
$$ plain form
2706.5 863916516 863708615 863431752 863174975 863036990 862906575 862649620 862385452 862261295 862165809 861908436
2726.9 861908436 861561000 861340642 861202121 860968411 860665619 860420585 860241950 860037923 859827340 859717727
2747.3 859717727 859635830 859397411 859019220 858679831 858461082 858263910 857974172 857649148 857395113 857165158
2767.7 857165158 856852055 856547177 856382608 856189489 855810583 855389893 855079949 854827523 854543388 854262888
2788.1 854262888 853979766 853614151 853175223 852740943 852342606 851931274 851453006 850905716 850416660 850059986
2808.5 850059986 849629223 849008560 848395526 847926378 847458482 846854866 846220553 845655978 845066428 844380438
2828.9 844380438 843687952 843060076 842398345 841538250 840369940 838893473 837191880 835289717 833259463
2847.2 833259463 831394434 830010295 829136252 828577042 828231514 827991188 827586174 826913416 826109707
2865.6H26109707q45372q67308q40008q10981p90000p16805o81698o69241n57423n36561
2886H18794310p45714r40144q99911p50899q20637j052618j048565q89122r41038j151860
2906.4H09553802j227021j199663j381278j737118j875341j688957j396894j073480
2922.7G97974050o76334k10643R9600P2360J36018N25176Q34227Q92281R67860J127959
2943.1H01742554J035273N72800J62065Q9229j0074l13043l86536p7427K37346K55167
2963.5H03307354J90855L44038N39064N63502M67420M22656N73397O25014L33488J19627
2983.9H07486415K24471L34799L30687K28524K6822j00076k69711n00143m99189m43160
3004.3H06819439n02586m08054j47879j60515n35608q25226q11577p18653p23422p97092
$$ plain form
2865.6 826109707 825264335 824397027 823557019 822746038 821956038 821239233 820557535 819888294 819330871 818794310
2886 818794310 818048596 817108452 816208541 815457642 814637005 813584387 812535822 811646700 810705662 809553802
2906.4 809553802 808326781 807127118 805745840 804008722 802133381 800444424 799047530 797974050
2922.7 797974050 797297716 797087073 797186673 797259033 797395051 797920227 798754454 799646735 800614595 801742554
2943.1 801742554 802777827 803350627 803512692 803601921 803591847 803278804 802892268 802814841 803052187 803307354
2963.5 803307354 803498209 803842247 804381311 804944813 805412233 805834889 806408286 807033300 807366788 807486415
2983.9 807486415 807710886 808045685 808376372 808604896 808631718 808531642 808261931 807761788 807262599 806819439
3004.3 806819439 806316853 805908799 805760920 805600405 805064797 804239571 803427994 802709341 801985919 801188827
3024.7H01188827q35240p20919o15537o80327q23855r06051q05378p05599q15869j010537
3045.1G93269515j088321j016140r88305j033783j027941j109302j227975j108051
3061.4G84669697q86798q27849r30905j050711j074075j026094q95620p48038q30769
3079.7G76398838j072526j213849j234651j129150j102626j318157j381517j159846
3096G66786516j025021j151741j303017j197398j058936j190245j395822j315534j047730
3114.4G56101072j043379j286507j539052j722932j740455j622319j451433j409113
3130.7G44285882j556755j563549j322806j262962j624763j946986j851142j610934
3147G31545985j469970j457810j666189j931846k004206j974881j900732j776755j779079
$$ plain form
3024.7 801188827 800353587 799632668 799017131 798336804 797512949 796606898 795801520 795095921 794280052 793269515
3045.1 793269515 792181194 791165054 790176749 789142966 788115025 787005723 785777748 784669697
3061.4 784669697 783782899 782955050 782024145 780973434 779899359 778873265 777977645 777229607 776398838
3079.7 776398838 775326312 774112463 772877812 771748662 770646036 769327879 767946362 766786516
3096 766786516 765761495 764609754 763306737 762109339 761050403 759860158 758464336 757148802 756101072
3114.4 756101072 755057693 753771186 752232134 750509202 748768747 747146428 745694995 744285882
3130.7 744285882 742729127 741165578 739842772 738579810 736955047 735008061 733156919 731545985
3147 731545985 730076015 728618205 726952016 725020170 723015964 721041083 719140351 717363596 715584517
3165.4G15584517j908958j943171j868248j870990j973689k045333j997292j934886
3181.7G00041950k006769k066434j959145j910329k072573k194643k137124k058983
3198F83635950k051771k067506k046347k013385k045095k093553k063096j971722j935720
3216.4F65347755k022922k099514k021968j962305k044379k007544j759589j642644
3232.7F49786890j864493k067387j928688j724064j667857j609087j578867j671911
3249F35674536j688480j536489j383722j391053j514196j579762j538813j441717j329124
3267.4F22271180j257300j351834j515150j598537j690328j727760j647591j604796
3283.7F09877884j646518j618982j484334j482725j719177j934111k006173k025426
$$ plain form
3165.4 715584517 713675559 711732388 709864140 707993150 706019461 703974128 701976836 700041950
3181.7 700041950 698035181 695968747 694009602 692099273 690026700 687832057 685694933 683635950
3198 683635950 681584179 679516673 677470326 675456941 673411846 671318293 669255197 667283475 665347755
3216.4 665347755 663324833 661225319 659203351 657241046 655196667 653189123 651429534 649786890
3232.7 649786890 647922397 645855010 643926322 642202258 640534401 638925314 637346447 635674536
3249 635674536 633986056 632449567 631065845 629674792 628160596 626580834 625042021 623600304 622271180
3267.4 622271180 621013880 619662046 618146896 616548359 614858031 613130271 611482680 609877884
3283.7 609877884 608231366 606612384 605128050 603645325 601926148 599992037 597985864 595960438
3300E95960438j928031j747370j783013k112806k446413k544344k440691k347767k367079
3318.4E76242924k360046k235532k204835k513469k831101k740324k544283k510310
3334.7E56303024k506077k571106k733409k875686k966404k864480k585769k653599
3351E34546494l074824l184378k902389k688587k758026k820492k560854k363324k645731
3369.3E09547889l056049l013790k610028k359062k278060k210289k112389j907110
3385.7D90001112j577347j271963j341969j712740j745581j226753q68082j238436
3402D79018241j679987j422524r16421p50214q10892r12547q72791o15418m34607l65466
3422.4D70237374j55776J29163L27974L47346M36306O76334N97060K57880K74360P01904
$$ plain form
3300 595960438 594032407 592285037 590502024 588389218 585942805 583398461 580957770 578610003 576242924
3318.4 576242924 573882878 571647346 569442511 566929042 564097941 561357617 558813334 556303024
3334.7 556303024 553796947 551225841 548492432 545616746 542650342 539785862 537200093 534546494
3351 534546494 531471670 528287292 525384903 522696316 519938290 517117798 514556944 512193620 509547889
3369.3 509547889 506491840 503478050 500868022 498508960 496230900 494020611 491908222 490001112
3385.7 490001112 488423765 487151802 485809833 484097093 482351512 481124759 480256677 479018241
3402 479018241 477338254 475915730 474999309 474249095 473438203 472525656 471652865 471037447 470602840 470237374
3422.4 470237374 470081598 470210761 470538735 470886081 471322387 471998721 472595781 472853661 473128021 473829925
3442.8D73829925J049489J182407J243234J328677J445621J553506J759380J962930
3459.1D85355169J845598J824915K248943K463520K063334J544296J545728J936704
3475.4E00828207K304375K352714K084077K034366K285838K315044K177835K299785
3491.7E18682241K517343K599120K474606K324343K391100K390742K206326K278745
3508E37864566K675533K960205K796173K454758K462983K745748L001868K897323K624333
3526.4E62483490K745807K995312L066540L172338L231108L120482L188848L369093
3542.7E87373018L349066L185809L089249L148734L371895L554702L563642L598213
3559F14234328L629804L375292L224015M043639M741788M282534L877043L987194M240453
$$ plain form
3442.8 473829925 474879414 476061821 477305055 478633732 480079353 481632859 483392239 485355169
3459.1 485355169 487200767 489025682 491274625 493738145 495801479 497345775 498891503 500828207
3475.4 500828207 503132582 505485296 507569373 509603739 511889577 514204621 516382456 518682241
3491.7 518682241 521199584 523798704 526273310 528597653 530988753 533379495 535585821 537864566
3508 537864566 540540099 543500304 546296477 548751235 551214218 553959966 556961834 559859157 562483490
3526.4 562483490 565229297 568224609 571291149 574463487 577694595 580815077 584003925 587373018
3542.7 587373018 590722084 593907893 596997142 600145876 603517771 607072473 610636115 614234328
3559 614234328 617864132 621239424 624463439 628507078 633248866 637531400 641408443 645395637 649636090
3577.4F49636090M503250M625022M359126M047513M387677M858434M516006M334271
3593.7F85267389M742622M989863M911482M805267M522919M199386M446209M753768
3610G22638905M689395M684687M352331M270435M941523M761338L778100L050566L590464
3628.4G60757744M886091M446268L767669L612280L455162L321171L072143K547145
3644.7G89865673K151608K704978L547907L061771K419234K651214K776206K202987
3661H11381578J732767J506507J095117R07600J381278J210033Q55506J539290J863658
3679.4H23473334J587332J244902P96437L70443L52800J006902J545310J512229J155913
3697.7H33045602P59661O80745R05275P69973K54989j7822N01275J117885R15944M55738
$$ plain form
3577.4 649636090 654139340 658764362 663123488 667171001 671558678 676417112 680933118 685267389
3593.7 685267389 690010011 694999874 699911356 704716623 709239542 713438928 717885137 722638905
3610 722638905 727328300 732012987 736365318 740635753 745577276 750338614 754116714 757167280 760757744
3628.4 760757744 765643835 770090103 773857772 777470052 780925214 784246385 787318528 789865673
3644.7 789865673 792017281 794722259 798270166 801331937 803751171 806402385 809178591 811381578
3661 811381578 813114345 814620852 815715969 816623569 818004847 819214880 820070386 821609676 823473334
3679.4 823473334 825060666 826305568 827102005 827472448 827825248 828832150 830377460 831889689 833045602
3697.7 833045602 833805263 834486008 835391283 836161256 836416245 836398423 836899698 838017583 838933527 839389265
3718.1H39389265J89900J19627J51157L11315M98712L03388j01805o4850O07610R49383
3738.5H42353702L98933m53889m67181L95715K63691q6605N34951Q63612M72426J88351
3758.9H44463706L88742M23192J35720j490K4021K76029N04494L35097O6578n9Q5473
3781.3H46701503O4611J04666K84791K82109P8976j60337k58088k06768l35276k19822
3801.7H46336365L18408K92718K35140M08710J97589k36690l59118j64986k20120J01090
3822.1H46909106M70996K25246O6757M5001K8611M8697k59817m82857L4034M65691
3842.5H47551465N41806L78430j61230r34542j272916J39534J157045O04093o3359
3860.9H47940326l00944q2493j9371l07918j26660L08693L67760J61708j29879k6822
$$ plain form
3718.1 839389265 839579165 839698792 839849949 840161264 840659976 840963364 840861559 840796709 841404319 842353702
3738.5 842353702 842752635 842298746 841831565 842227280 842490971 842404366 842939317 843802929 844275355 844463706
3758.9 844463706 844852448 845275640 845411360 845409870 845433891 845709920 846214414 846549511 846616089 846616030 846701503
3781.3 846701503 846766114 846870780 847155571 847437680 847516656 847356319 847098231 846891463 846556187 846336365
3801.7 846336365 846654773 846947491 847182631 847591341 847788930 847552240 847193122 847028136 846808016 846909106
3822.1 846909106 847380102 847605348 847672105 847717106 847745717 847794414 847534597 847051740 847085774 847551465
3842.5 847551465 848093271 848471701 848310471 847375929 846103013 846242547 847399592 848003685 847940326
3860.9 847940326 847639382 847556889 847537518 847229600 847102940 847411633 847779393 847941101 847811222 847784400
3881.3H47784400J62423O6578O4552p3850j61350J77324K27034k30432n45978l86417
3901.7H47084284M8280N14268N92173K83897q524j93894k98202j67668R3401J23501
3922.1H48071516j4067j5319k4676j14500J5378K23815J87874O1333n2392j57595r6679
3944.5H48084688p450n901R0241J87636J31189J3054o4969n3764N7161J44959J14917
3966.9H48691761K8193j1444J7941L9637k801m5359N0068J72973J07467j2636k2531
3989.4H49013269l1114q1122l9279J13130
3997.5H48974884
$$ plain form
3881.3 847784400 847946823 848013401 848077953 848004103 847842753 848020077 848247111 848016679 847470701 847084284
3901.7 847084284 847132564 847646832 848239005 848522902 848514378 848320484 848022282 847854614 847948015 848071516
3922.1 848071516 848057449 848042130 848017454 847902954 847918332 848142147 848330021 848391354 848338962 848181367 848084688
3944.5 848084688 848077238 848071337 848161578 848349214 848480403 848493457 848428488 848374724 848431885 848576844 848691761
3966.9 848691761 848719954 848708510 848726451 848766088 848763287 848717928 848767996 848940969 849048436 849035800 849013269
3989.4 849013269 848982155 848901033 848861754 848974884
3997.5 848974884
##END=$$ End of the data block
