##TITLE=$$ Begin of the data block
##JCAMP-DX=5.00 $$ ACD/SpecManager v 10.08
##SPECTROMETER/DATA SYSTEM=Alpha
##DATE=07 Apr 2014 11:14:18
##DATA TYPE=INFRARED SPECTRUM
##DATA CLASS=XYDATA
##ORIGIN=
##OWNER=
##NPOINTS=1765
##FIRSTX=399.75695801
##LASTX=3997.56933594
##MAXX=3997.56933594
##MINX=399.75695801
##MAXY=0.88093001
##MINY=0.47013769
##XFACTOR=1.0000000000
##YFACTOR=1.000000000000000e-9
##FIRSTY=0.75862217
##DELTAX=2.03957629
##XUNITS=1/CM
##YUNITS=ARBITRARY UNITS
##XYDATA=(X++(Y..Y))
399.8G58622169k701342l461361L26992J381099k293110k769411J372516K373755j733958
418.1G51117349l056527J442552J609266k211928k142787J337409J037955k462447
434.4G46670842j863122J911223J327753k459466k055168J684665J504600j853048
450.7G44868279j692594J549066R65952k598941j580596J890063J138032k440751k138376
469.1G39960134J287699J144767j954377j562834J366377J143873j757384j609206
485.4G38019049J250327J068830j659274j606345J025438J062632j507938j773059
501.7G35879660N48958P05421j453578j575351P17759R96948j553238k270341Q4162
520.1G32080400Q09669j201987j885533P8082P70330j025676j955033l58641P55429
$$ y = [758622169, 755920827, 752459466, 752786458, 754167557, 751874447, 749105036, 750477552, 752851307, 751117349, 748060822, 749503374, 751112640, 748900712, 746757925, 748095334, 749133289, 746670842, 744807720, 746718943, 748046696, 745587230, 743532062, 745216727, 746721327, 744868279, 743175685, 744724751, 745690703, 743091762, 741511166, 743401229, 744539261, 742098510, 739960134, 741247833, 742392600, 740438223, 738875389, 740241766, 741385639, 739628255, 738019049, 739269376, 740338206, 738678932, 737072587, 738098025, 739160657, 737652719, 735879660, 736428618, 737134039, 735680461, 734105110, 734822869, 735819817, 734266579, 731996238, 732080400, 732890069, 731688082, 729802549, 729880631, 730650961, 729625285, 727670252, 727311611, 728067040]
538.4G28067040o26385j612425j88529R14335m60565j777470o83010N39482m44531
556.8G23727942j601398p80702L26216m33802j815260j355648M4644l38376j842260
575.2G15931356j605392l8862q166j306355j345872n723J73748j206994j385868J53065
595.6G09354937L88503j306891j977086o87302o9975j370490j956820k75553R62675
613.9G03061998J7166m68731J450300L147245K318740J092612K208054L680766K517223
632.3G19025373O95348J480162L002525J933276p0750N81741K697051K325534K16127
650.6G31886387L61979K131522J999497P17819J474499L405035L006399O61790M23610
669G46068537K823115K564191N05388K61426K455354K843201N72741j50680J781523
$$ y = [728067040, 727440655, 725828230, 725639701, 726554036, 726093471, 724316001, 723632991, 724172473, 723727942, 722126544, 721345842, 721672058, 721238256, 719422996, 718067348, 718111992, 717773616, 715931356, 714325964, 714287102, 714278936, 712972581, 711626709, 711620986, 711794734, 710587740, 709201872, 709354937, 709743440, 708436549, 706459463, 705772161, 705702186, 704331696, 702374876, 702099323, 703061998, 703079164, 702610433, 704060733, 707207978, 709526718, 710619330, 712827384, 716508150, 719025373, 719720721, 721200883, 724203408, 726136684, 726065934, 726647675, 729344726, 731670260, 731886387, 732248366, 734379888, 736379385, 737097204, 738571703, 741976738, 744983137, 745644927, 746068537, 748891652, 751455843, 751961231, 752222657, 754678011, 757521212, 758093953, 757943273, 759724796]
687.3G59724796K408206L10958o65486J244485K224446K63989q73149J058877K505779
705.7G68202901R04977m45306J169979K693117J253188l82841R85205K829552J574516
724G78785288l31163O69777K531290J611650m21762K08378K191841J683712l35991
742.4G86593020O8605K183318K062321R9599J39356K057612K143979K26557q2433J686692
762.8G97178626J989842J31964n09977J087785J623153k26915j182317K54333J022756
781.2H01369250n00739j491427L6776J542866P39992q4043J462639L245711K645135
799.5H08966160J459598K270282L550529K683878R01520J031816K214194J678645m5955
817.9H24710667l20852O06895J37985j691461k157807r76861q01623k110123k401531
$$ y = [759724796, 762133002, 762443960, 761778474, 763022959, 765247405, 765511394, 764638245, 765697122, 768202901, 769107878, 768662572, 769832551, 772525668, 773778856, 773396015, 774381220, 777210772, 778785288, 778454125, 779123902, 781655192, 783266842, 782845080, 783053458, 785245299, 786929011, 786593020, 786661625, 788844943, 790907264, 791006863, 791146219, 793203831, 795347810, 795574367, 795491934, 797178626, 799168468, 799300432, 798790455, 799878240, 801501393, 801274478, 800092161, 800346494, 801369250, 800868511, 799377084, 799413860, 800956726, 801696718, 801612675, 803075314, 806321025, 808966160, 810425758, 812696040, 816246569, 818930447, 819831967, 820863783, 823077977, 824756622, 824710667, 824389815, 824996710, 825134695, 823443234, 821285427, 820308566, 819506943, 817396820, 814995289]
836.2H14995289r72390k49446j300394j909495o53207O50585N08308N52178K271950
854.6H13893378L925919L621400K821743L503919M408538L531099J936435J815856
870.9H39458287K547145J987278N05328K13266R79125O89447p56204j190424l01957
889.3H44131291j45137j130701j226484K26140J161575M86016k0504Q67009J498998
907.6H45848203M61340p63357n44429j17123j151741k373099j850247n95272n45442
926H38368833j010656k07722J111149Q94666l03447l39031N53309L59238q47161j090527
946.4H37488651l01063m48704j829087k543390k075613k229690l618062m540503m291057
964.7H15611482m402519n680501o558240n855083m818857m685521m584908l531993
$$ y = [814995289, 814022899, 813773453, 812473059, 810563564, 809910357, 810560942, 811069250, 811621428, 813893378, 817819297, 821440697, 824262440, 827766359, 832174897, 835705996, 837642431, 839458287, 842005432, 843992710, 844498038, 844711304, 845690429, 846379876, 845623672, 844433248, 844131291, 843986154, 842855453, 841628969, 841855109, 843016684, 843502700, 843482196, 844349205, 845848203, 846309543, 845546186, 845001757, 844884634, 843732893, 841359794, 839509547, 838914275, 838368833, 837358177, 837150455, 838261604, 839156270, 838852823, 838513792, 839067101, 839426339, 838579178, 837488651, 837187588, 836738884, 834909797, 832366407, 830290794, 828061104, 824443042, 819902539, 815611482, 811208963, 805528462, 798970222, 793115139, 788296282, 783610761, 779025853, 775493860]
981G75493860k474546k565563k957106k302944j289427j305640j745522j270056l18885
999.4G59264171k29597r08077j116514q29339j266658k412498k875209k387464k184510
1017.7G45054305k677918k761483k074897j736582k188861k433777j884341j399398
1034.1G27897048j644373j842499j308381q17240j134336j662910j570701j157046
1050.4G16759562j120686j115739m72367L80575N25713L5942l02911m67121j102925
1068.7G13120043k042114k398551k131104k010823k232969k236545j921892j882791
1085F96263254k260268k432287k035677j518011j333237j211226q31902n21839o01709
1103.4F83517098q32140q35240p26402q62002j138508j257122j379311j802743k178490
$$ y = [775493860, 773019314, 770453751, 767496645, 765193701, 763904274, 762598634, 760853112, 759583056, 759264171, 759034574, 758126497, 757009983, 756180644, 754913986, 752501488, 749626279, 747238815, 745054305, 742376387, 739614904, 737540007, 735803425, 733614564, 731180787, 729296446, 727897048, 726252675, 724410176, 723101795, 722284555, 721150219, 719487309, 717916608, 716759562, 715638876, 714523137, 714050770, 714431345, 714957058, 714993000, 714690089, 714222968, 713120043, 711077929, 708679378, 706548274, 704537451, 702304482, 700067937, 698146045, 696263254, 694002986, 691570699, 689535022, 688017011, 686683774, 685472548, 684640646, 684118807, 683517098, 682684958, 681849718, 681123316, 680261314, 679122806, 677865684, 676486373, 674683630, 672505140]
1121.8F72505140j872301j224160p07388L34859J473248J598895J373291J459598J599014
1140.1F76540196J697361J667798J375139J056671J036286J219511J300633J289308
1156.4F87182903J462639J841783K216697K559721L044725L657281M092098M186511
1172.7G10244358M161655M218936M236997M060447L752410L458560L132343K568185
1189.1G39833891J820326J272798J009762P51197N22435O26385J062751J443565J489282
1207.4G49832392J380563J328885J197934R04322O72638P05839Q52167Q17061O83248
1225.8G58375049P75337J040161J104116R84609J037598J225590J201868R51946P64549
1244.1G67460823P10249N66423K39849o854N0067J97649J96994K56896O41107J118780
$$ y = [672505140, 670632839, 669408679, 668701291, 669036150, 670509398, 672108293, 673481584, 674941182, 676540196, 678237557, 679905355, 681280494, 682337165, 683373451, 684592962, 685893595, 687182903, 688645542, 690487325, 692704022, 695263743, 698308468, 701965749, 706057847, 710244358, 714406013, 718624949, 722861946, 726922393, 730674803, 734133363, 737265706, 739833891, 741654217, 742927015, 743936777, 744687974, 745210409, 745836794, 746899545, 748343110, 749832392, 751212955, 752541840, 753739774, 754644096, 755316734, 756022573, 756874740, 757691801, 758375049, 759150386, 760190547, 761294663, 762279272, 763316870, 764542460, 765744328, 766696274, 767460823, 768171072, 768737495, 768977344, 768970490, 769020557, 769218206, 769415200, 769672096, 770313203, 771431983]
1264.5G71431983J310348J342356J605273J978874K029061J859605J914621K180397
1280.8G85652518K246380K085984K122760K383947K409697K094507J870692J939892
1297.2H02806377J883150J470148J157820J219213J216352Q34346M86732N74827P18593
1315.5H12367558M91918L10301O01590R58026Q80718N66840N30720O72161M30286r9599
1335.9H17710519k11835K38001M63605K06053J30058L96371M24862L4689j95741k1100
1356.3H19175482q702m81248q43287n50985l31879o30975q43823p05897n47290p19250
1376.7H13512146j215815j718402j804709j127065l4153O22809M78923j98483r15051
1395.1H07600200r48071o41406p69317j355648j639843j191199r62555j248837j295805
$$ y = [771431983, 772742331, 774084687, 775689960, 777668834, 779697895, 781557500, 783472121, 785652518, 787898898, 789984882, 792107642, 794491589, 796901286, 798995793, 800866485, 802806377, 804689527, 806159675, 807317495, 808536708, 809753060, 810587406, 811074138, 811648965, 812367558, 812859476, 813169777, 813771367, 814729393, 815610111, 816176951, 816707671, 817379832, 817810118, 817710519, 817498684, 817736685, 818200290, 818406343, 818536401, 818932772, 819357634, 819392323, 819196582, 819175482, 819166780, 818685532, 817842245, 817291260, 816959381, 816328406, 815484583, 814778686, 814231396, 813512146, 812296331, 810577929, 808773220, 807646155, 807612002, 808234811, 808713734, 808515251, 807600200, 806652129, 806010723, 805241406, 803885758, 802245915, 801054716, 800092161, 798843324, 797547519]
1413.4G97547519r70781r06467j094759q18431l22819q8453l55601o12736j58548K59578
1433.8G92478502J20640K22802P41720J043200Q79765N89132R03190J514315J506329
1452.2G99999595J176834J723110L359616L184378K246738K370596L015041K813757
1468.5H19889665K382755K867043L512979L081798K177954J551091J441122J148283
1484.8H38052690L59416j81973J85311L32117m31716j215876r68992n65768r08732
1503.2H34656477k055883k988399j603543j153171j733721j929283j540243j346410
1519.5H20305824j736641j355409p63238q97348j144588j388311j279831p64489j116514
1537.8H09859455j981199j122534m5538j03057k42829j04725Q7976j38342n52416p66933
$$ y = [797547519, 796576738, 795670271, 794575512, 793757081, 793434262, 793345809, 792990208, 792377472, 792218924, 792478502, 792599142, 792821944, 793563664, 794606864, 795486629, 796075761, 796978951, 798493266, 799999595, 801176429, 802899539, 806259155, 809443533, 811690271, 814060867, 817075908, 819889665, 822272420, 825139463, 828652442, 831734240, 833912194, 835463285, 836904407, 838052690, 838412106, 838230133, 838415444, 838747561, 838315845, 837099969, 836130977, 835565209, 834656477, 832600594, 829612195, 828008652, 826855481, 825121760, 823192477, 821652234, 820305824, 818569183, 817213774, 816450536, 815553188, 814408600, 813020289, 811740458, 810975969, 809859455, 807878256, 806755722, 806710184, 806607127, 806364298, 806259573, 806347549, 806209207, 805656791, 804889858]
1558.2H04889858n3346Q5532o55710j065731j409889j901507j949728k355933l110289
1576.6G92473257k870262k848446l291846l416598l697455m220724m451990m357219
1592.9G63318717m492580m793764m867136m744172m668653m754663m896223m903496
1609.2G25198030m714489m639208n264461n613327l930688l272712l899872l616751
1625.5F90246522l022253k583742j827061j247943m29690R15528J519918J912892K278149
1643.9F87762320L077388M104078L421485L637254O096363N095959L803909M029989
1660.2G21028745M687727M813909L962696M049361N019664M602075M384518M893005
1676.5G57441700M471480L826142L969669N597115N509019M336059M220605L804504
$$ y = [804889858, 804836512, 804922044, 804266334, 803200603, 801790714, 799889207, 797939479, 795583546, 792473257, 789602995, 786754549, 783462703, 780046105, 776348650, 772127926, 767675936, 763318717, 758826137, 754032373, 749165237, 744421065, 739752412, 734997749, 730101526, 725198030, 720483541, 715844333, 710579872, 704966545, 701035857, 697763145, 693863273, 690246522, 687224269, 684640527, 682813466, 681565523, 681135833, 682051361, 683571279, 685484171, 687762320, 690839708, 694943786, 698365271, 702002525, 708098888, 713194847, 716998756, 721028745, 725716472, 730530381, 734493077, 738542438, 743562102, 748164177, 752548695, 757441700, 761913180, 765739322, 769708991, 775306106, 780815125, 785151184, 789371789, 793176293]
1692.8G93176293L967286M515588M477858N172313M518091L623903L525972L082395
1709.2H26059699K686799K315938J872122K015531K420247K105475J659512J509011
1725.5H42644334J450777J435935J289189J366735J738667J568556J415968J460433
1741.8H54370594J504660J494884J367450J288712J469135J440346J151860Q72076
1758.1H64959717O88076Q39233R96292O63102K65836K52605N27084P30097O28590N56410
1778.5H71107042N92828M96089L21865L76046M13835J55806J02878M30286N60880L51309
1798.9H74908864J47224K87414M79221L42190L2783P0154M17471M54307J68919P3016
1819.3H77381563K04563K01345J8596q6367J09732M69983L59714K1994R2685K77102
$$ y = [793176293, 797143579, 801659167, 806137025, 811309338, 815827429, 819451332, 822977304, 826059699, 828746498, 831062436, 832934558, 834950089, 837370336, 839475811, 841135323, 842644334, 844095111, 845531046, 846820235, 848186970, 849925637, 851494193, 852910161, 854370594, 855875254, 857370138, 858737588, 860026300, 861495435, 862935781, 864087641, 864959717, 865647793, 866487026, 867483318, 868146420, 868412256, 868664861, 869191945, 869922042, 870550632, 871107042, 871699870, 872195959, 872517824, 872893870, 873307705, 873463511, 873566389, 873996675, 874557555, 874908864, 875056088, 875343502, 875822723, 876164913, 876197696, 876267850, 876685321, 877139628, 877308547, 877381563, 877586126, 877787471, 877806067, 877719700, 877829432, 878299415, 878659129, 878681123, 878773808, 879050910]
1839.7H79050910O4672k24650O4432M44651L28243K2947m3928J36673J70708J5676
1860.1H80030334J1981J50620M0234k12193m7684L08395K88069j907j09196R8944K15470
1882.5H80773067J8120j90735j24871J13368P7069j23024K4020K63155R9838k07663
1902.9H80722344j69754M9412J4484j52051n5433J37747K9981k17200k18153J7286
1923.3H80158663J38938p1764j79648M4286J21474j41918k79427j21474m5061j55390
1943.7H79468679j87039j5140J09733p9930k97725j64450N1558p0512l16858k62559
1964.1H78235757l1948m053j78635j96338n662M530k14100k46406j9371K5868k19822
1986.5H77149820l00944q7320L0398j32024k55406r6440N5491r8586k59101j41084
$$ y = [879050910, 879115582, 878890932, 878955364, 879400015, 879728258, 879751205, 879707277, 879843950, 880014658, 880030334, 880042315, 880192935, 880233169, 880020976, 879973292, 880281687, 880569756, 880567849, 880458653, 880557597, 880773067, 880791187, 880600452, 880475581, 880588949, 880666018, 880542994, 880567014, 880830169, 880930007, 880722344, 880552590, 880602002, 880616486, 880464435, 880409002, 880546749, 880576730, 880359530, 880141377, 880158663, 880297601, 880225837, 880046189, 880090475, 880211949, 880070031, 879790604, 879669130, 879624069, 879468679, 879281640, 879266500, 879376233, 879296303, 878998578, 878834128, 878885686, 878815174, 878498316, 878235757, 878203809, 878199756, 878021121, 877824783, 877819121, 877823651, 877609551, 877363145, 877343774, 877369642, 877149820, 876848876, 876761556, 876791954, 876659930, 876404524, 876308084, 876363575, 876264989, 876005888, 875864804]
2006.9H75864804k265j22070l02792k10524J6570j9073k29001j91212L636n0306k54572
2029.4H74503195j94430M1962J2636k18272k20001L517M6312j34229j76072j1683N3346
2051.8H73706281r1374j81436n0307N5969o8843j70887k9921R8705m768j33396o0379
2074.2H73069644O5982R895r3043l2842R3937P5578p5876r1196Q4043J49369n36p8857
2098.7H73176098M5955J10984j0312o4730M9948J01447M411n1081L2127J18494Q4996
2121.1H73598337N365K8312R9778O1750k6822L636J13487J31906N4955J7405P9214
2143.6H74167323J18554L8922k7061N5790J50979J08718N7996Q4102Q6188K8551l636
2166H74866426M9829J32919J34229N9784L4749Q0407R0659L6597K3305Q3089R9898
$$ y = [875864804, 875862539, 875740469, 875437677, 875227153, 875243723, 875224650, 874995649, 874804437, 874808073, 874757767, 874503195, 874308765, 874350727, 874363363, 874145091, 873925090, 873928607, 873974919, 873840690, 873664618, 873652935, 873706281, 873614907, 873433471, 873383164, 873439133, 873370290, 873199403, 873169482, 873268187, 873263419, 873130023, 873069644, 873135626, 873145521, 873052478, 873019636, 873113573, 873189151, 873113275, 873022079, 873106122, 873255491, 873254955, 873176098, 873222053, 873333037, 873322725, 873257995, 873307943, 873409390, 873413801, 873362720, 873394847, 873513341, 873598337, 873603702, 873632014, 873731792, 873793542, 873766720, 873770356, 873883843, 874015749, 874070704, 874088109, 874167323, 874285877, 874324799, 874297738, 874353528, 874504507, 874613225, 874671221, 874755323, 874841511, 874870062, 874866426, 874916255, 875049174, 875183403, 875243187, 875277936, 875358343, 875449002, 875485599, 875508904, 875591993, 875691891]
2188.4H75691891K6226j550N3823O2168K682k0027N4359J21236P4208j1683j7345L5286
2212.9H76071274N5135J5378j6213K8432O1452J1682k9027l159K8729P75l0517J9669
2237.4H76213610Q8275N1438l9637l0458J6630l6180p1168K1100R0301J5021r9838
2259.8H76219094r2328L9280R2983N960k1994N4717N5909n9604q1182P0930J52051
2282.3H76435816M1306o4373j7106L9041l4034j04070o1035J907k6286j16288j46151
2304.7H75948727r5546p9513j46031j50502m2140p3731k82109l33488j59681r2327
2325.1H74493659k12491k36869o1750L3557j37687k34842o4790N0008P3373L83914
2345.5H74086082O34551K83599l13222o64413n80669k48849q7858j68144l5286L66568
$$ y = [875691891, 875718117, 875716567, 875770390, 875832558, 875835240, 875815213, 875869572, 875990808, 876065016, 876053333, 876035988, 876071274, 876126409, 876141787, 876125574, 876154006, 876215458, 876227140, 876198113, 876194954, 876223683, 876224458, 876193941, 876213610, 876301885, 876353323, 876313686, 876283228, 876299858, 876263678, 876192510, 876213610, 876303911, 876318932, 876219094, 876126766, 876166046, 876259029, 876264989, 876242995, 876297712, 876353621, 876294017, 876212835, 876283765, 876435816, 876477122, 876412749, 876395643, 876434684, 876400650, 876296580, 876235545, 876237452, 876211166, 876094878, 875948727, 875853181, 875773668, 875627637, 875477135, 875434995, 875361264, 875079155, 874745667, 874585986, 874493659, 874281168, 874044299, 873982549, 874016106, 873878419, 873643577, 873578787, 873628795, 873702168, 874086082, 874720633, 875004232, 874691010, 874026597, 873445928, 873197079, 873109221, 872941077, 872905791, 873272359]
2365.9H73272359O21200O17325N88119O37710O31690N07236M16636M31955M04716K19166
2386.3H78348112L2723M2319J27137O4015n6207l1113Q0466Q1956k8908m2140O3836
2408.7H78682196P8023j7047l6419L9101M5657n4419j01387j3471P4923K7060o3002
2431.2H78661215j3768O9141j0073j27137o9678O5804L2008r5785o4552M2677M053
2453.6H78493905j01030p5757K9146J9551r9480j18077j967M4107m3630q8036n126
2476H78053606L2067q3029j54674n5314K3842n0783j26183o2942M8637J3471j31786
2498.5H77506912j22965J9789J3054j07587j02043Q225L1174p4685j21415k2173J6928
2520.9H77045214j09970j73629l8683P5042j1504j37806q9287J1384m9114j24097l5167
$$ y = [873272359, 873893559, 874510884, 875099003, 875736713, 876368403, 876875639, 877292275, 877724230, 878128946, 878348112, 878380835, 878423154, 878550291, 878614306, 878558099, 878526986, 878607452, 878689408, 878660500, 878618360, 878682196, 878760219, 878743172, 878706753, 878745854, 878791511, 878737092, 878635705, 878622234, 878697157, 878724217, 878661215, 878647447, 878716588, 878706515, 878579378, 878509700, 878575504, 878607512, 878511727, 878447175, 878489852, 878493905, 878392875, 878317118, 878346264, 878365815, 878266335, 878148258, 878146291, 878190398, 878146768, 878058732, 878053606, 878085673, 878002644, 877847970, 877792656, 877816498, 877765715, 877639532, 877576590, 877625227, 877638698, 877506912, 877383947, 877403736, 877416790, 877309203, 877207160, 877215385, 877246559, 877171874, 877050459, 877028286, 877045214, 876935244, 876761615, 876722932, 876797974, 876786470, 876648664, 876559377, 876570761, 876521647, 876397550, 876362383]
2543.3H76362383M9413k6405j45436j31666j4246q046j30773j36495n841J4246j18375
2565.8H75708759j60337m1604k026j30058j85310m8817L1829q8453j92285j51097q8156
2588.2H74652445j15275j80125j25468k6643j08898k54452k16425p7367j04129k64168
2608.6H73179495k50101q1360n6625j82986k38120j53780r4295j80602k37644j55508
2629H71548474j14143k09868k73585j71841q0525j69039k59221j69694q1480j89066
2649.4H69830012l13401k27690q7857j29342k47478k06173n8532p9930k53260k82883
2669.8H67943466j14262k9624j58429k27809j34230j48892l05176l52859k37942j31309
2690.2H66102934j60575k27332j79112j26004k17617l10480k50757j53363j76609k69174
$$ y = [876362383, 876411796, 876385391, 876239955, 876108289, 876094043, 876085997, 875955224, 875818729, 875812888, 875827134, 875708759, 875548422, 875506818, 875504792, 875374734, 875189424, 875140607, 875172436, 875083983, 874891698, 874740601, 874652445, 874537170, 874357045, 874231577, 874204934, 874096036, 873841584, 873625159, 873547792, 873443663, 873179495, 872929394, 872848034, 872791409, 872608423, 872370303, 872216523, 872122228, 871941626, 871703982, 871548474, 871434331, 871224463, 870950878, 870779037, 870698512, 870529473, 870270252, 870100558, 870019078, 869830012, 869516611, 869288921, 869201064, 869071722, 868824244, 868618071, 868559539, 868479609, 868226349, 867943466, 867829204, 867799580, 867641151, 867413342, 867279112, 867130220, 866825044, 866472185, 866234243, 866102934, 865942359, 865715027, 865535915, 865409911, 865192294, 864881814, 864631057, 864477694, 864301085, 864031911]
2710.6H64031911k47598j31905j65880l15785k91944j17719p9035k49863l52204k12491
2731H61867487j11281k26737l24785k44379j56582j96993k04861j07348j06990k63691
2751.4H59923840l67940l05831k09511k42769l23534k68042j67192k11179l39746l21031
2771.8H57167065j68621j95384m03166m57883l21806k50816k83182k66194k55883l54111
2792.2H54210019m33266l90232l42488m10736n31911n84841m86314l47496m31835o20783
2812.5H49630117n97655m62771m88579o27697o52551n70357n67079o61790o93202o44386
2832.9H43664050o63519q22067j134813j479268j707494j910210k052069j868963j363575
2851.3H30662072q90851o25015l81350k11656l58641o57142q13245q38757q36909q23617
$$ y = [864031911, 863784313, 863652408, 863486528, 863170743, 862878799, 862761080, 862682045, 862432182, 862079978, 861867487, 861756206, 861529469, 861204684, 860960305, 860803723, 860606730, 860401869, 860294521, 860187531, 859923840, 859555900, 859250069, 859040558, 858797789, 858474255, 858206213, 858039021, 857827842, 857488096, 857167065, 856998444, 856803060, 856399894, 855942011, 855620205, 855369389, 855086207, 854820013, 854564130, 854210019, 853776753, 853386521, 853044033, 852633297, 852101386, 851516545, 851030231, 850682735, 850250900, 849630117, 849032462, 848569691, 848081112, 847453415, 846800864, 846230507, 845663428, 845001638, 844308436, 843664050, 843000531, 842178464, 841043651, 839564383, 837856889, 835946679, 833894610, 832025647, 830662072, 829771221, 829146206, 828764856, 828553200, 828194559, 827537417, 826724172, 825885415, 825048506, 824224889]
2871.7H24224889q50320q63373p33077o27458o12319n39720n52714p61866r18270q22305
2892.1H16943467o98805q59976j102328j056731r05573r76325j128256j140296j169682
2910.4H07905495j445591j827777j915753j626849j322329j085579o95527j79708J44541
2928.8G97950923R6679J19865M84109Q05318R07243J006126J142800J021087N49555
2947.2H04083705J41323P7188N36k84970l63767o6817K39194K66432J99438L24428
2967.6H04616690N21838N59390M64797M13060N44250O13034L71516J88827K83838L39210
2987.9H08916450K85327J99556J8776j33932l08156n06282m59850l82185m60743l98279
3008.3H06770682j72615j89781n51343q32736p98166o88732o98745p92801q23558p13229
$$ y = [824224889, 823374569, 822511196, 821778119, 821150661, 820538342, 819998622, 819445908, 818684042, 817765772, 816943467, 816244662, 815384686, 814282358, 813225627, 812320054, 811343729, 810215473, 809075177, 807905495, 806459904, 804632127, 802716374, 801089525, 799767196, 798681617, 797986090, 797806382, 797950923, 798047602, 798167467, 798651576, 799456894, 800364137, 801370263, 802513063, 803534150, 804083705, 804225028, 804302216, 804302752, 804017782, 803654015, 803587198, 803826392, 804092824, 804292262, 804616690, 805138528, 805697918, 806162715, 806575775, 807120025, 807733059, 808104575, 808293402, 808577240, 808916450, 809201777, 809401333, 809420109, 809286177, 808978021, 808471739, 808011889, 807629704, 807168961, 806770682, 806598067, 806408286, 805856943, 805024207, 804226041, 803537309, 802838564, 802045763, 801222205, 800508976]
3028.7H00508976o57141p03037p75754q45969p78735p17699q38459j006007j096308
3047.1G93089867j077772j016020r67145r85086j155615j253367j064598q54850q46863
3065.5G83868551r53495j063705j106262j040280q52406p04884q32856j093268j226664
3083.8G74994731j234710j150370j123071j273989j333773j157463j031220j150787
3100.1G65539348j289189j192987j048088j140415j361967j311719j052141j088143
3116.4G56054699j338839j523674j687109j726031j560867j389027j458943j664936
3132.8G43705273j640022j362741j262665j585126j896679j832545j631022j471698
3149.1G31022775j428246j637400j901149j999021k027392j944840j770258j768708
$$ y = [800508976, 799851835, 799148798, 798373044, 797527075, 796748340, 796030641, 795192182, 794186175, 793089867, 792012095, 790996075, 790028930, 789043844, 787888229, 786634862, 785570264, 784715414, 783868551, 782915056, 781851351, 780745089, 779704809, 778852403, 778147519, 777314663, 776221395, 774994731, 773760021, 772609651, 771486580, 770212591, 768878818, 767721355, 766690135, 765539348, 764250159, 763057172, 762009084, 760868669, 759506702, 758194983, 757142842, 756054699, 754715860, 753192186, 751505077, 749779046, 748218179, 746829152, 745370209, 743705273, 742065251, 740702510, 739439845, 737854719, 735958040, 734125495, 732494473, 731022775, 729594529, 727957129, 726055980, 724056959, 722029567, 720084727, 718314469, 716545761]
3165.4G16545761j917184j957118j875043j852870j946688k026260j972794j926840
3181.7G01070964k022147k089798j991749j918793k066433k231598k172530k023101
3198F84554815k010882k084076k083361k043665k059936k081871k043963j983285j968264
3216.4F66195512k038539k105176k046049j981795k034187k009570j774967j633883
3232.7F50571346j859367k072274j937330j755476j698613j614988j557827j636386
3249F36439085j689553j572192j393974j407385j575291j634121j552582j415848j291275
3267.4F22906864j246929j347960j515865j639664j716316j693249j625716j624823
3283.7F10496342j631439j568198j483679j532495j775324j991868k020180j955688
$$ y = [716545761, 714628577, 712671459, 710796416, 708943546, 706996858, 704970598, 702997804, 701070964, 699048817, 696959019, 694967270, 693048477, 690982044, 688750446, 686577916, 684554815, 682543933, 680459857, 678376496, 676332831, 674272895, 672191024, 670147061, 668163776, 666195512, 664156973, 662051797, 660005748, 658023953, 655989766, 653980196, 652205229, 650571346, 648711979, 646639705, 644702375, 642946899, 641248286, 639633298, 638075471, 636439085, 634749532, 633177340, 631783366, 630375981, 628800690, 627166569, 625613987, 624198139, 622906864, 621659935, 620311975, 618796110, 617156446, 615440130, 613746881, 612121165, 610496342, 608864903, 607296705, 605813026, 604280531, 602505207, 600513339, 598493159, 596537471]
3300E96537471j860917j747966j790166k104699k469838k593457k457977k313673k341569
3318.4E76857209k411365k328873k254248k487242k771616k746105k603948k512276
3334.7E56741536k474666k594650k776682k886355k972782k877056k576709k629995
3351E34952641l071428l212750k929389k691567k766073k847731k614617k424598k653718
3369.3E09740770l027260l022731k637625k352565k290547k267033k160013j915484
3385.7D90067512j547992j239390j332879j695335j702636j220197r11474j275688
3402D79141921j672894j390874r21637p93606q41439r06438q73684o33628m24117l68177
3422.4D70315427j77741J77234M00007L43710L75211O25909N92678K75851K97844P11948
$$ y = [596537471, 594676554, 592928588, 591138422, 589033723, 586563885, 583970428, 581512451, 579198778, 576857209, 574445844, 572116971, 569862723, 567375481, 564603865, 561857760, 559253812, 556741536, 554266870, 551672220, 548895538, 546009183, 543036401, 540159345, 537582636, 534952641, 531881213, 528668463, 525739074, 523047507, 520281434, 517433703, 514819086, 512394488, 509740770, 506713510, 503690779, 501053154, 498700589, 496410042, 494143009, 491982996, 490067512, 488519520, 487280130, 485947251, 484251916, 482549280, 481329083, 480417609, 479141921, 477469027, 476078153, 475156516, 474362910, 473521471, 472615033, 471741349, 471107721, 470683604, 470315427, 470137686, 470314920, 470714927, 471058637, 471433848, 472059757, 472652435, 472928286, 473226130, 473938078]
3442.8D73938078J056671J225889J281559J326919J451224J605898J788199J925468
3459.1D85599905J805723J787126K210557K446443K034873J525313J599043K025456
3475.4E01034439K363205K340555J998603J959682K252996K323985K251625K359450
3491.7E18884540K498805K543509K454043K373337K447009K391935K194106K269924
3508E38057208K625883K924323K822041K497018K489388K756297L040552K967477K656102
3526.4E62836289K735556K983450L025294L121018L245175L186226L238857L403365
3542.7E87775230L425181L250659L078759L140807L377616L547728L578901L621579
3559F14796460L652990L426015L273547M029572M661798M228294L918350M088759M298270
$$ y = [473938078, 474994749, 476220638, 477502197, 478829116, 480280340, 481886238, 483674437, 485599905, 487405628, 489192754, 491403311, 493849754, 495884627, 497409940, 499008983, 501034439, 503397644, 505738199, 507736802, 509696484, 511949480, 514273465, 516525090, 518884540, 521383345, 523926854, 526380897, 528754234, 531201243, 533593178, 535787284, 538057208, 540683091, 543607414, 546429455, 548926473, 551415861, 554172158, 557212710, 560180187, 562836289, 565571845, 568555295, 571580589, 574701607, 577946782, 581133008, 584371865, 587775230, 591200411, 594451070, 597529829, 600670636, 604048252, 607595980, 611174881, 614796460, 618449450, 621875465, 625149012, 629178584, 633840382, 638068676, 641987026, 646075785, 650374055]
3577.4F50374055M484892M592895M375339M098236M442752M924834M570901M351318
3593.7F86215222M726827M980981M914165M822135M572987M226625M440964M788637
3610G23688543M735827M677117M337549M306913M990697M760623L751337L074467L683508
3628.4G62006581M893124M350901L720998L626645L461659L281057L038287K569556
3644.7G90948808K192557K789259L593266K986729K349615K614677K731145K172112
3661H12378168J734913J550555J181304R69589J400471J271724R70960J568258J748323
3679.4H24774265J440645J152098Q14974M92334L87252Q38399J385867J512289J260043
3697.7H34058166Q55088P18236R23037Q33214L38673J3530M35770J006484Q65579M81963
$$ y = [650374055, 654858947, 659451842, 663827181, 667925417, 672368169, 677293003, 681863904, 686215222, 690942049, 695923030, 700837195, 705659330, 710232317, 714458942, 718899906, 723688543, 728424370, 733101487, 737439036, 741745949, 746736646, 751497269, 755248606, 758323073, 762006581, 766899705, 771250606, 774971604, 778598249, 782059908, 785340965, 788379252, 790948808, 793141365, 795930624, 799523890, 802510619, 804860234, 807474911, 810206056, 812378168, 814113081, 815663636, 816844940, 817814529, 819215000, 820486724, 821457684, 823025942, 824774265, 826214910, 827367008, 828181982, 828674316, 829061568, 829899967, 831285834, 832798123, 834058166, 834913254, 835631490, 836554527, 837387741, 837726414, 837739944, 838175714, 839182198, 840047777, 840529740]
3718.1H40529740K08139J11938J76310L45171N06162L09766n5313p868N92947R00507
3738.5H43617499L78966m54128m68909L51905J78695q5652N84960Q14617M34160K24471
3758.9H45576584L87490L88384J45435J6272K1458K37405M32849L16859J15037K8371
3779.3H47666144R7454J01328Q4758K07066K56181J21355j24454k43783j58012k87295
3799.7H47720742k11060L23355K92242K09331L86417K14517k00331l63588k23279k68459
3820.1H47879887R9063N17249L13460J17124j1087l1769L8206k70903m66287M3452
3840.5H48228395M11272M38869L24130n9366p66456j267612m4465J047194O15179J7107
3860.9H48944247k43366j09136j0371j94669k8491L03209L07917J18196j47223n2691
$$ y = [840529740, 840737879, 840849817, 841026127, 841371298, 841877460, 842187226, 842131913, 842124045, 842716992, 843617499, 843996465, 843542337, 843073428, 843425333, 843604028, 843518376, 844103336, 844917953, 845352113, 845576584, 845964074, 846352458, 846497893, 846514165, 846535623, 846773028, 847205877, 847522736, 847637773, 847666144, 847763598, 847864926, 847949684, 848156750, 848412931, 848534286, 848409832, 848166049, 848008037, 847720742, 847509682, 847833037, 848125279, 848334610, 848721027, 848935544, 848735213, 848371625, 848148346, 847879887, 847978950, 848496199, 848809659, 848926783, 848915696, 848883927, 848922133, 848651230, 848184943, 848228395, 848639667, 849078536, 849402666, 849343300, 848576844, 847309232, 847264767, 848311961, 848927140, 848944247, 848700881, 848591745, 848581374, 848386705, 848358214, 848661423, 848969340, 849087536, 848940313, 848887622]
3881.3H48887622J28329O5565J12057k6345j79947P0870J56403j71960m52876l46303
3901.7H48243415L6896M52876N28335K50519l398j86622l04997j50621J25170J53541
3922.1H49145114k4855p4386L874N1022J12533J15097N0842P093p8380r3519Q1479
3944.5H49295914J11222m4047n3168M8399R8646P0453o318j9491M8518Q5294N6029
3966.9H49691451J7345j848L7193R1732J9848n2452O9261J49667K3782p4804l6478
3989.4H49934697J6034J5199M6790J24454
3997.5H50137174
$$ y = [848887622, 849015951, 849081516, 849193573, 849167228, 848987281, 849058151, 849214554, 849042594, 848589718, 848243415, 848280311, 848733187, 849261522, 849512041, 849508643, 849322021, 849017024, 848866403, 848991573, 849145114, 849120259, 849045873, 849049747, 849100769, 849213302, 849328399, 849379241, 849386334, 849307954, 849214435, 849295914, 849407136, 849363089, 849309921, 849358320, 849456966, 849527419, 849521101, 849501610, 849550128, 849635422, 849691451, 849708796, 849706948, 849744141, 849835873, 849855721, 849803269, 849872530, 850022197, 850045979, 849971175, 849934697, 849950731, 849965930, 850012720, 850137174]
##END=$$ End of the data block
