##TITLE=$$ Begin of the data block
##JCAMP-DX=5.00 $$ ACD/SpecManager v 10.08
##SPECTROMETER/DATA SYSTEM=Alpha
##DATE=07 Apr 2014 11:14:18
##DATA TYPE=INFRARED SPECTRUM
##DATA CLASS=XYDATA
##ORIGIN=
##OWNER=
##NPOINTS=1765
##FIRSTX=399.75695801
##LASTX=3997.56933594
##MAXX=3997.56933594
##MINX=399.75695801
##MAXY=0.88107222
##MINY=0.47009632
##XFACTOR=1.0000000000
##YFACTOR=1.000000000000000e-9
##FIRSTY=0.75660974
##DELTAX=2.03957629
##XUNITS=1/CM
##YUNITS=ARBITRARY UNITS
##XYDATA=(X++(Y..Y))
399.8 756609738 754239857 751498938 752164841 753179848 750417948 747673154 749453247 752031624 749993801
418.1 749993801 746778786 748304188 749648333 747181296 745324373 747246742 748688400 746265769
434.4 746265769 743932486 745391011 747097254 745406151 743497133 744859040 746173501 744317055
450.7 744317055 742676854 744202912 745114386 742470503 740743816 742333472 743309796 741138935 739288688
469.1 739288688 740497351 741384089 739374101 738059461 739612460 740614295 738590240 736820698 738139808
487.5 738139808 739461303 737979233 736425042 737403512 738361180 736803710 735049784 735714436 736458361
505.8 736458361 734843969 733135521 733810067 734783053 733317435 731241465 731420457 732219994 731063545
524.2 731063545 729102373 728874683 729466140 728559136 726855218 726643562 727390230 726759017 725110650
542.5 725110650 724809170 725676417 725205541 723487020 722960770 723579049 723198533 721650541 720785439
560.9 720785439 721013725 720543504 718704939 717339814 717349768 716940999 715061247 713401973 713309646 713353395
581.3 713353395 712079704 710741580 710824668 711095750 709989667 708622694 708682239 709129035 708005905
599.6 708005905 706096292 705357969 705226481 703911543 702102959 701858878 702714503 702709794 702346921 703823447
620 703823447 706869841 709100783 710260570 712622762 716271937 718600631 719258606 720857918 723964810
638.4 723964810 725981593 726009190 726651132 729271412 731511593 731785536 732208252 734287560 736163676
656.7 736163676 736812353 738349199 741846025 744802177 745252073 745662153 748753369 751508653 752084494
675.1 752084494 752350390 754807115 757654607 758155227 757929385 759774387 762254536 762531042 761876941
693.5 761876941 763164580 765327752 765518725 764670789 765819013 768349707 769190311 768704236 769922495
711.8 769922495 772706807 774003625 773611546 774577796 777404010 778922498 778476119 779164732 781874716
730.2 781874716 783567488 783077955 783264875 785469115 787111878 786755562 786857545 789054394 791082799
748.5 791082799 791143060 791274011 793360710 795470297 795537889 795322597 797019482 799067974 799207151
766.9 799207151 798748314 799985051 801688135 801397622 800113976 800332308 801395893 800910890 799377799
785.2 799377799 799354732 800824344 801538229 801513851 803042948 806301355 808948517 810411692 812621951
803.6 812621951 816076756 818747699 819704175 820818484 823166013 824915051 824793935 824379802 824973047
821.9 824973047 825148582 823528945 821442902 820477426 819637716 817510784 815169930 814234674 813870072
840.3 813870072 812466085 810624659 810063064 810717463 811181545 811688006 813960373 817943871 821640909
858.7 821640909 824467957 827903509 832274914 835851431 837857068 839642286 842089653 844042182
875 844042182 844584525 844868243 845886171 846537590 845709682 844460785 844147623 844013870 842852533 841570497
895.4 841570497 841772795 842940152 843450665 843493640 844440222 845950067 846346438 845534921 844962895 844810843
915.8 844810843 843656361 841317952 839514732 838926315 838313997 837258577 837083578 838218689 839082062
934.1 839082062 838741720 838434637 839060128 839435458 838560998 837465286 837174714 836706400 834830761
952.5 834830761 832253575 830182254 827991664 824425936 819922686 815610826 811149657 805473864
968.8 805473864 799002349 793220282 788404524 783695281 779109955 775590360 773089230 770452499
985.1 770452499 767461538 765170515 763862550 762539744 760832012 759613752 759307802 759022593 758035004
1003.5 758035004 756880343 756013215 754706025 752319634 749514639 747179627 745009065 742326200
1019.8 742326200 739560366 737473607 735700965 733468592 731055200 729236126 727863312 726253569
1036.1 726253569 724500537 723241866 722375572 721156299 719460011 717929304 716826379 715719581
1052.4 715719581 714585304 714099944 714481354 715006173 715025306 714704692 714248061 713149369 711094558
1070.8 711094558 708703935 706590593 704600513 702408612 700202942 698287249 696432352 694210351
1087.1 694210351 691792488 689749956 688199282 686843693 685644627 684835792 684342384 683744609 682882428
1105.4 682882428 682037830 681328356 680468976 679304183 678003788 676585317 674756885 672582090 670733988
1123.8 670733988 669511974 668776512 669087708 670573115 672202528 673590839 675034761 676594138 678240001
1142.2 678240001 679866970 681247234 682344377 683395207 684563696 685810328 687106431 688601732
1158.5 688601732 690467656 692685068 695223391 698257744 701907516 705962121 710119784 714296460
1174.8 714296460 718531787 722748876 726756692 730483234 733972967 737116694 739640057 741424441
1191.1 741424441 742687166 743671954 744399071 744939983 745609701 746696413 748145998 749650002 751032829
1209.5 751032829 752355278 753578842 754509747 755170703 755838633 756644070 757452905 758204579 759053290
1227.8 759053290 760103703 761201799 762195289 763219893 764424562 765652120 766646564 767422557 768154979
1246.2 768154979 768762052 769017100 769015908 769074738 769267440 769453466 769709170 770347774 771446526 772727549
1266.6 772727549 774041057 775627315 777612984 779658735 781515479 783427835 785610557 787828743
1282.9 787828743 789876640 791997313 794424772 796894670 799027979 800903618 802810073 804645896
1299.2 804645896 806106865 807286501 808518112 809742391 810605526 811136067 811738372 812460423 812948704
1317.6 812948704 813242733 813829303 814791501 815678895 816267550 816840470 817520797 817909837 817779422 817569792
1338 817569792 817804992 818269551 818504214 818665922 819053352 819431782 819442868 819261968 819269061 819275022 818787992
1360.4 818787992 817961335 817443609 817113996 816465378 815607309 814896882 814360321 813656092 812432170
1378.7 812432170 810674489 808828831 807708323 807729602 808377266 808842599 808669508 807824731 806912899
1397.1 806912899 806228042 805381536 804000258 802386999 801198363 800203681 798926771 797634304 796707094
1415.5 796707094 795843482 794744670 793932438 793653250 793591797 793243349 792619884 792423069 792665064 792798042
1435.9 792798042 793014765 793724954 794731915 795583844 796156168 797054052 798572481 800081789 801277280
1454.2 801277280 803054690 806425631 809552610 811782718 814181745 817188442 819977164 822392166
1470.5 822392166 825329900 828850865 831870496 833999217 835573733 837065160 838219821 838578284
1486.8 838578284 838422298 838604510 838907659 838474214 837277055 836304009 835715532 834834576 832911968
1505.2 832911968 830025136 828327894 827085495 825350702 823462129 821938157 820607841 818903625
1521.5 818903625 817540109 816744328 815821052 814682722 813366592 812157989 811384976 810289741 808394194
1539.9 808394194 807277739 807159781 806959748 806667805 806597471 806729853 806600630 806075513 805367708 805261552
1560.3 805261552 805267394 804617643 803595364 802175581 800210774 798252940 795945644 792821527 789864242
1578.6 789864242 786979496 783699274 780276418 776547372 772303700 767837048 763452590 758908331
1594.9 758908331 754073083 749222934 744503796 739798725 734990597 730084479 725187242 720449865
1611.3 720449865 715781152 710519016 704920948 700986505 697694123 693767011 690137208 687104940
1627.6 687104940 684511006 682720661 681571722 681188583 682010829 683447123 685342789 687672138 690858722
1645.9 690858722 695006132 698400855 702062428 708198369 713287950 717106938 721177161 725914180
1662.2 725914180 730778337 734798431 738903999 743940234 748524308 752893209 757786691 762268960
1678.6 762268960 766105115 770098031 775737822 781251431 785551190 789733469 793546438 797584891
1694.9 797584891 802180469 806654096 811714053 816144228 819749713 823267221 826348186 829049110
1711.2 829049110 831385911 833290994 835298657 837643087 839703143 841351151 842863441 844362199
1727.5 844362199 845872104 847190976 848521590 850228667 851808429 853226960 854661286 856160104
1743.8 856160104 857692063 859085500 860344529 861764073 863175988 864313841 865190446 865924895 866802096
1762.2 866802096 867777884 868425965 868731022 869033217 869551837 870232344 870821118 871360540 871957719 872457147
1782.6 872457147 872763455 873116672 873534441 873720229 873817563 874210000 874766231 875133455 875281215 875565708
1803 875565708 876053393 876401365 876437008 876504064 876907229 877351642 877505183 877555966 877766669 877998292
1823.4 877998292 878027141 877954483 878095031 878537416 878844082 878849447 878945172 879234493 879318476 879103661 879172266
1845.8 879172266 879633129 879969537 879986346 879952312 880102277 880249739 880220354 880221248 880414426 880508900 880296886
1868.2 880296886 880210996 880527139 880837381 880802095 880644500 880731463 880944014 880938292 880742431 880670547 880831778
1890.7 880831778 880896926 880754769 880774617 881011665 881072223 880855739 880714834 880800664 880831480 880677938
1911.1 880677938 880600929 880702615 880737484 880562484 880356610 880361199 880487621 880407214 880234540 880287588 880397797
1933.5 880397797 880246282 879977345 879881740 879871190 879719794 879489005 879442334 879553020 879460096 879141688
1953.9 879141688 878986061 879058838 879000485 878698528 878470719 878487170 878494799 878284574 878056824 878023922 878006041
1976.3 878006041 877796173 877576709 877575397 877595305 877364695 877051711 876941979 876950085 876814842 876578093
1996.7 876578093 876497746 876547396 876435161 876172543 876047850 876053870 875903785 875579655 875382781 875410140
2017.1 875410140 875373662 875138164 874956489 874946594 874884427 874657989 874501705 874541640 874541521 874342322 874147177
2039.6 874147177 874160528 874213278 874082327 873902619 873896599 873950005 873845339 873654008 873587966 873624086 873557925
2062 873557925 873402238 873361707 873436809 873415947 873282135 873230278 873295069 873311222 873237491 873233140 873350263
2084.4 873350263 873429358 873362124 873279750 873340309 873449326 873433352 873380482 873455703 873556256 873528242 873462319
2106.9 873462319 873508990 873606265 873611748 873571396 873627245 873759747 873823524 873799622 873834908 873958826 874019027
2129.3 874019027 873990119 874017298 874140561 874251008 874282598 874292672 874370158 874487340 874536216 874516010 874562442
2151.7 874562442 874710202 874838829 874918818 875005364 875090539 875114858 875093579 875130296 875261366 875406146 875490844
2174.2 875490844 875551045 875647247 875736833 875744343 875729799 875784576 875883222 875957608 875993192 876032948 876078308 876079381
2198.6 876079381 876064777 876138031 876273692 876325250 876282275 876291513 876389980 876459599 876449704 876430154 876467645 876529694
2223.1 876529694 876542151 876526177 876539290 876562774 876553893 876524389 876534104 876614213 876664817 876609027 876566052 876594663
2247.6 876594663 876585424 876535058 876543343 876607537 876634836 876570702 876492023 876511753 876566827 876543224 876523137 876610219
2272.1 876610219 876714587 876706421 876633823 876657784 876768410 876788139 876702726 876683533 876741111 876714528 876595080
2294.5 876595080 876515388 876529157 876546383 876461387 876333714 876261353 876177073 876017272 875884295 875868380 875818491
2316.9 875818491 875536442 875149965 874949694 874921501 874807358 874557734 874387801 874394715 874357224 874156475
2337.3 874156475 873989284 873986363 874115646 874505699 875094354 875387430 875123978 874489963 873908401 873666942
2357.7 873666942 873678505 873649538 873578131 873785079 874357820 874988437 875543952 876162231 876796424 877300441
2378.1 877300441 877701938 878102660 878476501 878673494 878693759 878746629 878913224 879001081 878911614 878835797
2398.5 878835797 878915548 879024386 879014432 878990650 879074991 879147530 879105449 879062533 879106641 879143059 879085004
2421 879085004 879006267 879023135 879112422 879122794 879027307 878992558 879051983 879053354 878963768 878917336 878975987 878997862
2445.4 878997862 878891170 878799558 878808737 878798902 878706932 878647625 878703177 878753066 878648281 878491998 878473938
2467.9 878473938 878532112 878498018 878400087 878365099 878362298 878276050 878153920 878139615 878200650 878167748 878035843
2490.3 878035843 877969801 878021479 878039598 877923369 877805531 877791405 877754271 877623558 877552271 877601385 877629042
2512.7 877629042 877549291 877445698 877409935 877386928 877277613 877137065 877119124 877197564 877167821 877007008 876911461
2535.2 876911461 876922071 876870453 876748562 876731634 876799583 876761138 876592338 876469433 876473248 876452804 876309574
2557.6 876309574 876181543 876179814 876186728 876064718 875907242 875882387 875913799 875817597 875654697 875591218 875562429
2580 875562429 875418842 875220656 875100851 875033557 874909818 874730587 874617636 874584079 874468744 874214888
2600.4 874214888 873993754 873897731 873782396 873565674 873378396 873313904 873241067 873001695 872699916 872544110
2620.8 872544110 872468233 872291446 872079730 871963084 871871889 871669054 871401310 871229410 871134162 870924532
2641.2 870924532 870602846 870403290 870351136 870206952 869917333 869715869 869665086 869552970 869292736 869045496
2661.6 869045496 868939638 868832052 868576884 868326545 868253291 868232131 868074536 867852211 867698550 867515564
2682 867515564 867183566 866827548 866619825 866526961 866366982 866114318 865946770 865861118 865654230 865319133
2702.4 865319133 865037680 864859283 864666343 864372373 864091635 863961339 863823771 863537252 863287270 863186896
2722.8 863186896 863075972 862808824 862480640 862270296 862123013 861915529 861669481 861446977 861251652 861021221
2743.2 861021221 860812843 860718548 860618055 860356212 859994113 859702468 859510601 859266937 858925998 858666182
2763.6 858666182 858514726 858285666 857917964 857583582 857409894 857220411 856853604 856432319 856120110 855883777
2784 855883777 855618119 855315208 854969084 854576111 854160964 853756964 853400886 853013694 852515638 851984203
2804.4 851984203 851544380 851196408 850756407 850145578 849545717 849077582 848605871 847984493 847303271 846689105
2824.8 846689105 846101642 845458746 844800889 844195604 843537092 842664123 841477931 839982450 838282406
2843.1 838282406 836389124 834361494 832517803 831143439 830225408 829601943 829217970 828979313 828607082
2861.5 828607082 827977002 827206373 826377273 825515687 824671924 823838055 823045790 822365522 821700335 821026444
2881.9 821026444 820450187 819873750 819129825 818259418 817438126 816698849 815815568 814728916 813727081
2900.2 813727081 812866807 811871827 810670674 809486330 808349252 806952000 805176914 803323984 801683307
2918.6 801683307 800281763 799183428 798534811 798370004 798502684 798593044 798712611 799206078 800001919
2937 800001919 800859272 801828623 802984953 804040432 804592192 804715991 804824948 804874778 804596007 804242969
2957.4 804242969 804212928 804462612 804698408 804871202 805201590 805742264 806327760 806828141 807258666 807785809
2977.8 807785809 808357835 808697462 808879137 809156954 809495270 809807718 810034513 810057640 809925854 809625864
2998.1 809625864 809129834 808687687 808301210 807783544 807336688 807194769 807069600 806552827 805727720 804922104
3018.5 804922104 804223895 803531826 802760124 801929116 801174819 800516784 799862385 799120367 798251688 797404349
3038.9 797404349 796658099 795877874 794929028 793843150 792782068 791777372 790770113 789756894 788648248
3057.3 788648248 787449539 786380470 785500526 784669161 783753276 782714427 781613290 780555904 779668868
3075.6 779668868 778934419 778113365 777055025 775858879 774651587 773482978 772287905 770974457 769671738
3094 769671738 768539667 767489970 766334414 765062988 763854444 762759984 761585772 760216951 758933067
3112.4 758933067 757934213 756896198 755590260 754064083 752337158 750556231 748960495 747572541
3128.7 747572541 746130943 744517267 742952526 741606057 740293145 738671780 736769199 734920204
3145 734920204 733272076 731800020 730395734 728805542 726917267 724894345 722880781 720948339 719134212
3163.4 719134212 717326522 715413809 713486493 711629510 709755898 707780421 705746233 703762650
3179.7 703762650 701806366 699771583 697716653 695767999 693850696 691772521 689553142 687384665
3196 687384665 685306966 683226466 681117713 679028869 676984847 674919128 672824383 670789361 668818116
3214.3 668818116 666823685 664744496 662644506 660649359 658708274 656675041 654666245 652895212
3230.7 652895212 651234031 649345040 647260725 645307243 643516481 641793787 640185297 638637006
3247 638637006 636986494 635245204 633629560 632241428 630871832 629317403 627672732 626112223 624674618
3265.3 624674618 623346746 622098684 620789289 619282007 617583156 615827620 614173591 612605691
3281.6 612605691 611012816 609378934 607765198 606241703 604703307 602932096 600956082 598945320
3298 598945320 596976936 595093012 593333900 591536522 589399040 586895168 584313154 581920624 579640388
3316.3 579640388 577265143 574855864 572543800 570226550 567676485 564903677 562161922 559561551
3332.6 559561551 557052553 554552913 551907659 549091637 546222210 543302357 540437698 537775755
3348.9 537775755 535034955 531931400 528708696 525736272 523022413 520278454 517456353 514847696
3365.3 514847696 512434781 509804964 506790698 503778100 501146495 498783022 496490628 494200647
3381.6 494200647 491967708 489968479 488385677 487213701 485958874 484245867 482488453 481246710
3397.9 481246710 480379194 479174107 477486551 476015031 475056469 474303514 473538339 472647429 471717715
3416.3 471717715 471034586 470601261 470260024 470096320 470233142 470591694 470948070 471353918 471993923 472599417
3436.6 472599417 472901613 473213136 473898917 474947512 476217747 477533281 478856474 480260015 481778651
3455 481778651 483507931 485455334 487352550 489209712 491428316 493885368 495927215 497418642 498974055
3473.4 498974055 500983477 503334582 505659342 507668674 509653747 511940658 514297783 516552150
3489.7 516552150 518892884 521398842 523978710 526439846 528774738 531177759 533549428 535748541
3506 535748541 538039625 540683687 543604434 546418428 548932731 551459491 554245353 557311177 560318172
3524.4 560318172 562991917 565715671 568709552 571764588 574899971 578122795 581278026 584516287
3540.7 584516287 587917089 591321468 594586968 597749949 600969136 604365945 607899725 611443996
3557 611443996 615063310 618772209 622241497 625546992 629627287 634294927 638480425 642370284 646469295
3575.3 646469295 650799930 655332208 659985363 664410889 668550611 673036754 677986920 682554603
3591.7 682554603 686909199 691661239 696660280 701584160 706393480 710960329 715277553 719849288
3608 719849288 724646389 729324698 734026790 738440812 742755771 747677863 752385139 756130338 759254217
3626.3 759254217 762982786 767831445 772135139 775851130 779485762 782957315 786246598 789276004
3642.6 789276004 791871369 794151008 796956480 800477684 803433776 805813432 808476806 811212599
3659 811212599 813358665 815068305 816599250 817776918 818745077 820120394 821376264 822309136 823796928
3677.3 823796928 825509250 826953292 828129232 828990698 829530656 829935908 830778062 832162976 833638549
3695.7 833638549 834850311 835693896 836430430 837350726 838167608 838554323 838658035 839083433 839986861
3714 839986861 840764999 841225505 841486633 841634631 841768384 842069447 842581987 842911363 842880547 842903912
3734.4 842903912 843504190 844420493 844844937 844449401 844004989 844372392 844662964 844655037 845153213 845884681
3754.8 845884681 846258879 846400380 846757889 847169101 847305000 847301722 847331882 847557664 847960830 848254263
3775.2 848254263 848354757 848382533 848461688 848547220 848676205 848940790 849204838 849287271 849127769 848893881
3795.6 848893881 848742127 848437071 848220646 848545134 848826528 849031627 849437177 849677801 849511027 849161267
3816 849161267 848933458 848684549 848784268 849248648 849468470 849501491 849496841 849534094 849641323 849458754 849016190
3838.4 849016190 848959804 849311411 849795878 850210071 850222945 849480033 848219156 848175347 849183440 849750817
3858.8 849750817 849710643 849435866 849422097 849518597 849284947 849152744 849371433 849620759 849721491 849585235
3879.2 849585235 849594057 849815726 849909186 849945724 849853814 849720895 849881351 850065112 849878311 849420130
3899.6 849420130 849096477 849139929 849552095 850044727 850290358 850287497 850110888 849852502 849723637 849753618
3920 849753618 849780262 849735260 849718392 849708796 849640608 849703014 849927127 850068033 850089550 850017726 849882007
3942.5 849882007 849888921 849997520 850034654 850065351 850139916 850220263 850296378 850324273 850305200 850339234 850391328
3964.9 850391328 850388885 850372612 850408554 850533605 850651681 850633383 850529611 850536227 850687265 850769818 850709856
3987.3 850709856 850655675 850665450 850659132 850645542 850732863
3997.5 850732863
##END=$$ End of the data block
