##TITLE=$$ Begin of the data block
##JCAMP-DX=5.00 $$ ACD/SpecManager v 10.08
##SPECTROMETER/DATA SYSTEM=Alpha
##DATE=07 Apr 2014 11:14:18
##DATA TYPE=INFRARED SPECTRUM
##DATA CLASS=XYDATA
##ORIGIN=
##OWNER=
##NPOINTS=1765
##FIRSTX=399.75695801
##LASTX=3997.56933594
##MAXX=3997.56933594
##MINX=399.75695801
##MAXY=0.88112283
##MINY=0.47019255
##XFACTOR=1.0000000000
##YFACTOR=1.000000000000000e-9
##FIRSTY=0.75520015
##DELTAX=2.03957629
##XUNITS=1/CM
##YUNITS=ARBITRARY UNITS
##XYDATA=(X++(Y..Y))
$$ plain form
399.8 755200148 752445340 749421716 750546157 752106190 749536216 746722817 748395741 751075089
416.1 751075089 749374986 746021867 746753573 747801781 745703101 744050622 745759070 747048259 744979739
434.4 744979739 743219018 744874299 746249259 744138181 742367685 744044960 745244384 743316889
450.7 743316889 741927624 743597448 744404614 741656542 740070939 741830349 742734969 740391493 738448977
469.1 738448977 739667952 740733802 738942742 737539411 738867044 739792526 737869501 736384451 737821162
487.5 737821162 738978148 737383425 735879660 736901820 737781763 736151099 734438539 735123515 735853076
505.8 735853076 734234810 732475221 733127236 734142244 732698858 730544150 730638683 731461525 730312943
524.2 730312943 728274345 728046477 728731334 727781057 725928307 725659370 726446569 725919604 724437535
$$ packed form
399.8G55200148k754808l023624J124441J560033k569974k813399J672924K679348
416.1G51075089j700103l353119P31706J048208k098680j652479J708448J289189k068520
434.4G44979739j760721J655281J374960k111078j770496J677275J199424j927495
450.7G43316889j389265J669824Q07166k748072j585603J759410R04620k343476j942516
469.1G38448977J218975J065850j791060j403331J327633R25482j923025j485050J436711
487.5G37821162J156986j594723j503765J022160Q79943j630664j712560O84976P29561
505.8G35853076j618266j759589O52015J015008j443386k154708R4533Q22842j148582
524.2G30312943k038598k27868O84857r50277j852750k68937P87199n26965j482069
$$ plain form
542.5 724437535 724276185 725147426 724639893 722876787 722205758 722716212 722320497 720759213 719929755
560.9 719929755 720230758 719867945 718220174 716984510 716927111 716421127 714597881 713033557 712949455
579.2 712949455 712964296 711658835 710267663 710316181 710657537 709711313 708501518 708657861 709091544 707890928
599.6 707890928 705950797 705175281 704916298 703479290 701655984 701496124 702469409 702463925 702003896 703529000
620 703529000 706726670 709053636 710229993 712488174 716034353 718440652 719300032 720992148 723968208
638.4 723968208 725857317 725893974 726581395 729290068 731596649 731858552 732276559 734380364 736304164
656.7 736304164 736962259 738430023 741850793 744795740 745351434 745878220 748955488 751654029 752176046
675.1 752176046 752443492 754899979 757717311 758263469 758144319 760047078 762522578 762776434 762079239
$$ packed form
542.5G24437535j61350Q71241n07533j763106o71029N10454l95715j561284q29458
560.9G19929755L01003l62813j647771j235664n7399n05984j823246j564324q4102
579.2G12949455J4841j305461j391172M8518L41356r46224j209795J56343M33683j200616
599.6G07890928j940131p75516k58983j437008j823306j59860R73285n484m60029J525104
620G03529000L197670K326966J176357K258181L546179K406299Q59380J692116K976060
638.4G23968208J889109L6657O87421K708673K306581K61903M18007K103805J923800
656.7G36304164O58095J467764L420770K944947N55694N26786L077268K698541N22017
675.1G52176046K67446K456487K817332N46158j19150J902759K475500K53856o97195
$$ plain form
693.5 762079239 763411641 765733600 765996873 765091002 766137540 768593192 769433737 769003212 770253420
711.8 770253420 772979796 774171174 773748755 774812698 777737081 779294312 778899074 779617786 782248914
730.2 782248914 783811927 783287883 783541679 785797536 787394285 786967218 787081063 789333344 791352391
748.5 791352391 791318715 791400969 793521821 795644224 795732439 795634389 797430933 799436927 799520016 799063206
768.9 799063206 800263524 801899672 801569164 800287783 800526261 801574647 801074326 799559712 799554527
787.3 799554527 801060438 801845372 801914930 803488791 806640565 809102952 810464203 812705100 816206336
805.6 816206336 818833709 819786906 820951760 823255241 824936569 824833810 824512362 825181663 825312138
824 825312138 823605537 821516991 820575893 819746614 817672253 815347493 814362645 814018488 812654734
$$ packed form
693.5G62079239J332402K321959K63273r05871J046538K455652Q40545m30525J250208
711.8G70253420K726376J191378m22419J063943K924383J557231l95238P18712K631128
730.2G82248914J563013n24044K53796K255857J596749m27067J13845K252281K019047
748.5G91352391l3676Q2254K120852K122403Q8215r8050J796544K005994Q3089m56810
768.9G99063206J200318J636148l30508j281381K38478J048386n00321j514614n185
787.3G99554527J505911P84934O9558J573861L151774K462387J361251K240897L501236
805.6H16206336K627373R53197J164854K303481J681328j02759l21448O69301J30475
824H25312138j706601k088546r41098q29279k074361k324760r84848l44157j363754
$$ plain form
842.3 812654734 810792387 810238957 810907364 811339259 811844707 814147234 818104446 821734428 824564040
860.7 824564040 828052521 832377315 835781574 837697685 839606106 842163861 844067872 844552875 844848275
879.1 844848275 845885396 846502900 845655799 844473004 844180226 843973875 842783272 841545105 841794312
897.4 841794312 842954814 843418181 843437433 844381094 845867515 846223831 845407665 844885528 844761133 843576252
917.8 843576252 841234505 839471579 838901818 838287055 837216973 837012947 838129878 838978708 838613689
936.2 838613689 838288844 838904262 839282334 838434696 837365150 837067366 836551309 834652185 832126856
954.5 832126856 830083251 827835500 824205101 819690228 815427601 811002851 805266321 798712492
970.8 798712492 792946517 788200080 783519506 778953373 775473714 772987783 770341635 767344117
$$ packed form
842.3H12654734j862347n53430O68407M31895N05448K302527L957212L629982K829612
860.7H24564040L488481M324794L404259J916111J908421K557755J904011M85003K95400
879.1H44848275J037121O17504q47101j182795k92778k06351j190603j238167K49207
897.4H41794312J160502M63367J9252R43661J486421L56316q16166n22137j24395j184881
917.8H43576252k341747j762926n69761o14763j070082k04026J116931Q48830l65019
936.2H38613689l24845O15418L78072q47638j069546k97784n16057j899124k525329
954.5H32126856k043605k247751l630399m514873m262627m424750n736530o553829
970.8G98712492n765975m746437m680574m566133l479659k485931k646148k997518
$$ plain form
987.1 767344117 765046835 763742328 762411058 760667503 759450436 759187996 758916676 757880926 756666362
1005.5 756666362 755798817 754511058 752118289 749332786 747031927 744868279 742203236 739473224
1021.8 739473224 737376511 735573769 733370006 731001914 729196429 727837503 726234436 724436164
1038.1 724436164 723126829 722263694 721059680 719383001 717903912 716837347 715727150 714595020
1054.5 714595020 714113712 714450717 714910567 714936972 714668334 714220583 713141203 711143970 708791435
1072.8 708791435 706695497 704690218 702456832 700259030 698391676 696549237 694319546 691919029
1089.1 691919029 689917803 688425541 687102795 685897231 685086429 684575796 683935523 683068275 682244062
1107.5 682244062 681538880 680696547 679556191 678279281 676878750 675007105 672744870 670808434 669459403
$$ packed form
987.1G67344117k297282j304507j331270j743555j217067k62440k71320j035750j214564
1005.5G56666362q67545j287759k392769k785503k300859k163648k665043k730012
1021.8G39473224k096713j802742k203763k368092j805485j358926j603067j798272
1038.1G24436164j309335q63135j204014j676679j479089j066565j110197j132130
1054.5G14595020m81308L37005M59850K6405k68638m47751j079380j997233k352535
1072.8G08791435k095938k005279k233386k197802j867354j842439k229691k400517
1089.1F91919029k001226j492262j322746j205564q10802n10633o40273q67248q24213
1107.5F82244062p05182q42333j140356j276910j400531j871645k262235j936436j349031
$$ plain form
1125.8 669459403 668605685 668937087 670558035 672299623 673711121 675129116 676656961 678278565 679892659
1144.2 679892659 681254923 682331443 683371484 684528768 685761869 687054157 688549340 690412641
1160.5 690412641 692620933 695133150 698142529 701773763 705799997 709917665 714042366 718229949
1176.8 718229949 722446203 726502419 730237126 733651161 736733198 739269733 741086066 742360115
1193.1 742360115 743355095 744105458 744661570 745332003 746424615 747871161 749346793 750709355 752039075
1211.5 752039075 753276289 754212439 754888594 755598605 756437123 757236063 757961988 758824885 759928107
1229.9 759928107 761058748 762055576 763091028 764320612 765556455 766547978 767357349 768128574 768720150
1248.2 768720150 768943608 768942654 769027233 769241452 769414902 769649386 770295203 771394968 772643685 773936331
$$ packed form
1125.8F69459403q53718L31402J620948J741588J411498J417995J527845J621604J614094
1144.2F79892659J362264J076520J040041J157284J233101J292288J495183J863301
1160.5F90412641K208292K512217L009379L631234M026234M117668M124701M187583
1176.8G18229949M216254M056216L734707L414035L082037K536535J816333J274049
1193.1G42360115R94980P50363N56112O70433J092612J446546J475632J362562J329720
1211.5G52039075J237214R36150O76155P10011Q38518P98940P25925Q62897J103222
1229.9G59928107J130641R96828J035452J229584J235843R91523Q09371P71225N91576
1248.2G68720150K23458r54Q4579K14219J73450K34484O45817J099765J248717J292646
$$ plain form
1268.6 773936331 775544941 777548611 779579401 781422138 783332288 785510838 787723005 789759994
1284.9 789759994 791863561 794281125 796742082 798864365 800760090 802713037 804563284 806011975
1301.2 806011975 807214439 808486938 809724987 810573101 811067581 811647892 812381327 812886000 813205361
1319.6 813205361 813825846 814798295 815660357 816211879 816775620 817477405 817887306 817779541 817627966 817902505
1340 817902505 818308830 818477690 818649471 819076419 819472015 819484293 819310308 819316268 819320083 818864226 818064094
1362.4 818064094 817520797 817151546 816471219 815613866 814961970 814464211 813719630 812461495 810724795
1380.8 810724795 808911204 807802856 807820737 808473885 808967471 808825612 807983696 807043433 806319892
1399.1 806319892 805452406 804088175 802494764 801313400 800331414 799065292 797785699 796880722 796045482
$$ packed form
1268.6G73936331J608610K003670K030790J842737J910150K178550K212167K036989
1284.9G89759994K103567K417564K460957K122283J895725J952947J850247J448691
1301.2H06011975J202464J272499J238049Q48114M94480N80311P33435N04673L19361
1319.6H13205361O20485R72449Q62062N51522N63741P01785M09901j07765j51575K74539
1340H17902505M06325J68860J71781M26948L95596J2278j73985N960L815m55857q00132
1362.4H18064094n43297l69251o80327q57353o51896m97759p44581j258135j736700
1380.8H10724795j813591j108348J7881O53148M93586j41859q41916r40263p23541
1399.1H06319892q67486j364231j593411j181364r81986j266122j279593r04977q35240
$$ plain form
1417.5 796045482 794949293 794090807 793764949 793684661 793338656 792741835 792582750 792837441 792935014 793087184
1437.9 793087184 793778896 794794858 795614421 796146631 797055483 798583567 800077140 801299751 803162456
1456.2 803162456 806531429 809568763 811746299 814149380 817187250 819978178 822389960 825387478
1472.6 825387478 828975737 831976652 834067106 835633218 837112606 838259161 838645637 838515460 838677645
1490.9 838677645 838972628 838562787 837392449 836442709 835864305 834967196 833050132 830245852 828565180
1509.3 828565180 827276111 825528741 823673666 822200119 820897639 819168627 817753494 816951871
1525.6 816951871 816053927 814923823 813596427 812369525 811583340 810488284 808631063 807583451 807463229
1543.9 807463229 807212770 806937575 806932867 807088614 806957781 806463420 805826962 805717766 805652440 804936349
$$ packed form
1417.5G96045482j096189q58486l25858q0288l46005n96821j59085K54691R7573J52170
1437.9G93087184O91712J015962Q19563N32210R08852J528084J493573J222611J862705
1456.2H03162456L368973L037334K177536K403081L037870K790928K411782K997518
1472.6H25387478L588259L000915K090454J566112J479388J146555L86476j30177J62185
1490.9H38677645K94983m09841j170338r49740n78404q97109j917064k804280j680672
1509.3H28565180j289069j747370j855075j473547j302480j729012j415133q01623
1525.6H16951871q97944j130104j327396j226902p86185j095056j857221j047612j20222
1543.9H07463229k50459k75195m708J55747j30833m94361o36458j09196o5326p16091
$$ plain form
1564.3 804936349 803874314 802464128 800516903 798553586 796236455 793089509 790091097 787180007
1580.7 787180007 783904970 780496597 776760817 772496879 768001497 763567269 758971274 754101217
1597 754101217 749231696 744510233 739798903 734962463 730015755 725080013 720333219 715688765 710457742
1615.3 710457742 704857886 700878084 697530031 693569422 689964294 686996281 684448957 682657421
1631.6 682657421 681468487 681045353 681863725 683305323 685203493 687551737 690801740 695021510 698459268
1650 698459268 702204585 708403528 713427901 717204213 721309721 726109743 731009066 735074639 739257753
1668.4 739257753 744336843 748933494 753326237 758202970 762655795 766519547 770564735 776163876
1684.7 776163876 781584680 785843194 790003896 793815076 797867656 802452743 806928635 812003970
$$ packed form
1564.3H04936349j062035j410186j947225j963317k317131l146946k998412k911090
1580.7G87180007l275037l408373l735780m263938m495382m434228m595995m870057
1597G54101217m869521m721463m711330m836440m946708m935742m746794m644454n231023
1615.3G10457742n599856l979802l348053l960609l605128k968013k547324j791536
1631.6F82657421j188934m23134Q18372J441598J898170K348244L250003M219770L437758
1650F98459268L745317O198943N024373L776312M105508M800022M899323M065573M183114
1668.4G39257753N079090M596651M392743M876733M452825L863752M045188N599141
1684.7G76163876N420804M258514M160702L811180M052580M585087M475892N075335
$$ plain form
1701 812003970 816405177 819970429 823462605 826518536 829202831 831573963 833552063 835598648 837930322
1719.3 837930322 839967072 841593325 843092680 844605744 846138179 847446501 848732471 850418866
1735.7 850418866 852023125 853458703 854887307 856384754 857921243 859320223 860580027 861995757
1752 861995757 863402545 864535689 865404665 866123021 866971731 867922068 868579268 868917644 869256854 869789541
1772.4 869789541 870433807 870997965 871560037 872163057 872630894 872923553 873267591 873679757 873886764 873997211
1792.8 873997211 874400020 874978423 875347853 875482321 875751734 876207352 876516819 876555681 876669943 877081692
1813.2 877081692 877491951 877633631 877690434 877899408 878134370 878180504 878124177 878263772 878680170 878960192
1833.6 878960192 878975332 879102945 879395008 879456758 879250467 879340172 879757702 880023658 880026639 880025089 880198061
$$ packed form
1701H12003970M401207L565252L492176L055931K684295K371132J978100K046585K331674
1719.3H37930322K036750J626253J499355J513064J532435J308322J285970J686395
1735.7H50418866J604259J435578J428604J497447J536489J398980J259804J415730
1752H61995757J406788J133144Q68976P18356Q48710R50337O57200L38376L39210N32687
1772.4H69789541O44266N64158N62072O03020M67837K92659L44038M12166K07007J10447
1792.8H73997211M02809N78403L69430J34468K69413M55618L09467L8862J14262M11749
1813.2H77081692M10259J41680N6803K08974K34962M6134n6327J39595M16398K80022
1833.6H78960192J5140J27613K92063O1750k06291Q9705M17530K65956K981j550J72972
$$ plain form
1856 880198061 880347013 880313516 880317330 880513549 880612016 880414307 880326331 880611181 880896449 880880117 880770326
1878.4 880770326 880880892 881072879 881028831 880819201 880750000 880901158 880958915 880811810 880825222 881059527
1898.8 881059527 881122828 880932689 880828381 880928397 880944371 880776644 880715728 880833089 880829632 880609989
1919.2 880609989 880433559 880459905 880529583 880417943 880288243 880376637 880470932 880301237 880051434 879978955
1939.6 879978955 879950583 879764438 879537284 879512966 879621089 879530907 879254043 879129052 879184842 879095793
1960 879095793 878779173 878554642 878562748 878537059 878316700 878117383 878100812 878056467 877807379 877595663 877648115
1982.5 877648115 877694070 877446175 877136350 877059579 877076030 876923084 876683533 876610696 876642466 876499057
2002.8 876499057 876225054 876092494 876083851 875949562 875685275 875533879 875544131 875473738 875238121 875071943
$$ packed form
1856H80198061J48952l3497L814J96219R8467j97709q7976K84850K85268j6332j09791
1878.4H80770326J10566J91987m4048k09630o9201J51158N7757j47105J3412K34305
1898.8H81059527O3301j90139j04308J00016J5974j67727o0916J17361l457k19643
1919.2H80609989j76430K6346O9678j11640j29700Q8394R4295j69695k49803p2479
1939.6H79978955k8372j86145k27154k4318J08123r0182k76864j24991N5790q9049
1960H79095793l16620k24531Q106k5689k20359j99317j6571m4345k49088k11716N2452
1982.5H77648115M5955k47895l09825p6771J6451j52946k39551p2837L1770j43409
2002.8H76499057k74003j32560q643j34289k64287j51396J0252p0393k35617j66178
$$ plain form
2023.2 875071943 875065088 875002205 874791265 874650002 874673724 874623179 874380648 874185860 874213815 874267101 874122918
2045.7 874122918 873929143 873923957 873988926 873906195 873750508 873695612 873705328 873628974 873489141 873450577 873506010
2068.1 873506010 873468220 873331845 873285592 873360038 873392224 873332381 873321056 873425901 873496115 873423457 873371363
2090.5 873371363 873473704 873572350 873516023 873447239 873530388 873647034 873624921 873559237 873612583 873723388 873750865
2113 873750865 873709619 873733461 873848975 873930156 873926699 873952627 874049366 874101937 874070227 874083042 874209583 874330938
2137.5 874330938 874375105 874415874 874511600 874614537 874659359 874674320 874740183 874861658 874960363 875018001 875096262
2159.9 875096262 875202596 875260770 875266552 875308931 875422060 875533104 875594735 875676334 875800192 875876546 875883162
2182.3 875883162 875913322 876006186 876102924 876140594 876142025 876187682 876254678 876266420 876254559 876311064 876431584
$$ packed form
2023.2H75071943o855o2883k10940j41263K3722n0545k42531j94788K7955N3286j44183
2045.7H74122918j93775n186O4969q2731j55687n4896R716p6354j39833l8564N5433
2068.1H73506010l7790j36375m6253P4446L2186n9843j1325J04845P0214p2658n2094
2090.5H73371363J02341R8646n6327o8784Q3149J16646k2113o5684N3346J10805K7477
2113H73750865m1246K3842J15514Q1181l457K5928R6739N2571l1710J2815J26541J21355
2137.5H74330938M4167M0769R5726J02937M4822J4961O5863J21475R8705N7638P8261
2159.9H75096262J06334N8174N782M2379J13129J11044O1631Q1599J23858P6354O616
2182.3H75883162L0160R2864R6738L7670J431M5657O6996J1742j1861N6505J20520
$$ plain form
2204.8 876431584 876502991 876478612 876468480 876530349 876571119 876551032 876549900 876620591 876695991 876695633 876661479 876677334
2229.2 876677334 876735389 876756907 876719892 876700580 876747727 876783729 876747608 876733720 876774967 876759350 876713574
2251.7 876713574 876734257 876784563 876795650 876730144 876656830 876685023 876743972 876733840 876732469 876811147 876878679 876837611
2276.1 876837611 876770735 876836956 876980484 877007127 876937270 876945913 877000332 876948178 876853049 876828194 876839280
2298.6 876839280 876826525 876759887 876673996 876603723 876501977 876359046 876238823 876186490 876073897 875732839
2319 875732839 875342071 875192642 875161231 874984026 874749541 874645591 874598444 874455035 874267519 874179542
2339.4 874179542 874177039 874270856 874698997 875349164 875665665 875373244 874669254 874047756 873780847 873744965
2359.8 873744965 873735547 873794496 874130428 874684274 875255883 875861049 876531780 877158940 877650857 878049672
$$ packed form
2204.8H76431584P1407k4379j0132O1869M0770k0087j132P0691P5400l58l4154J5855
2229.2H76677334N8055K1518l7015j9312M7147L6002l6121j3888M1247j5617m5776
2251.7H76713574K0683N0306J1087o5506p3314K8193N8949j0132j371P8678O7532m1068
2276.1H76837611o6876O6221J43528K6643o9857Q643N4419n2154r5129k4855J1086
2298.6H76839280j2755o6638q5891p0273j01746j42931j20223n2333j12593l41058
2319H75732839l90768j49429l1411j77205k34485j03950m7147j43409j87516q7977
2339.4H74179542k503R3817M28141O50167L16501k92421p03990o21498k66909l5882
2359.8H73744965r418N8949L35932N53846N71609O05166O70731O27160M91917L98815
$$ plain form
2380.2 878049672 878436208 878779590 878965378 879006386 879059494 879183888 879232824 879135370 879088521 879202425
2400.6 879202425 879299283 879269183 879268110 879380584 879437745 879349351 879266202 879299402 879350841 879315019 879253805
2423 879253805 879257023 879302144 879298687 879235744 879234672 879300475 879287839 879198909 879172444 879223704 879215300 879115820 879060805
2449.5 879060805 879081547 879058778 878949106 878872216 878924370 878980935 878885508 878750205 878741324 878763556 878686368
2471.9 878686368 878598154 878610969 878648639 878572226 878433108 878396153 878434777 878403425 878307223 878273726 878324628
2494.4 878324628 878296614 878116012 877980232 877997875 877987862 877865493 877786815 877820075 877839446 877766848 877683342
2516.8 877683342 877663374 877631783 877499104 877356768 877342820 877412319 877392232 877259970 877187967 877204299 877140820
2539.2 877140820 877001703 876969218 877034128 876999497 876835942 876719475 876709282 876686513 876569331 876449645
$$ packed form
2380.2H78049672L86536L43382J85788M1008N3108J24394M8936r7454m6849J13904
2400.6H79202425R6858l0100j073J12474N7161q8394q3149L3200N1439l5822o1214
2423H79253805L218M5121l457o2943j072O5803j2636q8930k6465N1260q404r9480n5015
2449.5H79060805K0742k2769j09672p6890N2154N6565r5427j35303q881K2232p7188
2471.9H78686368q8214J2815L7670p6413j39118l6955L8624l1352r6202l3497N0902
2494.4H78324628k8014j80602j35780J7643j0013j22369p8678L3260J9371p2598q3506
2516.8H77683342j9968l1591j32679j42336j3948O9499k0087j32262p2003J6332o3479
2539.2H77140820j39117l2485O4910l4631j63555j16467j0193k2769j17182j19686
$$ plain form
2559.6 876449645 876438022 876433194 876319528 876203001 876188457 876172900 876040339 875877082 875826299 875811160 875670135
2582.1 875670135 875468194 875348926 875282228 875164032 875000834 874902666 874876559 874762714 874503970 874282241
2602.5 874282241 874208212 874102890 873839378 873599589 873531103 873474956 873266578 873014271 872866750 872753143
2622.9 872753143 872545004 872324705 872217536 872134864 871928453 871654451 871481240 871367693 871151626 870887101
2643.3 870887101 870751262 870708168 870556474 870268464 870037973 869936883 869812489 869580090 869359195 869253576
2663.7 869253576 869119644 868829727 868557215 868485630 868486524 868351281 868142128 867998660 867830873 867512465
2684.1 867512465 867164791 866948187 866808414 866607130 866365373 866225600 866147101 865945101 865609705 865321815
2704.5 865321815 865163922 865002275 864741921 864494383 864348948 864178538 863897443 863665283 863566577 863441110
$$ packed form
2559.6H76449645j1623m828j13666j16527j4544j5557j32561j63257n0783j5139j41025
2582.1H75670135k01941j19268o6698j18196j63198r8168k6107j13845k58744k21729
2602.5H74282241p4029j05322k63512k39789o8486n6147k08378k52307j47521j13607
2622.9H72753143k08139k20299j07169q2672k06411k74002j73211j13547k16067k64525
2643.3H70887101j35839m3094j51694k88010k30491j01090j24394k32399k20895j05619
2663.7H69253576j33932k89917k72512p1585Q94j35243k09153j43468j67787l18408
2684.1H67512465l47674k16604j39773k01284k41757j39773p8499k02000l35396k87890
2704.5H65321815j57893j61647k60354k47538j45435j70410k81095k32160r8706j25467
$$ plain form
2724.8 863441110 863149583 862796545 862577260 862434328 862202108 861917019 861711681 861571074 861371279 861148953
2745.2 861148953 861015499 860902905 860643208 860267699 859982610 859814048 859587133 859257638 858981490 858807325
2765.6 858807325 858591974 858245730 857915878 857742012 857534945 857144117 856747568 856474340 856211782 855902851
2786 855902851 855631888 855367661 854989111 854530871 854135752 853818595 853438914 852901399 852309704 851847649
2806.4 851847649 851490319 851019442 850408971 849865079 849449813 848985970 848362625 847708762 847131610 846532404
2826.8 846532404 845826864 845123947 844517410 843875706 843024313 841874897 840413690 838716030 836806536
2845.2 836806536 834748328 832862794 831470668 830566287 829967260 829610288 829391897 829017639 828388035
2863.5 828388035 827641428 826829255 825966716 825122118 824276745 823423624 822665632 822003961 821399212 820875287
$$ packed form
2724.8H63441110k91527l53038k19285j42932k32220k85089k05338j40607j99795k22326
2745.2H61148953j33454j12594k59697l75509k85089j68562k26915l29495k76148j74165
2765.6H58807325k15351l46244l29852j73866k07067l90828l96549k73228k62558l08931
2786H55902851k70963k64227l78550m58240l95119l17157l79681n37515n91695m62055
2806.4H51847649l57330m70877o10471n43892m15266m63843o23345o53863n77152n99206
2826.8H46532404p05540p02917o06537o41704q51393j149416j461207j697660j909494
2845.2H36806536k058208j885534j392126r04381n99027l56972k18391l74258o29604
2863.5H28388035p46607q12173q62539q44598q45373q53121p57992o61671o04749n23925
$$ plain form
2883.9 820875287 820318162 819555163 818644404 817810118 817087948 816221476 815128505 814098001 813227892
2902.3 813227892 812281907 811152577 809969783 808764458 807344973 805603325 803741455 802060127
2918.6 802060127 800645411 799531519 798863947 798705339 798847556 798961163 799114227 799601138 800370216
2937 800370216 801232994 802250326 803472817 804561973 805126667 805270970 805369258 805388331 805121303 804794371
2957.4 804794371 804741025 804942966 805155039 805348098 805740118 806333601 806913733 807373941 807794690 808324456
2977.8 808324456 808885157 809240937 809448361 809718966 810040891 810352087 810598493 810652494 810506880 810156941
2998.1 810156941 809651852 809226274 808829010 808293819 807868958 807774544 807676673 807173610 806367755 805571258
3018.5 805571258 804862976 804156184 803375840 802560091 801863432 801251233 800571620 799772441 798883379 798066199
$$ packed form
2883.9H20875287n57125p62999r10759q34286p22170q66472j092971j030504q70109
2902.3H13227892r45985j129330j182794j205325j419485j741648j861870j681328
2918.6H02060127j414716j113892o67572j58608J42217J13607J53064M86911P69078
2937H00370216Q62778J017332J222491J089156N64694J44303R8288J9073k67028l26932
2957.4H04794371n3346K01941K12073J93059L92020N93483N80132M60208M20749N29766
2977.8H08324456N60701L55780K07424K70605L21925L11196K46406N4001j45614l49939
2998.1H10156941n05089m25578l97264n35191m24861r4414r7871n03063q05855p96497
3018.5H05571258p08282p06792p80344q15749o96659o12199o79613p99179q89062q17180
$$ plain form
3038.9 798066199 797336340 796537697 795590162 794510245 793441176 792451680 791482747 790496647 789373815
3057.3 789373815 788170874 787169397 786352694 785507917 784533918 783440113 782311618 781241000 780363023
3075.6 780363023 779667616 778859854 777781725 776579738 775387466 774248898 773087800 771757603 770395517
3094 770395517 769257724 768271804 767177880 765934408 764738798 763635993 762435615 761048317 759728312
3112.4 759728312 758706450 757703483 756416559 754869878 753146887 751402438 749825537 748435259
3128.7 748435259 747009397 745410264 743842602 742498398 741190910 739561796 737647593 735799849
3145 735799849 734143198 732654452 731238306 729611993 727684915 725663483 723681152 721789062 719980478
3163.4 719980478 718146622 716237724 714328051 712476134 710579276 708552361 706499875 704548478
$$ packed form
3038.9G98066199p29859p98643r47535j079917j069069r89496r68933r86100j122832
3057.3G89373815j202941j001477q16703q44777r73999j093805j128495j070618q77977
3075.6G80363023o95407q07762j078129j201987j192272j138568j161098j330197j362086
3094G70395517j137793r85920j093924j243472j195610j102805j200378j387298j320005
3112.4G59728312j021862j002967j286924j546681j722991j744449j576901j390278
3128.7G48435259j425862j599133j567662j344204j307488j629114j914203j847744
3145G35799849j656651j488746j416146j626313j927078k021432j982331j892090j808584
3163.4G19980478j833856j908898j909673j851917j896858k026915k052486j951397
$$ plain form
3179.7 704548478 702651739 700659752 698580086 696558058 694591165 692518771 690312088 688133240
3196 688133240 686068356 684023201 681920171 679843068 677835286 675784290 673679471 671620786 669619381
3214.3 669619381 667619646 665570676 663476706 661401153 659339428 657253563 655258834 653506577
3230.7 653506577 651846111 649935007 647821009 645863235 644097090 642377913 640751541 639199734
3247 639199734 637543023 635801136 634208143 632798135 631342947 629773200 628213763 626712680 625256360
3265.3 625256360 623887420 622631967 621326923 619822323 618145585 616393626 614704549 613103867
3281.6 613103867 611505985 609865248 608230591 606711626 605203032 603451371 601468563 599422932
3298 599422932 597398579 595473588 593714416 591933131 589816272 587360442 584803820 582338095 579980135
$$ packed form
3179.7G04548478j896739j991987k079666k022028j966893k072394k206683k178848
3196F88133240k064884k045155k103030k077103k007782k050996k104819k058685k001405
3214.3F69619381j999735k048970k093970k075553k061725k085865j994729j752257
3230.7F53506577j660466j911104k113998j957774j766145j719177j626372j551807
3247F39199734j656711j741887j592993j410008j455188j569747j559437j501083j456320
3265.3F25256360j368940j255453j305044j504600j676738j751959j689077j600682
3281.6F13103867j597882j640737j634657j518965j508594j751661j982808k045631
3298E99422932k024353j924991j759172j781285k116859k455830k556622k465725k357960
$$ plain form
3316.3 579980135 577607274 575188220 572832227 570517659 567991555 565187156 562404275 559813440
3332.6 559813440 557320356 554854929 552288532 549484849 546521783 543520927 540648639 538008153
3348.9 538008153 535261154 532132506 528928161 525988698 523237050 520422518 517579854 514979064
3365.3 514979064 512564778 509926319 506879985 503825605 501149356 498742372 496458739 494225293
3381.6 494225293 492056608 490128011 488564521 487309456 485968232 484244287 482516378 481291771
3397.9 481291771 480401546 479177445 477521330 476094484 475153863 474412233 473641157 472717702 471751511
3416.3 471751511 471051574 470657498 470360488 470192552 470333636 470693499 471022040 471440107 472104430 472693950
3436.6 472693950 472971290 473268807 473964632 475026429 476269811 477518320 478805006 480248809 481829792
$$ packed form
3316.3E79980135k372861k419054k355993k314568k526104k804399k782881k590835
3332.6E59813440k493084k465427k566397k803683k963066l000856k872288k640486
3348.9E38008153k746999l128648l204345k939463k751648k814532k842664k600790
3365.3E14979064k414286k638459l046334l054380k676249k406984k283633k233446
3381.6D94225293k168685j928597j563490j255065j341224j723945j727909j224607
3397.9D81291771q90225j224101j656115j426846r40621p41630p71076r23455r66191
3416.3D71751511o99937l94076k97010j67936J41084L59863L28541M18067O64323N89520
3436.6D72693950K77340K97517O95825J061797J243382J248509J286686J443803J580983
$$ plain form
3455 481829792 483610451 485583961 487450093 489272743 491471291 493891358 495939821 497453541 498972595
3473.4 498972595 500945807 503324151 505734801 507833481 509836316 512086034 514403939 516628385
3489.7 516628385 518962622 521450341 524009287 526495457 528866410 531300664 533692598 535887778
3506 535887778 538192630 540873826 543818772 546658874 549176753 551669121 554462552 557557523 560532331
3524.4 560532331 563139617 565801501 568802118 571967185 575207949 578464806 581585765 584794581
3540.7 584794581 588252544 591722250 594974756 598068833 601268351 604722798 608300686 611877918
3557 611877918 615552604 619297981 622776806 626084328 630149066 634823143 639058888 642963886 647013485
3575.3 647013485 651326776 655895174 660567820 665011644 669186890 673669398 678599358 683236957
$$ packed form
3455D81829792J780659J973510J866132J822650K198548K420067K048463J513720J519054
3473.4D98972595J973212K378344K410650K098680K002835K249718K317905K224446
3489.7E16628385K334237K487719K558946K486170K370953K434254K391934K195180
3506E35887778K304852K681196K944946K840102K517879K492368K793431L094971K974808
3524.4E60532331K607286K661884L000617L165067L240764L256857L120959L208816
3540.7E84794581L457963L469706L252506L094077L199518L454447L577888L577232
3557F11877918L674686L745377L478825L307522M064738M674077M235745L904998M049599
3575.3F47013485M313291M568398M672646M443824M175246M482508M929960M637599
$$ plain form
3591.7 683236957 687720716 692568064 697606981 702529371 707324028 711892605 716219068 720779359
3608 720779359 725586593 730310261 735036135 739490747 743876755 748820066 753515840 757250547 760367513
3626.3 760367513 764145672 769072711 773410499 777106941 780684471 784099102 787360549 790432513
3642.6 790432513 793120325 795467257 798262835 801708460 804570973 806842029 809396863 812082708
3659 812082708 814252555 816008687 817546129 818693399 819680572 821138799 822443366 823308170 824670672
3677.3 824670672 826390982 827915132 829120100 829958439 830472946 830911100 831797063 833183110 834662735
3695.7 834662735 835858762 836616397 837280691 838222623 839074790 839456260 839544117 840009809 841030002
3714 841030002 841886222 842323124 842536032 842682660 842812181 843045652 843492389 843841076 843890846 843996823
$$ packed form
3591.7F83236957M483759M847348N038917M922390M794657M568577M326463M560291
3608G20779359M807234M723668M725874M454612M386008M943311M695774L734707L116966
3626.3G60367513L778159M927039M337788L696442L577530L414631L261447L071964
3642.6G90432513K687812K346932K795578L445625K862513K271056K554834K685845
3659H12082708K169847J756132J537442J147270R87173J458227J304567Q64804J362502
3677.3H24670672J720310J524150J204968Q38339N14507M38154Q85963J386047J479625
3695.7H34662735J196027P57635O64294R41932Q52167L81470Q7857M65692J020193
3714H41030002Q56220M36902K12908J46628J29521K33471M46737L48687M9770J05977
$$ plain form
3734.4 843996823 844622374 845509589 845905721 845475614 844989419 845308423 845516264 845488310 846050799 846805751
3754.8 846805751 847204328 847393215 847755075 848146260 848291099 848313391 848356605 848578930 848949254 849215925
3775.2 849215925 849356472 849447668 849510610 849511385 849553227 849761128 849997222 850097179 850031614 849915028 849816382
3797.7 849816382 849500835 849216282 849454343 849732995 849985898 850403190 850635529 850470483 850185096 850064337
3818 850064337 849848151 849878609 850256622 850451589 850550771 850633383 850649834 850636721 850367486 850000739 850078106
3840.5 850078106 850408971 850802183 851152480 851087809 850316584 849156916 849183559 850168407 850744665 850773513
3860.9 850773513 850569129 850495160 850458205 850238681 850215435 850452960 850701690 850861430 850775242 850744843
3881.3 850744843 850884140 850918293 850937784 850850046 850699067 850876749 851129830 850969791 850499988 850183606
$$ packed form
3734.4H43996823O25551Q87215L96132m30107m86195L19004K07841k7954N62489P54952
3754.8H46805751L98577J88887L61860L91185J44839K2292M3214K22325L70324K66671
3775.2H49215925J40547R1196O2942P75M1842K07901K36094R9957o5565j16586r8646
3797.7H49816382l15547k84553K38061K78652K52903M17292K32339j65046k85387j20759
3818H50064337k16186L0458L78013J94967R9182Q2612J6451j3113k69235l66747P7367
3840.5H50078106L30865L93212L50297o4671p71225j159668K6643R84848N76258K8848
3860.9H50773513k04384p3969l6955k19524k3246K37525K48730J59740q6188l0399
3881.3H50744843J39297L4153J9491q7738j50979J77682K53081j60039m69803l16382
$$ plain form
3901.7 850183606 850182176 850466192 850863755 851092041 851114273 851011276 850835800 850747883 850812256 850840092 850747585
3924.1 850747585 850714147 850779295 850846052 850957274 851094306 851168633 851182163 851093411 850964129 850988925 851071000
3946.5 851071000 851079881 851122975 851209342 851248682 851248384 851259828 851285934 851326287 851376891 851392150 851390302 851462066
3971 851462066 851577163 851624131 851581812 851546645 851653636 851818323 851847649 851793826 851760387 851733625 851726115
3993.4 851726115 851753891 851804197
3997.5 851804197
$$ packed form
3901.7H50183606j430K84016L97563K28286K2232j02997j75476q7917O4373K7836r2507
3924.1H50747585l3438O5148O6757J11222J37032P4327J3530q8752j29282K4796Q2075
3946.5H51071000Q881M3094Q6367L9340k98J1444K6106M0353N0604J5259j848P1764
3971H51462066J15097M6968m2319l5167J06991J64687K9326n3823l3439k6762p510
3993.4H51726115K7776N0306
3997.5H51804197
##END=$$ End of the data block
