##TITLE=$$ Begin of the data block
##JCAMP-DX=5.00 $$ ACD/SpecManager v 10.08
##SPECTROMETER/DATA SYSTEM=Alpha
##DATE=07 Apr 2014 11:14:18
##DATA TYPE=INFRARED SPECTRUM
##DATA CLASS=XYDATA
##ORIGIN=
##OWNER=
##NPOINTS=1765
##FIRSTX=399.75695801
##LASTX=3997.56933594
##MAXX=3997.56933594
##MINX=399.75695801
##MAXY=0.87517047
##MINY=0.42141503
##XFACTOR=1.0000000000
##YFACTOR=1.000000000000000e-9
##FIRSTY=0.71760738
##DELTAX=2.03957629
##XUNITS=1/CM
##YUNITS=ARBITRARY UNITS
##XYDATA=(X++(Y..Y))
399.8G17607379J50382k410948j214266R66669m10557j976669l61622P92325j000345
418.1G12142348j910567N62847Q78095j012444p13766Q87692o8307j808822o36220
436.5G08320856J077235k92659j792908p569J289963l71396j063705M86434P09057
454.8G08355308j044155j042962M45247l02255j712799q40664M87208m90308j519382
473.2G02335238o9797Q32081o16371j350999R2149O80804o85096r99987L58343L23534
493.6G00899899j245022j148820P8142l92616j423120n98073M40001l84450j372516
511.9F94853425n94795J00971q98600j429796l64662j46925j389265j443028k38121
530.3F88449204l61502j494885j256406p2002k47837j218020q76904N4121l95656j243352
$$ y = [717607379, 717757761, 715346813, 714132547, 715099216, 714688659, 712711990, 712350368, 713142693, 712142348, 710231781, 710794628, 711672723, 710660279, 709946513, 710834205, 710765898, 708957076, 708320856, 709398091, 709105432, 707312524, 707304955, 708594918, 708223522, 707159817, 707646251, 708355308, 707311153, 706268191, 706713438, 706411183, 704698384, 703857720, 704344928, 703854620, 702335238, 702265441, 703097522, 702481151, 701130152, 701222301, 701903105, 701218009, 700218022, 700576365, 700899899, 699654877, 698506057, 698584199, 698191583, 696768463, 696170390, 696610391, 696225941, 694853425, 694258630, 694359601, 693461001, 692031205, 691666543, 691519618, 690130353, 688687325, 688449204, 688087702, 686592817, 685336411, 685264409, 685016572, 683798552, 682921648, 682975769, 682580113, 681336761]
550.7F81336761p01547o4910q32915j540482r90331o05345j310229j737595j032650
569F72520757p42257j535892j684010q26359o73115j413584j394689n80192Tj278221
589.4F61812246j131475m49717o99818j386643j329899j180648j871765k267480j322985
607.8F50171816l74674p12157j033544J9967J378477J772165K073586L020227L427804
626.1F59743667K770185K394199K970040L024221K017140J678586K254427J929581
642.5F78782046R48071J326144K499521K207696P66993N11169J763046K666831K605856
660.8F94077373K831518L075779K376854J514733K162337K714217K044439J301408
677.1G12098658J933932K448917J498222Q24988J537860J854836Q69692L83735J094341
$$ y = [681336761, 680635214, 680570304, 679737389, 678196907, 677206576, 676601231, 675291002, 673553407, 672520757, 671778500, 670242608, 668558598, 667732239, 667059124, 665645540, 664250851, 663670659, 663090467, 661812246, 660680771, 660231054, 659531236, 658144593, 656814694, 655634046, 653762281, 651494801, 650171816, 649797142, 649084985, 648051441, 648071408, 649449885, 651222050, 653295636, 656315863, 659743667, 662513852, 664908051, 667878091, 670902312, 672919452, 674598038, 676852465, 678782046, 679730117, 681056261, 683555782, 685763478, 686530471, 687041640, 688804686, 691471517, 694077373, 696908891, 699984670, 702361524, 703876257, 706038594, 708752811, 710797250, 712098658, 714032590, 716481507, 717979729, 718804717, 720342577, 722197413, 723067105, 723450840, 724545181]
695.5G24545181J162946K96354M40598J565933J553893N80669Q13305J942158J791954
713.8G34692991Q26359J169562K148747J729250P67291J240730K061427J399517N82337
732.2G46618211J262188J890779R65535K76745J217425J881241J042664O52373J622737
750.6G57429898J955151R76622P82788J799107J816928P04587O57856J635313J433194
768.9G69191444K33591K11775R38833L66449p42853m51863L31164j81616q41081J27674
789.3G69183517J373291J303672J316727K703547L791213L237426K688408L315330
805.6G88913131L413319K144456J507700K123892J945913M97281j93059K36273k08616
824H00380290j662672k059162j395285j638353k562701k308309j322568j527250k282381
$$ y = [724545181, 725708127, 726004481, 726445079, 728011012, 729564905, 730145574, 730958879, 732901037, 734692991, 735519350, 736688912, 738837659, 740566909, 741334200, 742574930, 744636357, 746035874, 746618211, 747880399, 749771178, 750736713, 751013458, 752230883, 754112124, 755154788, 755807161, 757429898, 759385049, 760361671, 761144459, 762943566, 764760494, 765465081, 766122937, 767758250, 769191444, 769425035, 769636810, 770575643, 770942092, 770199239, 769747376, 770078540, 769896924, 769055843, 769183517, 770556808, 771860480, 773177207, 775880754, 779671967, 782909393, 785597801, 788913131, 792326450, 794470906, 795978606, 798102498, 800048411, 800545692, 800352633, 800588906, 800380290, 798717618, 796658456, 795263171, 793624818, 791062117, 788753808, 787431240, 785903990, 783621609]
842.3G83621609j730025o01232l99530j39057J560867L428101L924668M087508N100310
860.7G98853219N720734M781962L758847L885031L623605K127468J252175J697540
877H25700581J590848K48432n36799j53661l45647j446605j597107n87284k15590n34654
897.4H22122514P6413J313448J403332O33359O47783J025081J84715j182199j374364
915.8H24850082j152098j916945k538442j651407m90307m73798n11050M92275J122892
934.1H17731202L34680k89500K40028L93748n63443j079618o04272p43032j966774
952.5H13453019k661348k462864k993285m443527n209922n289674o258965p827997
968.8G76305437q139312p349789p023514o861388n650759m178822l882170m005670
$$ y = [783621609, 781891584, 781290352, 780890822, 780751765, 782312632, 785740733, 789665401, 793752909, 798853219, 804573953, 809355915, 813114762, 816999793, 820623398, 822750866, 824003041, 825700581, 827291429, 827539861, 827003062, 826849401, 826503754, 825057149, 823460042, 822872758, 822657168, 822122514, 822198927, 823512375, 824915707, 825549066, 826196849, 827221930, 827406645, 826224446, 824850082, 823697984, 821781039, 819242597, 817591190, 817100883, 816627085, 816116035, 816608310, 817731202, 818065882, 817776382, 818016410, 818410158, 817846715, 816767097, 816162825, 815419793, 813453019, 810791671, 808328807, 805335522, 800891995, 795682073, 790392399, 784133434, 776305437, 768166125, 760816336, 753792822, 746931434, 741280675, 737101853, 733219683, 729214013]
985.1G29214013l267706k437889k518356k606809j764179r55164j125932j328051q33034
1003.5G12376893p88153j858532k782047k806961k965212l701449l878474l220618
1019.8F90375447l004610l472269l425240k780199k641976k942324k609968j807332
1036.1F67691529j647532j956165j718819j253367j513481k066493j894593j219153
1052.4F54421926r02117o78062J89602R63628O00875k75135p28190j268864k370417
1070.8F49953246l115594k950073k746880l067493l201723k832949k706826l091335
1087.1F26240373l183246k595961k037883j798272j282692n39780l43918o79732q04066
1105.4F12974823o15359q01325j349866j484931j368165j924634k917409l029048k066851
$$ y = [729214013, 725946307, 723508418, 720990062, 718383253, 716619074, 715663910, 714537978, 713209927, 712376893, 711588740, 709730208, 706948161, 704141200, 701175988, 697474539, 693596065, 690375447, 687370837, 683898568, 680473328, 677693129, 675051153, 672108829, 669498861, 667691529, 666043997, 664087832, 662369013, 661115646, 659602165, 657535672, 655641079, 654421926, 653519809, 652841747, 653031349, 653994977, 654595852, 654320717, 653592527, 652323663, 649953246, 646837652, 643887579, 641140699, 638073206, 634871483, 632038534, 629331708, 626240373, 623057127, 620461166, 618423283, 616625011, 615342319, 614802539, 614458621, 613778889, 612974823, 612359464, 611558139, 610208273, 608723342, 607355177, 605430543, 602513134, 599484086, 597417235]
1123.8E97417235j332283r63330M20690J915753J748383J164257J585245K215386K085089
1142.2F06256425J587809J506686J616537J369238J123369J423299J844585J881838
1158.5F18609786K054393K837181L641010L991425M363656N053401N442500N175292
1174.8F51168644M899323N032778M995108M403472L860175L630877L047705K008378
1191.1F83046460J357556J299858J132071Q18371J074434J812100K141595J965463
1207.4F94647908J976609K130688J789033J205385J194537J515984J361132J028239
1223.7G06849515J277030J724482J611650J341342J637280K046705J838147J466751
1240.1G19792902J587093J704991J206994O59883P01905P52508L15666J08719N84722
$$ y = [597417235, 596084952, 595121622, 595542312, 597458065, 599206448, 600370705, 601955950, 604171336, 606256425, 607844234, 609350920, 610967457, 612336695, 613460064, 614883363, 616727948, 618609786, 620664179, 623501360, 627142370, 631133795, 635497451, 640550852, 645993352, 651168644, 656067967, 661100745, 666095853, 670499325, 674359500, 677990377, 681038082, 683046460, 684404016, 685703874, 686835945, 687654316, 688728750, 690540850, 692682445, 694647908, 696624517, 698755205, 700544238, 701749623, 702944160, 704460144, 705821276, 706849515, 708126545, 709851027, 711462677, 712804019, 714441299, 716488004, 718326151, 719792902, 721379995, 723084986, 724291980, 724951863, 725653768, 726406276, 726721942, 726830661, 727415383]
1258.4G27415383J038611J054585J277268K004802K437949K272070K349972K897024
1274.7G42747664L050328K661347K639175L074824L103376K753019K847433L237546
1291G66114712L023684K366006K204836K397418K025961J349569J270652J456141J089215
1309.4G83298194N54502O54459R35376O01947K94209P63357J183569Q58963N11109
1327.8G89655685P30515Q12650J99496l31461j87814Q0108j5497j5139L66389M75467
1348.1G91770399J6570j74284J45793J29461m03404p44403o25372n36859q68678j026511
1368.5G87682712o94752r48667j722217j686513k000809m053950n248070k400756K112150
1386.9G71039128L281236J567006L18885k44141q13126j369536j198352j097500j761854
$$ y = [727415383, 728453994, 729508579, 730785847, 732790649, 735228598, 737500668, 739850640, 742747664, 745797992, 748459339, 751098514, 754173338, 757276714, 760029733, 762877166, 766114712, 769138396, 771504402, 773709238, 776106656, 778132617, 779482186, 780752838, 782208979, 783298194, 783852696, 784507155, 785442531, 786044478, 786338687, 787102044, 788285613, 789144576, 789655685, 790386200, 791198850, 791398346, 791066885, 790879071, 790959179, 790943682, 790928543, 791294932, 791770399, 791786969, 791612685, 791758478, 791887939, 791484535, 790740132, 790114760, 789577901, 788709223, 787682712, 786987960, 786039293, 784317076, 782630563, 780629754, 776575804, 771327734, 768926978, 771039128, 774320364, 775887370, 776206255, 775962114, 775148988, 773779452, 772581100, 771483600, 769721746]
1405.3G69721746j891315j314818j055897j194596j206100j144052j076579o70671
1421.6G60167718m02570j05858L636m96805l95417L43561L65317K56598Q82149J351833
1442G61970162J268745R39011J097739J816988K105892J927674K283394L762186L999948
1460.3G81171739L310323L343224L823042L630460L260195L801048M308343L544807
1476.6H10193181K650380K299369K086043J302779K81274k35558l4630k3127p48693
1495H17771018j494289j373947j197815j370429k462388m460752l251791j869797j889885
1513.4G98399925k261460k519428k152860k016306j657606j462578j530707r23455
1529.7G83875525j110971j984000j271784p32542k091884k082884k46108M77672L45885
$$ y = [769721746, 767830431, 766515613, 765459716, 764265120, 763059020, 761914968, 760838389, 760167718, 759765148, 759659290, 759662926, 759166121, 758770704, 759114265, 759479582, 759736180, 760618329, 761970162, 763238907, 764177918, 765275657, 767092645, 769198537, 771126211, 773409605, 777171791, 781171739, 784482062, 787825286, 791648328, 795278788, 798538983, 802340031, 806648374, 810193181, 812843561, 815142930, 817228973, 818531752, 818813026, 818577468, 818542838, 818519711, 817771018, 816276729, 814902782, 813704967, 812334538, 809872150, 805411398, 802159607, 800289810, 798399925, 796138465, 793619037, 791466177, 789449871, 787792265, 786329687, 784798980, 783875525, 782764554, 780780554, 779508770, 778776228, 776684344, 774601460, 774355352, 774833024, 775178909]
1548G75178909m9293J09613M82559L16501j012742j025916N31733n6862j076222j854360
1568.4G71543920k338290j949549k660870m362226l703117l143251l994763m417360
1584.7G44974494m544616m965365n314111n262614n311012n479872n458236n373359
1601.1G03265309n362808n414665n530179n579054n314231n011499n787551o625831
1617.4F58639491m529894l573835m457354m025400l308594k876043j726568j183331
1633.7F32958472j444161j92702J390994K104103K354682K631306L608108L872990
1650F47283792L829301N055010N198002M763246M715442M906059N283951N054176M952073
1668.4F91041052N365968N320609N537390N906105N456269N092383N272746O378352
$$ y = [775178909, 775129616, 775239229, 775721788, 776038289, 775025547, 773999631, 774531364, 774474502, 773398280, 771543920, 769205630, 767256081, 764595211, 760232985, 756529868, 753386617, 749391854, 744974494, 740429878, 735464513, 730150402, 724887788, 719576776, 714096904, 708638668, 703265309, 697902501, 692487836, 686957657, 681378603, 676064372, 671052873, 665265322, 658639491, 654109597, 650535762, 646078408, 642053008, 638744414, 635868371, 634141803, 632958472, 631514311, 631321609, 632712603, 634816706, 637171388, 639802694, 643410802, 647283792, 651113093, 656168103, 661366105, 666129351, 670844793, 675750852, 681034803, 686088979, 691041052, 696407020, 701727629, 707265019, 713171124, 718627393, 723719776, 728992522, 735370874]
1684.7G35370874O321788N726636N909979N333543N069494N573988N937815O689369
1701G81933486N901099N159437N215407M494905L708363L295481K921760K686381K894223
1719.3H18210542K953410K627135K219021J916409J920998J756191J401365J779556
1735.7H34784627K111316J915216J711846J808643J916826J653909J318872J627803
1752H48849058J831114J419664J009881R39787J075268J068532P66754O40691O89089
1770.3H58289838N32746O95348R86338Q89361N58972M45068O35743P81894N29408P3969
1790.7H64418685K20061O84380N60582K88010M31478O57677N03362K83479K79129L32474
1811.1H68659317K99275K84672L64423M11510K09272m76J51991K84732N0545J82330
$$ y = [735370874, 741692662, 747419298, 753329277, 758662820, 763732314, 769306302, 775244117, 781933486, 787834585, 792994022, 798209429, 802704334, 806412697, 809708178, 812629938, 815316319, 818210542, 821163952, 823791087, 826010108, 827926517, 829847515, 831603706, 833005071, 834784627, 836895943, 838811159, 840523005, 842331648, 844248474, 845902383, 847221255, 848849058, 850680172, 852099836, 853109717, 854049504, 855124772, 856193304, 856960058, 857600749, 858289838, 858822584, 859517932, 860504270, 861393631, 861952603, 862397671, 863033414, 863815308, 864344716, 864418685, 864638746, 865323126, 865883708, 866171718, 866603196, 867260873, 867764235, 868047714, 868326843, 868659317, 868958592, 869243264, 869607687, 870019197, 870228469, 870227993, 870379984, 870664716, 870715261, 870897591]
1831.5H70897591N56886M20690J17183J40845J98722n8651n4776L20613M83394L46005
1851.9H73368502R5188N3823J58668J19328K027N4896P3313q6903K38K97249L26752
1874.4H74463081J01805p0453L8088K08318R9480r2506p6473R0957R2268l8624P2360
1896.8H74888301K23994N8174j41084m4703M4047r6261r9778J28925J23024j81318
1917.2H74903321k22802k861M2975l7372n7459N7876P4685j20640j62303J3053k8849
1939.6H74459624l13520k54512R4712Q8870j49548j82390q3864j42216k56122j36196
1960H73124838M7982p0215k97606j80483K0862j11163k52246j20879L338j36614k64465
1982.5H71763349j16110j0014j94669l32236j25110O7592r8825k38657p9095j8657
$$ y = [870897591, 871454477, 871875167, 871992350, 872133195, 872331917, 872273266, 872218490, 872539103, 873022497, 873368502, 873463690, 873517513, 873676181, 873795509, 873797536, 873852432, 873925745, 873838842, 873839080, 874136329, 874463081, 874564886, 874494433, 874532521, 874740839, 874840319, 874747813, 874671340, 874762297, 874854565, 874815941, 874888301, 875112295, 875170469, 875029385, 874984682, 875028729, 874932468, 874832690, 874961615, 875084639, 874903321, 874680519, 874677658, 874720633, 874683261, 874625802, 874683678, 874758363, 874637723, 874475420, 874488473, 874459624, 874146104, 873891592, 873986304, 874075174, 873925626, 873743236, 873659372, 873517156, 873261034, 873124838, 873172820, 873102605, 872804999, 872624516, 872645378, 872534215, 872281969, 872161090, 872164428, 872027814, 871763349, 871647239, 871637225, 871442556, 871110320, 870985210, 871052802, 870953977, 870715320, 870636225, 870617568]
2002.8H70617568k18033k71440o9737k0206k07186k54512q6069o7472k49446k19047
2023.2H68954420j5199m1545k17855j67131j3590j08897k51651j36495J6630p1109
2043.6H67947578j97529j02818J788j11163j80900l0458N6446q1480j82927q4340n424
2066.1H67028773r2566j33038l457L5823q8096j08838K9981O9797n5492o2406O1512
2088.5H66681993M3213p9095n7936O1214M2975o8903k1398J23024R0122m2140j4424
2110.9H66758645O7234N543n4658M1306J49250P5222j9849N5015J06812J8000j7523
2133.4H67184997R1731J44124M3571q941P7963J34230Q1480M5776J01983J35422P0930
2155.8H68103266M0710J00672R4235j729L1770J58667J33932L9279O0320J10567P0512
$$ y = [870617568, 870399535, 870128095, 870058358, 870038152, 869830966, 869576454, 869490385, 869422913, 869173467, 868954420, 868939221, 868897676, 868679821, 868512690, 868499100, 868390203, 868138552, 868002057, 868018687, 867947578, 867750049, 867647231, 867649019, 867537856, 867356956, 867326498, 867382944, 867301464, 867118537, 867034197, 867028773, 866936207, 866803169, 866799712, 866835535, 866747439, 866638601, 866668582, 866738379, 866682887, 866620481, 866681993, 866725206, 866646111, 866588175, 866649389, 866692364, 866623461, 866602063, 866725087, 866815209, 866773069, 866758645, 866825879, 866831422, 866776764, 866818070, 866967320, 867042542, 867022693, 867077708, 867184520, 867202520, 867184997, 867276728, 867420852, 867464423, 867455482, 867533445, 867667675, 867749155, 867794931, 867896914, 868032336, 868103266, 868143976, 868244648, 868338883, 868337154, 868368924, 868527591, 868661523, 868700802, 868761122, 868871689, 868942201]
2178.2H68942201J7882P2002J39356P4923j0729K8729J13964R3878J8179L4809R0718
2200.7H69615912O0142K086J6689M5240J9908j0789L4988R7990N2035l6001k921Q1838
2225.2H69977117L9517l9398N483P6652K8372m5479n662M3750O55k4139J8417K5809
2249.6H70101094k5213l9696M351Q225m5299m2319L4034P5936K9087K682N7459N8711
2274.1H70219052j7166k0266O6698P0035n364J7464Q3327M6134l2186r954Q3267R4951
2298.6H70595992L1411N0783J16051M8577n6207J0669J40906J23680M17l1233R54n5015
2323.1H70976985o0797M3213Q6486O3539N6684K7955l5704j07526j25409K39K04742
2345.5H71130407L60310L53277K06113L4511m2022L696N8651m6551j53780m4167J07348
$$ y = [868942201, 868960083, 869032085, 869171441, 869246364, 869235635, 869264364, 869378328, 869472206, 869490385, 869525194, 869615912, 869676054, 869678140, 869694829, 869740069, 869759977, 869749188, 869784176, 869882166, 869934201, 869898200, 869895279, 869977117, 870016634, 869977236, 869982719, 870059371, 870087743, 870042264, 870036602, 870080352, 870081007, 870056868, 870075285, 870101094, 870075881, 870036185, 870040536, 870048761, 870003462, 869961143, 869995177, 870071113, 870100200, 870102882, 870160341, 870219052, 870201886, 870181620, 870248318, 870318353, 870312989, 870330453, 870413780, 870459914, 870427728, 870417774, 870501041, 870595992, 870627403, 870678186, 870794237, 870842814, 870786607, 870797276, 870938182, 871061862, 871062279, 871031046, 871032000, 870976985, 870916188, 870959401, 871045887, 871109426, 871166110, 871194065, 871158361, 871050835, 870925426, 870925665, 871130407, 871490717, 871843994, 872050107, 872084618, 872042596, 872046292, 872104943, 872058392, 871904612, 871860445, 871967793]
2367.9H71967793J25706N1200J10030K63214K40863J21534J11460J64628J22846K4437
2388.3H73303711L4452J08659Q3268R537J1623M4107J7166j6510O4730J27673P928
2410.8H73796344q2910K2650R2625n0247j80900p8141N6028k980o7950L4631J00493
2433.2H73639643n007o0856M8935Q7083n4956j20639k3783L040p7128n3227P2300N8055
2457.7H73513460r7394j22309K385M828j03951p8857M9293M1485j14679j35660j4067
2480.1H72944534k3067j08302p2360K2352k9504j55390r7573J8657m4108j32024m5896
2502.5H72277319M7923o5923j89841p5579N2035l5643j22607l9280J5796q0943j35005
2525H71648252n6326n0426j63138j42991L3676P6056q7500j57058m6432m6671j64747
$$ y = [871967793, 872093499, 872144699, 872254729, 872517943, 872758806, 872880340, 872991800, 873156428, 873279274, 873303711, 873338163, 873446822, 873530090, 873539627, 873551250, 873595357, 873612523, 873596013, 873660743, 873788416, 873796344, 873713434, 873736084, 873828709, 873778462, 873597562, 873519421, 873575449, 873572469, 873504519, 873539150, 873639643, 873634636, 873573780, 873622715, 873709798, 873654842, 873534203, 873510420, 873513460, 873436332, 873383105, 873455405, 873513460, 873416066, 873293757, 873296142, 873300970, 873197019, 873118162, 873167455, 873208940, 873094261, 872958601, 872944534, 872921467, 872813165, 872740805, 872763157, 872733653, 872578263, 872480690, 872499347, 872455239, 872323215, 872277319, 872325242, 872259319, 872069478, 871993899, 872045934, 872010291, 871887684, 871848404, 871864200, 871783257, 871648252, 871591926, 871541500, 871378362, 871235371, 871269047, 871345103, 871257603, 871100545, 871054113, 871007442, 870842695]
2547.4H70842695j25885L6538L5405j39654j61767q642k7776j95205j66536O56k0385
2569.8H70069444j69873j67251r7751j59800k21134j17600m351j08778k60949j84954
2590.2H68577003o9499j74701k72333j37210p1347k37882l18110j97172j23501k08676
2610.6H66766572k45810j37925j23083k72095l34323k19047j72555k98322l11494j53362
2631H64498556j40369k81871k70664j34826j73211l20196k72215j30236j77920l15666
2651.4H62281382k93374j89304k26319k99275k13742j19984k03252l04461k20358j20819
2671.8H60090494k03967k76804j97947j74582l04460l64125k59519k06888k72214k71678
2692.2H57558310j88649j91092l03149l47793k74063k66969l40044l05713k07960k36988
$$ y = [870842695, 870716810, 870753348, 870788753, 870649099, 870487332, 870478690, 870450914, 870255709, 870089173, 870089829, 870069444, 869899571, 869732320, 869634569, 869474769, 869253635, 869136035, 869131684, 869022906, 868761957, 868577003, 868507504, 868332803, 868060470, 867923260, 867851913, 867614031, 867295921, 867098749, 866975248, 866766572, 866520762, 866382837, 866259754, 865987659, 865653336, 865434289, 865261734, 864963412, 864651918, 864498556, 864358187, 864076316, 863805652, 863670826, 863497615, 863177419, 862905204, 862774968, 862597048, 862281382, 861988008, 861798704, 861572385, 861273110, 861059368, 860939384, 860736132, 860431671, 860211313, 860090494, 859886527, 859609723, 859411776, 859237194, 858932734, 858568609, 858309090, 858102202, 857829988, 857558310, 857369661, 857178569, 856875420, 856527627, 856253564, 855986595, 855646551, 855340838, 855132878, 854895890]
2712.6H54895890l55065l64423k38955j78814k49565k67505k62797l63112m20391l35753
2733H51859510k30968k45154l47972l33428j96338j63317k47359l16381l66927m10676
2753.4H49000990l75032k58148k22027l47436m42683l63827k74897l40700m02629l08156
2773.8H45665455l00586m70102n51760m93229m28021l83734l48032l84450m85480n26666
2794.2H41293395m70639m68075o18935p22169o26684m69744m52399o06954p35760p05302
2814.6H35416734o56307o94870p14422o62744o81042q16942q76248q05676q16881r43899
2835H27747703j034022j223922j668632k098262k284944k273917k077222j619339j007199
2853.3H12460244n52893m13954n21958p11203q71718j058817j262605j257300j068831
$$ y = [854895890, 854540825, 854176402, 853937447, 853758633, 853509068, 853241563, 852978766, 852615654, 852195263, 851859510, 851628542, 851383388, 851035416, 850701988, 850505650, 850342333, 850094974, 849778593, 849411666, 849000990, 848625958, 848367810, 848145783, 847798347, 847355664, 846991837, 846716940, 846376240, 845973611, 845665455, 845364869, 844894767, 844343007, 843849778, 843421757, 843038023, 842689991, 842305541, 841820061, 841293395, 840822756, 840354681, 839735746, 839013577, 838386893, 837917149, 837464750, 836857796, 836122036, 835416734, 834760427, 834065557, 833351135, 832688391, 832007349, 831190407, 830314159, 829508483, 828691602, 827747703, 826713681, 825489759, 823821127, 821722865, 819437921, 817164004, 815086782, 813467443, 812460244, 811907351, 811493397, 810971439, 810260236, 809388518, 808329701, 807067096, 805809796, 804740965]
2871.7H04740965j053035j135290r73820p39694p57337q78334q58008q44658r83715
2890.1G96517074j053631r65119r85205j147926j189053j090705j106918j312315j467050
2908.4G86199152j540899j769602k058089k072275j822590j520038j175582p82371
2924.7G73457706l59893k4319N1082J10805L92973O85394Q65817J112044J308679J129866
2945.1G78730154P17938M36127L02792L2365k68876k20895J9550J48177J62542J70767
2965.5G80230641J94133J77860K17855L40819L89815M00126M11868L23295K12610J81317
2985.9G83080339K03073L14475L02791m0114l08215l73543n05089o06895o25253n73516
3006.3G80868053m44710l90529m76957o73175r07242j018643r98080r48250r47118
$$ y = [804740965, 803687930, 802552640, 801578820, 800839126, 800081789, 799203455, 798345447, 797500789, 796517074, 795463443, 794498324, 793513119, 792365193, 791176140, 790085435, 788978517, 787666202, 786199152, 784658253, 782888651, 780830562, 778758287, 776935697, 775415659, 774240077, 773457706, 773097813, 773073494, 773124576, 773235381, 773628354, 774313748, 775179565, 776291609, 777600288, 778730154, 779448092, 779884219, 780187011, 780219376, 779950500, 779729605, 779749155, 779897332, 780059874, 780230641, 780424774, 780602634, 780820489, 781161308, 781551123, 781951249, 782363117, 782686412, 782899022, 783080339, 783283412, 783597887, 783900678, 783860564, 783552349, 783178806, 782673717, 782066822, 781441569, 780868053, 780423343, 780032814, 779555857, 778882682, 777975440, 776956797, 775958717, 775010467, 774063349]
3024.7G74063349j005590r43124q03829q20160j050114j244724j087904q91864j007259
3043G65208781j231551j345933j294970j249671j328648j343250j321673j351714j274467
3061.4G53466904j138270j100659j195192j349032j358390j193345j001417r18568
3077.7G44212031j070022j296878j386166j434445j446009j415133j494289j539766
3094G33129323j385987j239836j308799j495958j532316j388669j333237j479804j508892
3112.4G20455825j333058j340687j537323j780391k040922k025426j755654j615882
3128.7G07026482j758993j932085j833737j631319j669645j959265k120316k027690
3145F92093432j953304j859844j749634j924932k236545k288282k193332k182961k197444
$$ y = [774063349, 773057759, 772114635, 771310806, 770490646, 769440532, 768195808, 767107904, 766216040, 765208781, 763977230, 762631297, 761336327, 760086656, 758758008, 757414758, 756093085, 754741371, 753466904, 752328634, 751227975, 750032783, 748683751, 747325361, 746132016, 745130599, 744212031, 743142009, 741845131, 740458965, 739024520, 737578511, 736163378, 734669089, 733129323, 731743336, 730503500, 729194701, 727698743, 726166427, 724777758, 723444521, 721964717, 720455825, 719122767, 717782080, 716244757, 714464366, 712423444, 710398018, 708642364, 707026482, 705267489, 703335404, 701501667, 699870348, 698200703, 696241438, 694121122, 692093432, 690140128, 688280284, 686530650, 684605718, 682369173, 680080891, 677887559, 675704598, 673507154]
3163.4F73507154k149582k105117k145529k205550k207041k207518k264559k281308
3179.7F55940950k268672k280712k257645k238870k265930k313793k364099k396643
3196F37554586k364993k295852k275705k270758k218306k218068k266526k246976k207220
3214.3F17190182k184927k180696k195835k194583k194584k209067k158523j976251
3230.7E99895716j848460k015590k191365k077401j926124j855492j748920j692235
3247E84540129j789809j871407j771986j648367j687943j743377j652360j573622j590848
3265.3E69210410j529753j386583j456261j706957j819909j777887j691223j655578
3281.6E56186259j700938j720369j684129j621902j596332j707017j912117k084434
$$ y = [673507154, 671357572, 669252455, 667106926, 664901376, 662694335, 660486817, 658222258, 655940950, 653672278, 651391566, 649133921, 646895051, 644629121, 642315328, 639951229, 637554586, 635189593, 632893741, 630618036, 628347278, 626128972, 623910904, 621644378, 619397402, 617190182, 615005255, 612824559, 610628724, 608434141, 606239557, 604030490, 601871967, 599895716, 598047256, 596031666, 593840301, 591762900, 589836776, 587981284, 586232364, 584540129, 582750320, 580878913, 579106927, 577458560, 575770617, 574027240, 572374880, 570801258, 569210410, 567680657, 566294074, 564837813, 563130856, 561310947, 559533060, 557841837, 556186259, 554485321, 552764952, 551080823, 549458921, 547862589, 546155572, 544243455, 542159021]
3298E42159021k073526j853824j677156j811444k168119k425313k492428k425373k316355
3316.3E22915483k288342k316236k299607k265513k391219k596140k626419k554417
3332.6E03577590k453685k350122k482712k695024k699762k728999k726615k521187
3348.9D82919484k585590k968102l053040k757161k537012k609402k655626k401739
3365.3D61351812k214730k456874k852886k851457k445578k150745k090186k082169
3381.6D42207187j996070j771092j409650j048476j106113j525998j561820j029313
3397.9D30758655p06911j072466j472235j255900q51124o81699o30617o97851p44045
3416.3D22645807n60909l52085k48223o9559K39730M99636M96268N18411P28429O34700
$$ y = [542159021, 540085495, 538231671, 536554515, 534743071, 532574952, 530149639, 527657211, 525231838, 522915483, 520627141, 518310905, 516011298, 513745785, 511354566, 508758426, 506132007, 503577590, 501123905, 498773783, 496291071, 493596047, 490896285, 488167286, 485440671, 482919484, 480333894, 477365792, 474312752, 471555591, 469018579, 466409177, 463753551, 461351812, 459137082, 456680208, 453827322, 450975865, 448530287, 446379542, 444289356, 442207187, 440211117, 438440025, 437030375, 435981899, 434875786, 433349788, 431787968, 430758655, 430051744, 428979278, 427507043, 426251143, 425400019, 424718320, 424087703, 423389852, 422645807, 422084898, 421732813, 421484590, 421415031, 421654761, 422154397, 422650665, 423169076, 423897505, 424532205]
3436.6D24532205K99573L32743P50154J125783J275509J281858J312971J424372J605213
3455D33940381J843571J999051J860291J838714K280771K525300K103865J561046J587003
3473.4D51539993K001256K397150K424061K058506K016217K376735K447963K299189
3489.7D69561070K394736K594084K672702K582073K521306K532393K408206K326668
3506D89593238K475053K760976L028840K936483K610385K636373K944052L157020L034591
3524.4E15177011K801180K871871L149629L336728L423333L401995L311455L522694
3540.7E40995896L764033L581941L260136L310978L547430L685415L777266L854930
3557E69778025L980279M032910L798246L531874M031300M843474M786074M444658M455030
$$ y = [424532205, 424831778, 425164521, 425914675, 427040458, 428315967, 429597825, 430910796, 432335168, 433940381, 435783952, 437783003, 439643294, 441482008, 443762779, 446288079, 448391944, 449952990, 451539993, 453541249, 455938399, 458362460, 460420966, 462437183, 464813918, 467261881, 469561070, 471955806, 474549890, 477222592, 479804665, 482325971, 484858364, 487266570, 489593238, 492068291, 494829267, 497858107, 500794590, 503404975, 506041348, 508985400, 512142420, 515177011, 517978191, 520850062, 523999691, 527336419, 530759752, 534161747, 537473202, 540995896, 544759929, 548341870, 551602006, 554912984, 558460414, 562145829, 565923095, 569778025, 573758304, 577791214, 581589460, 585121334, 589152634, 593996108, 598782182, 603226840, 607681870]
3575.3F07681870M582942M754603N043328N078196M671574M491508N079567N234838
3591.7F46618426M926383N040109N388678N407571N320371N224645M875660M803478
3608F87605321N063057N093754N143344N028725M805565N230724N397380M804194M039049
3626.3G32211113L907502M883527M968942M447221M213214M057706L886580L660441
3642.6G66236246L232002K667189K822339L834844L802597L035963K910733L071189
3659G91613102K628982K122283J968145J696527J334429J628101J543760R22859J543045
3677.3H07001233K198339K031028J809657J530528J112461Q60572J228570J543046
3693.6H19315434J338541R50158O51300O92308J009941R52840M55379K563L20435J193583
$$ y = [607681870, 612264812, 617019415, 622062743, 627140939, 631812513, 636304021, 641383588, 646618426, 651544809, 656584918, 661973596, 667381167, 672701538, 677926183, 682801843, 687605321, 692668378, 697762132, 702905476, 707934201, 712739766, 717970490, 723367870, 728172064, 732211113, 736118615, 741002142, 745971084, 750418305, 754631519, 758689225, 762575805, 766236246, 769468248, 772135437, 774957776, 778792620, 782595217, 785631180, 788541913, 791613102, 794242084, 796364367, 798332512, 800029039, 801363468, 802991569, 804535329, 805458188, 807001233, 809199572, 811230600, 813040257, 814570785, 815683246, 816543818, 817772388, 819315434, 820653975, 821604133, 822255433, 822947741, 823957682, 824910522, 825365901, 825368464, 825688899, 826882482]
3714H26882482J281857P62701K62976Q2671K00630M49776O77348M65273l9100j15574
3734.4H30911040N54025J034856O62148k79426o80149J71065K12729j21414O34014
3752.8H33098888J040399O01471K39611L87787M51684K08021J03414J05679K48313
3771.1H36485267M63545M08649J97113L3200P3433J12712J16289K64406L53217K25246
3791.5H38733077p9572k66016j15513k48194l89934K31981L39985J96875M79578M39585
3811.9H39321852l0697l45289j64807k21312K9981N27918L44873J35302N722j03295
3832.3H39500248k4378j97947m58777q7261M32849O57320N05686J1444p47919j453638
3852.7H38137627k78056J178801Q68797J39535l45707k73168j8120j49846k1875L33846
$$ y = [826882482, 828164339, 828927040, 829190016, 829272687, 829473317, 829923093, 830600441, 831065714, 831026614, 830911040, 831465065, 832499921, 833162069, 832882643, 832202494, 832373559, 832586288, 832464874, 833098888, 834139287, 834740758, 834980369, 835368156, 835819840, 836027861, 836131275, 836236954, 836485267, 836948812, 837357461, 837554574, 837587774, 837661207, 837773919, 837890208, 838154614, 838507831, 838733077, 838653505, 838387489, 838271976, 838023782, 837633848, 837865829, 838205814, 838402689, 838882267, 839321852, 839291155, 838945866, 838781059, 838559747, 838589728, 839117646, 839462519, 839597821, 839603543, 839500248, 839475870, 839277923, 838819146, 838731885, 839164734, 839822054, 840327740, 840339184, 839591265, 838137627, 837859571, 839038372, 839907169, 840046704, 839700997, 839427829, 839409709, 839259863, 839237988, 839571834]
3873.1H39571834M20928K18272k68996k17915J45376O5804Q7440o855j46508J94192
3893.5H40063572K63274k69235o32643m09842O7413N34892N87344K57194M5717p1227
3913.9H40436459k52724k00629L4570O1989K563P9870M6671j61648n7042K52843J75715
3936.3H40418637l1293p2538m6015M3809n960p9275Q1182J56164N9903Q166J2874K4259
3960.8H40569913M0353O1571O9499N6386M0770L8564O1929N6088R597Q5234J46032
3983.2H41235936n663j15633o0379J9610P1942Q3089O9738
3997.5H41298640
$$ y = [839571834, 839992762, 840211034, 839942038, 839724123, 839869499, 839935303, 840022743, 840015888, 839869380, 840063572, 840326846, 840057611, 839424968, 839015126, 839082539, 839617431, 840204775, 840461969, 840507686, 840436459, 840183735, 839983106, 840017676, 840079665, 840082228, 840162098, 840208769, 840047121, 839990079, 840242922, 840418637, 840387344, 840314806, 840268791, 840312600, 840306640, 840227365, 840308547, 840464711, 840524614, 840532780, 840545654, 840569913, 840610266, 840671837, 840741336, 840797722, 840838492, 840877056, 840938985, 840995073, 841004670, 841089904, 841235936, 841230273, 841114640, 841054261, 841073871, 841145813, 841228902, 841298640]
##END=$$ End of the data block
