##TITLE=$$ Begin of the data block
##JCAMP-DX=5.00 $$ ACD/SpecManager v 10.08
##SPECTROMETER/DATA SYSTEM=Alpha
##DATE=07 Apr 2014 11:14:18
##DATA TYPE=INFRARED SPECTRUM
##DATA CLASS=XYDATA
##ORIGIN=
##OWNER=
##NPOINTS=1765
##FIRSTX=399.75695801
##LASTX=3997.56933594
##MAXX=3997.56933594
##MINX=399.75695801
##MAXY=0.87537241
##MINY=0.42144373
##XFACTOR=1.0000000000
##YFACTOR=1.000000000000000e-9
##FIRSTY=0.71530014
##DELTAX=2.03957629
##XUNITS=1/CM
##YUNITS=ARBITRARY UNITS
##XYDATA=(X++(Y..Y))
399.8G15300143N91099j335680p06375J005411m88639k038657k11180J214147r34303
$$ 715300143 715891242 714555562 713849187 714854598 714365959 712327302 712116122 713330269 712395966
418.1G12395966k468347L00109J037359q73923q85070N26846k22862j508117l25739
$$ 712395966 709927619 710227728 711265087 710391164 709506094 710032940 709810078 708301961 707976222
436.5G07976222P80165p09533j430214P25329J456678o11901j214147M53472N73754
$$ 707976222 708756387 708046854 706616640 707341969 708798647 708186746 706972599 707426071 707999825
454.8G07999825j440048j376629P05660K63631j435995r28104K98500o60956j567542
$$ 707999825 706559777 705183148 705888808 706152439 704716444 703788340 704086840 703425884 701858342
473.2G01858342l1114O91712p53522j262844J47224O32822n66840p73966K94447Q166
$$ 701858342 701827228 702518940 701765418 700502574 700649798 701282620 700715780 699941814 700236261 700244427
493.6G00244427j302481q49068M04775k23815j443088p27773K70068o08980j499355
$$ 700244427 698941946 698092878 698497653 698273838 696830750 696102977 696373045 695764065 694264710
511.9F94264710n28455J32084r50158j332759j89662m7923j378059j441181j54256
$$ 694264710 693736255 693868339 692918181 691585422 691395760 691347837 689969778 688528597 688374341
530.3F88374341l56079j624941j308978J3828j30176j128793q57711p0691o19650j371443
$$ 688374341 688018262 686393321 685084343 685098171 684967995 683839202 682981491 682910800 682291150 680919707
550.7F80919707o14107J10865p97749j668274j105845n66602j179039j692951j066923
$$ 680919707 680305600 680416465 679618716 677950442 676844597 676277995 675098956 673406005 672339082
569F72339082p49707j540006j687407q01265o62923j453817j482606o81520o23107
$$ 672339082 671589375 670049369 668361962 667560697 666897774 665443957 663961351 663279831 662656724
587.4F62656724j177609r51588l72409p20978j453936j399279j142740j783490k226472
$$ 662656724 661479115 660527527 660155118 659434140 657980204 656580925 655438185 653654695 651428223
605.8F51428223j328588m06861o91056r69351m291J307487J765132K067208L034354
$$ 651428223 650099635 649692774 649001718 648032367 648028076 649335563 651100695 653167903 656202257
624.1F56202257L549695K817928K244592K853096L098130K156019J714528K171576
$$ 656202257 659751952 662569880 664814472 667667568 670765698 672921717 674636245 676807821
640.4F76807821J842558R63569J406431K524912K154887P26938N54562J835763K713383
$$ 676807821 678650379 679613948 681020379 683545291 685700178 686427116 686981678 688817441 691530824
658.8F91530824K637148K868473L154159K483666J544892K160669K727628K007663
$$ 691530824 694167972 697036445 700190604 702674270 704219162 706379831 709107459 711115122
675.1G11115122J287997J913666K318561J389265Q38519J624405J916230Q57353L51965
$$ 711115122 712403119 714316785 716635346 718024611 718863130 720487535 722403765 723261118 723613083
693.5G23613083J105190J216292L29793M12464J524329J564324O23524Q23557J902342
$$ 723613083 724718273 725934565 726264358 726676822 728201151 729765475 730388999 731212556 733114898
711.8G33114898J762212Q38637J203060K127051J618266P57158J348734K097368J407266
$$ 733114898 734877110 735715747 736918807 739045858 740664124 741421282 742770016 744867384 746274650
730.2G46274650O19233J263559J901507R97186K17080J084029J814366J049101O99282
$$ 746274650 746893883 748157442 750058949 751056135 751273215 752357244 754171610 755220711 755919993
748.5G55919993J757562K113283J029014P14422J701474J762390O83904O85334J623630
$$ 755919993 757677555 759790838 760819852 761534274 763235748 764998138 765682042 766367376 767991006
766.9G67991006J315773J86741L07262J034022L44872q48472n02944L53515j86562
$$ 767991006 769306779 769493520 769800782 770834804 771179676 770331204 769828260 770181775 769995213
785.2G69995213q96037Q8870J426399J397550J349509K720893L800928L205001K688945
$$ 769995213 769099176 769188046 770614445 772011995 773361504 776082397 779883325 783088326 785777271
803.6G85777271L349006L446043K183735J523912K115667J928508N12362j26184K47241
$$ 785777271 789126277 792572320 794756055 796279967 798395634 800324142 800836504 800710320 800957561
821.9H00957561k91706j728892k066314j381338j639306k571583k290964j302123j524330
$$ 800957561 800665855 798936963 796870649 795489311 793850005 791278422 788987458 787685335 786161005
840.3G86161005k296805j759946o12080l28780m0710J541257L353000L913939M097879
$$ 786161005 783864200 782104254 781492174 781163394 781122684 782663941 786016941 789930880 794028759
858.7G94028759N087376N706370M763901L735721L850996L555298K070070J245379
$$ 794028759 799116135 804822505 809586406 813322127 817173123 820728421 822798491 824043870
875H24043870J750827J649320K34365n80549j72913l54052j461327j594305n71072
$$ 824043870 825794697 827444017 827678382 827097833 826924920 826570868 825109541 823515236 822944164
893.3H22944164k13086n14925J27852J331329J329422N62311P03871J103878J42991
$$ 822944164 822731078 822216153 822344005 823675334 825004756 825567067 826270938 827374816 827517807
911.7H27517807j263916j400054j136243j909256k586365j700759m49121l73065m58002
$$ 827517807 826253891 824853837 823717594 821808338 819221973 817521214 817072093 816699028 816241026
930H16241026M47929J041829L04401k57373K84613L97384n79477j033067n21600p51734
$$ 816241026 816688955 817730784 818035185 817777812 818062425 818459809 817880332 816847265 816325665 815573931
950.4H15573931k083242k750337k475798l000021m450739n167782n218983o231904
$$ 815573931 813490689 810740352 808264554 805264533 800813794 795646012 790427029 784195125
966.8G84195125p834494q139908p342756p039547o896496n643248m140795l883481
$$ 784195125 776360631 768220723 760877967 753838420 746941924 741298676 737157881 733274400
983.1G33274400m057050l301560k396584k446055k595723j816988j033902j222015
$$ 733274400 729217350 725915790 723519206 721073151 718477428 716660440 715626538 714404523
999.4G14404523j368343p75755p28071j871645k801716k762914k920210l712595l903389
$$ 714404523 713036180 712260425 711532354 709660709 706858993 704096079 701175869 697463274 693559885
1017.7F93559885l212571k963364l447175l425420k731084k578497k944351k629220
$$ 693559885 690347314 687383950 683936775 680511355 677780271 675201774 672257423 669628203
1034.1F69628203j806319j667678j996160j718282j216710j504481k063215j839399
$$ 669628203 667821884 666154206 664158046 662439764 661223054 659718573 657655358 655815959
1050.4F55815959j195073r48727o75202K20657R36389N83112k55048p37965j290441
$$ 655815959 654620886 653672159 652996957 653217614 654154003 654737115 654482067 653744102 652453661
1068.7F52453661k363622l111124k959550k758562l058315l153204k782822k705336
$$ 652453661 650090039 646978915 644019365 641260803 638202488 635049284 632266462 629561126
1085F29561126l125846l216744k615451k023280j771271j263857m97818l22163p25687
$$ 629561126 626435280 623218536 620603085 618579805 616808534 615544677 615046859 614724696 613999009
1103.4F13999009q61525o22213p42853j278043j462698j405895j974225k904713l005027
$$ 613999009 613137484 612515271 611772418 610494375 609031677 607625782 605651557 602746844 599741817
1121.8E99741817k121509j416206r97126M33087J925051J733125J147926J579344K194583
$$ 599741817 597620308 596204102 595206976 595640063 597565114 599298239 600446165 602025509 604220092
1140.1F04220092K073646J618802J532436J599669J330138J106560J434147J866460
$$ 604220092 606293738 607912540 609444976 611044645 612374783 613481343 614915490 616781950
1156.4F16781950J910806K063870K828002L627420L961861M331231N036771N423546
$$ 616781950 618692756 620756626 623584628 627212048 631173909 635505140 640541911 645965457
1172.7F45965457N142808M890323N049228M977167M364431L861725L657222L066719
$$ 645965457 651108265 655998588 661047816 666024983 670389414 674251139 677908361 680975080
1189.1F80975080K025187J353383J267075J121640Q32975J073838J808166K138913
$$ 680975080 683000267 684353650 685620725 686742365 687575340 688649178 690457344 692596257
1205.4F92596257J956880J984477K145648J783967J202822J216113J540899J374364
$$ 692596257 694553137 696537614 698683262 700467229 701670051 702886164 704427063 705801427
1221.7G05801427J025021J246453J690089J626671J398504J666426K037108J839459
$$ 705801427 706826448 708072901 709762990 711389661 712788165 714454591 716491699 718331158
1238G18331158J489461J625001J739800J225531P01606P36535P28011K90930J04130
$$ 718331158 719820619 721445620 723185420 724410951 725112557 725849092 726577103 726868033 726972163
1256.4G26972163N62191J001477J006782J245678K000510K439678K297997K384544
$$ 726972163 727534354 728535831 729542613 730788291 732788801 735228479 737526476 739911020
1272.7G39911020K884567K995967K606392K612591L091455L128171K757072K861261
$$ 739911020 742795587 745791554 748397946 751010537 754101992 757230163 759987235 762848496
1289G62848496L256977L023922K361119K204299K393663K030850J367747J282037J472056
$$ 762848496 766105473 769129395 771490514 773694813 776088476 778119326 779487073 780769110 782241166
1307.4G82241166J118540N82934O53386R11653O24239L44515P63774J142383Q31127
$$ 782241166 783359706 783942640 784596026 785507679 786131918 786476433 787240207 788382590 789213717
1325.7G89213717N17428P45118Q24689K17677l20554j89245M7684p3731k4796L97444
$$ 789213717 789731145 790476263 791300952 791518629 791198075 791008830 791056514 790982783 790957987 791355431
1346.1G91355431M87626J9610j65344J53184J39892l85284p23720o16729n50985q85368
$$ 791355431 791843057 791862667 791697323 791850507 791990399 791605115 790881395 790264666 789713681 788828313
1366.5G88828313j007855o59167r43363j745761j727938k039969m060447n231381k387523
$$ 788828313 787820458 787161291 786217928 784472167 782744229 780704260 776643813 771412432 769024909
1384.9G69024909K110958L266036J570821L64065j84774p80106j387536j244545j133025
$$ 769024909 771135867 774401903 775972724 776336789 776152015 775371909 773984373 772739828 771606803
1403.2G71606803j782000j879811j280845j028180j183271j208723j147508j090050
$$ 771606803 769824803 767944992 766664147 765635967 764452696 763243973 762096465 761006415
1419.5G61006415p07984m36366j12652J7106m64976l47972L65079L25978J97947Q68082
$$ 761006415 760298431 759862065 759749413 759766519 759301543 758953571 759318650 759644628 759842575 760710657
1439.9G60710657J354575J273751R41992J074314J803279K119422J928031K289355
$$ 760710657 762065232 763338983 764280975 765355289 767158568 769277990 771206021 773495376
1456.2G73495376L791094L999889L288209L322482L815055L620565L254950L833294
$$ 773495376 777286470 781286359 784574568 787897050 791712105 795332670 798587620 802420914
1472.6H02420914M342079L543377K649784K310872K105654J330256L11494k24948o3181
$$ 802420914 806762993 810306370 812956154 815267026 817372680 818702936 819014430 818789482 818726301
1490.9H18726301n3584p65503j521647j416027j215399j338184k378940m368782l269971
$$ 818726301 818672717 817907214 816385567 814969540 813754141 812415957 810037017 805668235 802398264
1509.3H02398264j927912j887381k215028k513170k184153k029717j654803j451850
$$ 802398264 800470352 798582971 796367943 793854773 791670620 789640903 787986100 786534250
1525.6G86534250j523435r34244j112759j956939j235307o83724k035261k106547l14593
$$ 786534250 785010815 784076571 782963812 781006873 779771566 779087842 777052581 774946034 774631441
1543.9G74631441M71830L75152o3181R0539N06997L46482j023531j091003N15401k3603
$$ 774631441 775103271 775478423 775415242 775505781 776012778 776359260 775335729 774244726 774760127 774736524
1564.3G74736524j028896j809537k333999j979649k661049m366517l779412l200650
$$ 774736524 773707628 771898091 769564092 767584443 764923394 760556877 756777465 753576815
1580.7G53576815l984332m396260m551530m974782n308747n275131n346059n496324
$$ 753576815 749592483 745196223 740644693 735669911 730361164 725086033 719739974 714243650
1597G14243650n463719n383313n387723n458951n551815n586028n343914n046904n810559
$$ 714243650 708779931 703396618 698008895 692549944 686998129 681412101 676068187 671021283 665210724
1615.3F65210724o633461m543721l587544m429877l977418l296673k910614j768947
$$ 665210724 658577263 654033542 650445998 646016121 642038703 638742030 635831416 634062469
1631.6F34062469j185954j408994j81973J370549K076745K349079K678514L679573
$$ 634062469 632876515 631467521 631285548 632656097 634732842 637081921 639760435 643440008
1648F43440008L913582L850579N072653N203188M760026M727781M944206N310714N060196
$$ 643440008 647353590 651204169 656276822 661480010 666240036 670967817 675912023 681222737 686282933
1666.3F86282933M963696N404055N363226N558133N924761N463600N072534N249560
$$ 686282933 691246629 696650684 702013910 707572043 713496804 718960404 724032938 729282498
1682.6G29282498O375909O337941N728602N876065N289316N056023N608261N960107
$$ 729282498 735658407 741996348 747724950 753601015 758890331 763946354 769554615 775514722
1699G75514722O632745N851746N179882N246877M493535L700256L304840K935469K676010
$$ 775514722 782147467 787999213 793179095 798425972 802919507 806619763 809924603 812860072 815536082
1717.3H15536082K893626K987504K645314K202451J903415J918078J742303J374662
$$ 815536082 818429708 821417212 824062526 826264977 828168392 830086470 831828773 833203435
1733.6H33203435J764238K127707J954079J736462J774966J849175J641273J382530
$$ 833203435 834967673 837095380 839049459 840785921 842560887 844410062 846051335 847433865
1749.9H47433865J681089J834393J399040J009107R60171J069486J033902P39992O44565
$$ 847433865 849114954 850949347 852348387 853357494 854317665 855387151 856421053 857161045 857805610
1768.3H57805610P14838N41687O75082R71199Q92698N76973M53353O12140P50780N27978
$$ 857805610 858520448 859062135 859737217 860708416 861601114 862178087 862631440 863243580 863994360 864522338
1788.7H64522338J01209K47955O96421N69880K98142M27127O34611M85003K90036K92361
$$ 864522338 864623547 864871502 865567923 866137803 866435945 866863072 867497683 867982686 868272722 868565083
1809.1H68565083L14056K56539K79784M16636M45545J94431J549J75357K67267L5286
$$ 868565083 868879139 869135678 869415462 869832098 870277643 870472074 870473623 870648980 870916247 870951533
1829.5H70951533K15710N64932L91126J06514J41322J83761o3657m7386L19958M77910
$$ 870951533 871167243 871732175 872123301 872229815 872371137 872554898 872491241 872443855 872763813 873241723
1849.9H73241723L31997P8440N5790J81019J25826j3948N0545Q0645j05619l3617L04103
$$ 873241723 873573720 873652160 873707950 873888969 874014795 874000847 874051392 874132037 874026418 873992801 874296904
1872.3H74296904L48568J14739k7299Q4936K01106N7280j30951r8825R3878J08778
$$ 874296904 874645472 874760211 874732912 874817848 875018954 875076234 874945283 874846458 874940336 875049114
1892.7H75049114l7074O5625K25365O9380j33038n6982M2379p7426j01030J30713J58429
$$ 875049114 875012040 875077665 875303030 875372410 875239372 875182390 875224769 875147343 875046313 875177026 875335455
1915.1H75335455j60933k48968k4796M2141l0518k9981Q1480N9187j58727j85013L8087
$$ 875335455 875174522 874925554 874900758 874942899 874912381 874882400 874963880 875023067 874864340 874679327 874717414
1937.6H74717414O020l16619k67983P3552M0651j93954j79827m4942r9540k27034j41859
$$ 874717414 874723434 874406815 874138832 874212384 874253035 874059081 873879254 873834312 873734772 873507738 873365879
1960H73365879J6630q2731k81036j81616n424j31845k55108r4414L2485j25230k58803
$$ 873365879 873382509 873299778 873018742 872837126 872831702 872699857 872444749 872350335 872382820 872257590 871998787
1982.5H71998787j22547k3484j98722l23654j11758P3433j04606k47956r3400n2274
$$ 871998787 871876240 871852756 871654034 871330380 871218622 871292055 871187449 870939493 870846093 870793819
2002.8H70793819k41100k49267l9697j7821k09570k49982j02461r5784k45750j87755
$$ 870793819 870552719 870303452 870263755 870245934 870036364 869786382 869683921 869588137 869342387 869154632
2023.2H69154632m232o0499k18331j47462q881j06812k45690j38879J3471p6712k08854
$$ 869154632 869150400 869089901 868871570 868724108 868715227 868608415 868362725 868223846 868237317 868160605 867951751
2045.7H67951751j13368p153j17957j84238k2293P5937p6473j93179q1420o556r3281
$$ 867951751 867838383 867831230 867713273 867529035 867506742 867582679 867506206 867313027 867231607 867225051 867131770
2068.1H67131770r7573L1710M5776r6381j33097J9670O6638o9261p4863N9008O1572
$$ 867131770 867034197 867065907 867111683 867015302 866882205 866901875 866968513 866899252 866824389 866883397 866944969
2090.5H66944969n7817n1141O8188M5121q0347l0101J21296Q7380l7729j3650N4300
$$ 866944969 866887152 866836011 866904199 866949320 866868973 866838872 866960168 867047548 867009819 866996169 867050469
2113H67050469N722l4153O4015J61290O6817n0128K2412R8049L2008j788Q8990J43468
$$ 867050469 867056191 867022038 867086053 867247343 867314160 867264032 867286444 867384493 867416501 867414713 867503703 867647171
2137.5H67647171P2598K1041P6711J08600O4730N1201J09196J40190O8903L5047J06275
$$ 867647171 867719769 867740810 867817521 867926121 867990851 868042052 868151248 868291438 868360341 868395388 868501663
2159.9H68501663J04785J7345M6253J62423J51813N1141M9889J14560R5069J9134L9458
$$ 868501663 868606448 868623793 868670046 868832469 868984282 869035423 869085312 869199872 869294941 869314075 869353533
2182.3H69353533J13845P1168p809J6690R0658Q7202J4245L2068J03056O8963k39J6809
$$ 869353533 869467378 869538546 869530737 869547427 869638085 869725287 869739532 869771600 869874656 869943619 869943380 869960189
2206.8H69960189M5836M351k5511L4273R5904N5909p153J9431O2585K1994j9550K6763
$$ 869960189 870006025 870010376 869984865 870019138 870115042 870170951 870163798 870183229 870245814 870267808 870248258 870275021
2231.3H70275021O8545J6808m1902o616L3617j3470m2677J5199N3584R060k3663L219
$$ 870275021 870343566 870360374 870318472 870311856 870345473 870332003 870289326 870304525 870358109 870367169 870343506 870346725
2255.8H70346725J252m7684k7776O0559P1764n246k8670L0101M5001j4126j5020Q1598
$$ 870346725 870347977 870300293 870272517 870333076 870404840 870399594 870370924 870401025 870446026 870431900 870416880 870498478
2280.2H70498478R8706J5020K8849R7096K5034p1526J5199J47224J01149k1100K0325
$$ 870498478 870597184 870612204 870641053 870738149 870763183 870691657 870706856 870854080 870955229 870934129 870954454
2302.7H70954454J30176O0499m8518L6180J61290J17719o675l6061L874p570j2159
$$ 870954454 871084630 871145129 871096611 871132791 871294081 871411800 871405125 871369064 871372938 871365368 871353209
2325.1H71353209N6565P8142j0968j2636O6638L159j17123j20759M828K21133L80755
$$ 871353209 871409774 871487916 871476948 871464312 871530950 871534109 871416986 871296227 871301055 871522188 871902943
2347.5H71902943L16083J35779l695j13964j04129P9572R4771k0206N0426J72138Q8096
$$ 871902943 872219026 872354805 872351110 872237146 872133017 872212589 872307360 872287154 872337580 872509718 872597814
2370H72597814n4062N0068K35975K03073R6142J38700K05279J15275J3173N7458J29402
$$ 872597814 872543752 872593820 872829795 873032868 873129010 873267710 873472989 873588264 873601437 873658895 873788297
2392.4H73788297R2983P451j0312K1875r596m3690P3135J70111N0068p5936l576O1094
$$ 873788297 873881280 873888731 873878419 873900294 873890698 873847008 873920143 874090254 874140322 874064386 874060810 874121904
2416.9H74121904n9485j38521k5988N4956m3214q6069O1214J31130J6392n2989J5855
$$ 874121904 874062419 873923898 873897910 873952866 873909652 873823583 873884797 874015927 874032319 873979330 873995185
2439.3H73995185N3048m5776j11401l5823%o6638n0187O7949P0513q2195j27196r001
$$ 873995185 874048233 874002457 873891056 873855233 873855233 873788595 873738408 873806357 873876870 873794675 873667479 873658478
2463.8H73658478j6331j35422q7381N1558K5094j18017j25885j8120j7405q4877m4345
$$ 873658478 873642147 873506725 873419344 873470902 873495996 873377979 873252094 873233974 873216569 873131692 873087347
2486.2H73087347M0590k2232j30356q3446k3186j05322j57714l1530P2956l5763j72556
$$ 873087347 873127937 873105705 872975349 872891903 872868717 872763395 872605681 872574151 872647107 872611344 872438788
2508.7H72438788q7857M1247l9816j30117m1724J5617r5785j48773m0948j9670j36256
$$ 872438788 872350931 872392178 872352362 872222245 872180521 872196138 872100353 871951580 871910632 871890962 871754706
2531.1H71754706j36972J9312O2228j10984j95921n3465p331j33098j15096L8504J2637
$$ 871754706 871617734 871637046 871699274 871588290 871392369 871338904 871331573 871198475 871083379 871121883 871134520
2553.5H71134520j51396j45436k4855p0870k01761j25170N8472l636k05099j86682
$$ 871134520 870983124 870837688 870812833 870741963 870540202 870415032 870473504 870469868 870264769 870078087
2573.9H70078087p6533j35004j94848r9599m4942j77324k72691j54614n9724j77086
$$ 870078087 870001554 869866550 869671702 869572103 869527161 869349837 869077146 868922532 868862808 868685722
2594.3H68685722k65658j28388n6386k36511l36230k06709j45197k49624k46882j04011
$$ 868685722 868420064 868291676 868235290 867998779 867662549 867455840 867310643 867061019 866814137 866710126
2614.7H66710126j17957k89560l27169j92166j51694k81572k89857j38998j44780k93493
$$ 866710126 866592169 866302609 865975440 865783274 865631580 865350008 865060151 864921153 864776373 864482880
2635.1H64482880k77937j41382j97709l54468k86878j14560j37210k75254k92897k29001
$$ 864482880 864204943 864063561 863865852 863511384 863224506 863109946 862972736 862697482 862404585 862175584
2655.5H62175584k54333l14892k32398j05739j68740k88070k07364j11699k28525l03328
$$ 862175584 861921251 861606359 861373961 861268222 861099482 860811412 860604048 860492349 860263824 859960496
2675.9H59960496j79946j30951k85566l81530k70903j99318k65896k72095j98960k17379
$$ 859960496 859780550 859649599 859364033 858982503 858711600 858512282 858246386 857974291 857775331 857557952
2696.3H57557952l26275l55363k70903k52247l42131l14593j79529j87576l17812l65615
$$ 857557952 857231677 856876314 856605411 856353164 856011033 855696440 855516911 855329335 855011523 854645908
2716.7H54645908k89440k28584k69890k88188k53797l13759m15146l89159k75850k36154
$$ 854645908 854356468 854127884 853857994 853569806 853316009 853002250 852587104 852197945 851922095 851685941
2737.1H51685941k94029k86699k06351j89602k42472l18468l81827m10795l69966k64109
$$ 851685941 851391912 851105213 850898862 850709260 850466788 850148320 849766493 849355698 848985732 848721623
2757.5H48721623k29418l34501m15206l53813k93672l32296l62814l09050l31044m93586
$$ 848721623 848492205 848157704 847742498 847388685 847095013 846762717 846399903 846090853 845759809 845266223
2777.9H45266223n65529m67837l68833l60847l61323l63708m59552n59747n22434m81248
$$ 845266223 844700694 844232857 843864024 843503177 843141854 842778146 842318594 841758847 841236413 840755165
2798.3H40755165n92947o91057o24001m87089m75466o48439p73728p06255o30439o62684
$$ 840755165 840162218 839471161 838847160 838360071 837884605 837236166 836462438 835756183 835125744 834463060
2818.7H34463060o69539o21259o86765q25047q47459q11637q69274r78231j020432
$$ 834463060 833793521 833172262 832485497 831660450 830812991 830001354 829132080 828153849 827133417
2837H27133417j192748j650513k081692k277791k299428k108872j618147j002670n66303
$$ 827133417 825940669 824290156 822208464 819930673 817631245 815522373 813904226 812901556 812335253
2855.4H12335253m00245m81427o91474q81850j091957j297296j271843j064003j031280
$$ 812335253 811935008 811453581 810762107 809880257 808788300 807491004 806219161 805155158 804123878
2873.7H04123878j128554r93848p75575p86841q49903q08418q42035r85085j014472
$$ 804123878 802995324 802001476 801225901 800439060 799589157 798780739 797938704 796953619 795939147
2892.1G95939147r12308r53794j161039j228690j131773j139521j295567j425087j529694
$$ 795939147 795026839 794073045 792912006 791683316 790551543 789412022 788116455 786691368 785161674
2910.4G85161674j767457k061545k095759j816809j491368j179517p81714l30687j8954
$$ 785161674 783394217 781332672 779236913 777420104 775928736 774749219 773967505 773636818 773617864
2928.8G73617864J4782Q2314M11093P09236Q74638J130521J340747J175881P37190
$$ 773617864 773632646 773714960 774126053 774835289 775709927 776840448 778181195 779357076 780094266
2947.2G80094266L76522K21789O855k56956k09272M292J31130J89006K03550K11418
$$ 780094266 780470788 780692577 780699432 780442476 780233204 780237496 780368626 780557632 780761182 780972600
2967.6G80972600J92940K21193L43621L94344L91185M06862L29315K18273K11596K48373
$$ 780972600 781165540 781386733 781730354 782124698 782515883 782922745 783252060 783470333 783681929 783930302
2987.9G83930302L01003K35498m4703k33353l47316n60462o53684o25253n76198m41075
$$ 783930302 784231305 784466803 784422100 784188747 783841431 783280969 782627285 782002032 781425834 780984759
3008.3G80984759l37839m30941o65129r00328j009583j002848r63509r61125j019776
$$ 780984759 780646920 780215979 779550850 778650522 777640939 776638091 775674582 774713457 773693681
3026.7G73693681r58681p94173p81178j023948j244963j094758r07958j045107j259983
$$ 773693681 772735000 771940827 771159649 770135701 768890738 767795980 766888022 765842915 764582932
3045.1G64582932j331985j265645j210630j280367j340807j376986j391530j256884
$$ 764582932 763250947 761985302 760774672 759494305 758153498 756776512 755384982 754128098
3061.4G54128098j106917j086653j182377j341879j388133j260281j040279r07243
$$ 754128098 753021181 751934528 750752151 749410272 748022139 746761858 745721579 744814336
3077.7G44814336j057625j308500j400769j400709j367271j371443j508177j572013
$$ 744814336 743756711 742448211 741047442 739646733 738279462 736908019 735399842 733827829
3094G33827829j407802j232266j304686j525820j550853j363098j289249j460135j516461
$$ 733827829 732420027 731187761 729883075 728357255 726806402 725443304 724154055 722693920 721177459
3112.4G21177459j342416j336277j543104j811028k034187j996279j766980j622378
$$ 721177459 719835043 718498766 716955662 715144634 713110447 711114168 709347188 707724810
3128.7G07724810j715660j909435j883030j666129j640320j927793k143562k083778
$$ 707724810 706009150 704099715 702216685 700550556 698910236 696982443 694838881 692755103
3145F92755103j989424j848757j704216j914204k272069k298355k155185k138793k176226
$$ 692755103 690765679 688916922 687212706 685298502 683026433 680728078 678572893 676434100 674257874
3163.4F74257874k141177k088726k141118k250612k283096k228916k223134k278566
$$ 674257874 672116697 670027971 667886853 665636241 663353145 661124229 658901095 656622529
3179.7F56622529k269745k248823k296567k315045k264917k254009k332032k399444
$$ 656622529 654352784 652103961 649807394 647492349 645227432 642973423 640641391 638241947
3196F38241947k379239k330422k299428k254784k194584k229571k297163k238572k187788
$$ 638241947 635862708 633532286 631232858 628978074 626783490 624553919 622256756 620018184 617830396
3214.3F17830396k231956k244592k188265k157688k207518k252638k175510j980841
$$ 617830396 615598440 613353848 611165583 609007895 606800377 604547739 602372229 600391388
3230.7F00391388j858592k000272k170623k083361j952529j922309j821637j711607
$$ 600391388 598532796 596532524 594361901 592278540 590326011 588403702 586582065 584870458
3247E84870458j778245j841903j745641j620472j638353j756370j738190j622975j590133
$$ 584870458 583092213 581250310 579504669 577884197 576245844 574489474 572751284 571128309 569538176
3265.3E69538176j520693j362503j426160j688302j808762j770437j689136j678765
$$ 569538176 568017483 566654980 565228820 563540518 561731756 559961319 558272183 556593418
3281.6E56593418j728654j711666j651049j613915j656413j780331j900137k019405
$$ 556593418 554864764 553153098 551502049 549888134 548231721 546451390 544551253 542531848
3298E42531848k045512j874626j717091j829505k159953k413332k446890k371252k311289
$$ 542531848 540486336 538611710 536894619 535065114 532905161 530491829 528044939 525673687 523362398
3316.3E23362398k301454k314747k312600k325297k462685k623916k617001k544165
$$ 523362398 521060944 518746197 516433597 514108300 511645615 509021699 506404698 503860533
3332.6E03860533k471089k356678k428562k692401k799839k789557k702594k478868
$$ 503860533 501389444 499032766 496604204 493911803 491111964 488322407 485619813 483140945
3348.9D83140945k563983k971887l065020k781183k567142k604991k647966k442390
$$ 483140945 480576962 477605075 474540055 471758872 469191730 466586739 463938773 461496383
3365.3D61496383k266556k494365k855808k802461k395213k150625k132624k115458
$$ 461496383 459229827 456735462 453879654 451077193 448681980 446531355 444398731 442283273
3381.6D42283273j993329j761138j422018j070410j134038j556516j552552r73582
$$ 442283273 440289944 438528806 437106788 436036378 434902340 433345824 431793272 430819690
3397.9D30819690o43015j066297j525223j262576q08239p00146o86645o79910o83546
$$ 430819690 430176675 429110378 427585155 426322579 425514340 424814194 424127549 423447639 422764093
3416.3D22764093n37396l73512k98679j10775K24232M97967N23716N58496P33942O40064
$$ 422764093 422226697 421853185 421554506 421443731 421667963 422165930 422689646 423248142 423982084 424622148
3436.6D24622148K92480K75553P42614J192510J295030J235157J283616J442969J647741
$$ 424622148 424914628 425190181 425932795 427125305 428420335 429655492 430939108 432382077 434029818
3455D34029818J851886J952350J817793J820564K258361K516835K141893J592398J577795
$$ 434029818 435881704 437834054 439651847 441472411 443730772 446247607 448389500 449981898 451559693
3473.4D51559693J995086K413810K477228K120584K016545K334744K443462K335221
$$ 451559693 453554779 455968589 458445817 460566401 462582946 464917690 467361152 469696373
3489.7D69696373K411306K565175K668679K647340K564102K518923K375483K285063
$$ 469696373 472107679 474672854 477341533 479988873 482552975 485071898 487447381 489732444
3506D89732444K451808K752393L031880K976268K679587K686679K933800L154814L083349
$$ 489732444 492184252 494936645 497968525 500944793 503624380 506311059 509244859 512399673 515483022
3524.4E15483022K812981K854050L145873L362775L492713L434300L286302L489435
$$ 515483022 518296003 521150053 524295926 527658701 531151414 534585714 537872016 541361451
3540.7E41361451L750444L609836L299057L339887L552675L667534L791451L897369
$$ 541361451 545111895 548721731 552020788 555360675 558913350 562580884 566372335 570269704
3557E70269704L985643M017949L792525L515780M036724M863441M791200M446626M460931
$$ 570269704 574255347 578273296 582065821 585581601 589618325 594481766 599272966 603719592 608180523
3575.3F08180523M628420M824459N066872N078673M710555M561544N129576N234539
$$ 608180523 612808943 617633402 622700274 627778947 632489502 637051046 642180622 647415161
3591.7F47415161M882336M991352N412221N479098N333602N199790M887641M823446
$$ 647415161 652297497 657288849 662701070 668180168 673513770 678713560 683601201 688424647
3608F88424647N059361N122483N212307N088270M848361N258143N356550M721463M010081
$$ 688424647 693484008 698606491 703818798 708907068 713755429 719013572 724370122 729091585 733101666
3626.3G33101666L944039M932762N001246M449606M172981L990829L858149L701151
$$ 733101666 737045705 741978467 746979713 751429319 755602300 759593129 763451278 767152429
3642.6G67152429L304422K765893K905727L741443L628790K946914K927005L131628
$$ 767152429 770456851 773222744 776128471 779869914 783498704 786445618 789372623 792504251
3659G92504251K663791K142370J999676J726687J354098J620412J513243R07004J510084
$$ 792504251 795168042 797310412 799310088 801036775 802390873 804011285 805524528 806431532 807941616
3677.3H07941616K168357K013266J766503J534998J188577Q73327J168847J545012
$$ 807941616 810109973 812123239 813889742 815424740 816613317 817486644 818655491 820200503
3693.6H20200503J390517R96828O79731O69062R81391R70304M74095k265K78354J139939
$$ 820200503 821591020 822587848 823267579 823936641 824918032 825888336 826362431 826360166 826638520 827778459
3714H27778459J237392P28846K48432Q4400K13861M49360O92904N24938M7982l5048
$$ 827778459 829015851 829744697 829993129 830077529 830291390 830740750 831433654 831958592 832006574 831971526
3734.4H31971526N26905R43840O05762l08693o35266L14116L31283j14560N44310R82046
$$ 831971526 832498431 833442271 834048033 833739340 833104074 833418190 833749473 833634913 834179223 835161269
3754.8H35161269O06715K12014K92957L87549K31743J30892M4823K26736N31792M38750
$$ 835161269 835767984 835979998 836272955 836660504 836892247 837023139 837067962 837294698 837826490 838265240
3775.2H38265240J63377p332Q8334J49310J21593K50519L30329K39372k0743k20179
$$ 838265240 838428617 838421285 838509619 838658929 838780522 839031041 839361370 839600742 839579999 839359820
3795.6H39359820j09911k64645l91364K26617L00169J48535M63426M66525M888l58224
$$ 839359820 839249909 838985264 838593900 838820517 839120686 839269221 839732647 840199172 840204060 839845836
3816H39845836k13265l08574r2923N28395M64380K37703O4612m2081L099k56538n01156
$$ 839845836 839632571 839323997 839231074 839759469 840223849 840461552 840526164 840484083 840487182 840230644 839729488
3838.4H39729488l3140M31657N97178N20766L6299p70986j471102l05235J170456Q73089
$$ 839729488 839696348 840128005 840725183 841245949 841282248 840511262 839040160 838734925 839905381 840778470
3858.8H40778470J11342l77238k69115n96j46628j2040L20971L80039K60294j74046
$$ 840778470 840889812 840512574 840243459 840242863 840096235 840084195 840405166 840785205 841045499 840871453
3879.2H40871453j81317J64330Q2374R1850Q047j92702R2089K35737k32220o43075
$$ 840871453 840690136 840854466 840936840 841028690 841036737 840844035 840936124 841171861 840939641 840296566
3899.6H40296566m75764N96N18859O66439L76225R3221r8407k59340k04563M77M1604
$$ 840296566 839820802 839821398 840340257 841006696 841382921 841476142 841377735 841118395 840913832 840914309 840955913
3922.1H40955913j1146P2598J04368m5180j2159K26497J94013j19q0943p6890O497
$$ 840955913 840944767 841017365 841121733 841076553 841064394 841290891 841484904 841484785 841403842 841326952 841333449
3944.5H41333449k8193j06394L278J02103J08480J06156O3419m708K9385R9361M3451
$$ 841333449 841305256 841198862 841202140 841304243 841412723 841518879 841582298 841577590 841606975 841706336 841749787
3966.9H41749787k8729O020O9022Q4758J4663o3658N9903J82867O1333n2691m6134
$$ 841749787 841721058 841727078 841796100 841880858 841895521 841831863 841891766 842074633 842135966 842083275 842037141
3989.4H42037141K9505J18494J17302J01566
$$ 842037141 842066646 842185140 842302442 842404008
3997.5H42404008
$$ 842404008
##END=$$ End of the data block
