##TITLE=$$ Begin of the data block
##JCAMP-DX=5.00 $$ ACD/SpecManager v 10.08
##SPECTROMETER/DATA SYSTEM=Alpha
##DATE=07 Apr 2014 11:14:18
##DATA TYPE=INFRARED SPECTRUM
##DATA CLASS=XYDATA
##ORIGIN=
##OWNER=
##NPOINTS=1765
##FIRSTX=399.75695801
##LASTX=3997.56933594
##MAXX=3997.56933594
##MINX=399.75695801
##MAXY=0.87557000
##MINY=0.42142606
##XFACTOR=1.0000000000
##YFACTOR=1.000000000000000e-9
##FIRSTY=0.71775693
##DELTAX=2.03957629
##XUNITS=1/CM
##YUNITS=ARBITRARY UNITS
##XYDATA=(X++(Y..Y))
399.8 717756927 718393683 716767073 715552628 716112971 715331018 713048756 712593794 713649809 713108599
418.1 713108599 711299956 711503386 711849570 710395992 709570765 710472286 710394561 708922684 708697081
436.5 708697081 709485888 708754659 707313299 707787454 708755970 707780004 706544995 707157254 707948208
454.8 707948208 706923425 705778778 706183076 706205130 704955697 704267383 704554617 703803957 702187300
473.2 702187300 702185988 702930093 702035844 700587034 700820744 701638341 701031864 700141728 700480044 700623274
493.6 700623274 699354112 698355615 698540390 698142886 696621060 696000576 696437836 695910156 694555402
511.9 694555402 694165349 694316089 693330169 691910386 691681683 691579282 689994752 688361466 688143134
530.3 688143134 687818289 686290145 685084283 685082793 684728861 683383882 682528853 682623565 682284117 681136072
550.7 681136072 680413067 680198252 679274261 677796543 676964283 676394820 674878776 672944188 671885490
569 671885490 671253026 669851422 668195665 667382717 666720569 665236771 663831532 663360178 662841797
587.4 662841797 661546290 660477638 660198748 659573138 658030629 656556785 655468583 653762460 651521742
605.8 651521742 650120676 649782360 649216175 648233175 648192644 649509907 651261687 653309822 656314313
624.1 656314313 659821093 662672639 664994836 667851508 670894802 673015058 674711227 676886678
640.4 676886678 678815603 679890037 681349277 683882415 686017692 686703742 687237918 689101994 691829145
658.8 691829145 694432616 697245002 700325012 702758312 704362810 706559896 709242761 711228967
675.1 711228967 712563217 714619577 717112303 718534708 719302297 720882893 722769260 723610282 724037707
693.5 724037707 725250483 726455629 726678133 726988792 728480160 730091274 730796039 731704473 733585894
711.8 733585894 735214055 735982955 737207651 739409447 741122544 741880476 743186712 745298624 746682227
730.2 746682227 747242570 748502672 750388503 751367748 751652598 752820492 754654229 755673766 756342649
748.5 756342649 758076489 760100722 761048913 761835277 763642371 765436828 766139686 766845524 768468857
766.9 768468857 769741654 769903600 770209610 771173298 771455407 770614386 770097792 770405948 770223796 769416690
787.3 769416690 769630969 771103621 772444189 773730218 776389420 780153751 783399820 786097527 789387465
805.6 789387465 792832315 795060337 796590328 798686385 800560832 801005542 800893366 801208198 800954223
824 800954223 799250305 797200918 795803726 794114769 791474342 789148331 787869692 786410213 784183741
842.3 784183741 782453001 781814814 781407535 781300426 782883346 786346495 790292919 794325888 799372017
860.7 799372017 805069983 809791088 813467503 817299604 820889413 823009133 824324906 826145649
877 826145649 827782989 827935874 827304363 827148437 826814353 825374424 823818445 823233545 822965443 822401166
897.4 822401166 822480977 823794901 825143754 825695336 826338530 827397048 827564895 826372743 825028121
915.8 825028121 823903024 821988404 819424927 817760527 817280114 816817701 816333950 816824675 817871153
934.1 817871153 818121016 817814469 818084180 818484545 817931712 816910803 816336632 815537572 813503027
952.5 813503027 810834110 808357954 805299699 800813437 795650840 790434659 784180939 776348710
968.8 776348710 768254220 760934889 753895938 747053087 741465807 737294018 733342350 729268193
985.1 729268193 725990295 723582864 721095622 718496919 716701210 715692222 714506924 713116348
1001.4 713116348 712249696 711452901 709584296 706801176 704014421 701083124 697399080 693538845 690376818
1019.8 690376818 687455177 684042633 680641353 677905262 675311565 672361553 669717968 667899370
1036.1 667899370 666276097 664361358 662671089 661430001 659907639 657836676 655994236 654807389
1052.4 654807389 653859973 653151453 653344035 654305398 654899180 654608011 653847814 652545214 650176108
1070.8 650176108 647088408 644152105 641402900 638343930 635182559 632415354 629759014 626660228
1087.1 626660228 623449385 620863736 618864238 617097020 615826905 615301311 614944220 614217103 613402784
1105.4 613402784 612796903 612009525 610708117 609245241 607834399 605850160 602900326 599852681 597736418
1123.8 597736418 596319854 595285475 595712900 597713649 599535763 600692809 602221072 604387283
1140.1 604387283 606455505 608066320 609594405 611179829 612511933 613638878 615059376 616883278
1156.4 616883278 618759334 620817363 623653173 627284765 631250262 635557175 640529454 645905554
1172.7 645905554 651062667 655986488 661033273 666004002 670393825 674270511 677914143 680950165
1189.1 680950165 682933390 684281349 685596824 686763823 687603414 688674808 690485597 692617536
1205.4 692617536 694565117 696547747 698703825 700513244 701721668 702907860 704440951 705840588
1221.7 705840588 706867933 708089530 709778726 711430609 712827742 714473248 716508508 718365371
1238 718365371 719890594 721541643 723260999 724464178 725168705 725911140 726658106 726979196 727129340
1256.4 727129340 727739394 728736401 729713202 730937362 732903779 735309720 737577438 739926875 742797732
1274.7 742797732 745804787 748425245 751054347 754167020 757306874 760067940 762923121 766151428
1291 766151428 769150376 771529436 773778856 776205778 778239131 779586911 780859470 782334805 783439577
1309.4 783439577 783982098 784621716 785580397 786253870 786611497 787368417 788506925 789333880 789844811
1327.8 789844811 790603220 791434646 791629612 791289330 791102767 791165590 791104972 791077495 791472197 791982949
1348.1 791982949 792025208 791862428 792007565 792125463 791726172 791033745 790465176 789912045 788987935 787949085
1368.5 787949085 787284672 786358893 784631968 782917500 780888736 776826799 771589816 769219756 771359205
1386.9 771359205 774624109 776176810 776537538 776345670 775534332 774133563 772914410 771806419 770027816
1405.3 770027816 768147349 766865730 765813529 764594495 763368368 762232780 761181295 760503709
1421.6 760503709 760078967 759960830 759951055 759456396 759098113 759472966 759813607 759997070 760826468 762158751
1442 762158751 763418138 764334917 765409589 767243147 769385874 771344781 773653626 777380109 781312585
1460.3 781312585 784596324 787958026 791811287 795446038 798707545 802538514 806871533 810412109
1476.6 810412109 813067436 815388322 817487836 818795085 819102168 818900108 818843067 818769217 818006158
1495 818006158 816529095 815138936 813914657 812561393 810143232 805727065 802500904 800644338 798781812
1513.4 798781812 796558321 794061601 791934371 789958537 788304329 786804318 785232902 784290373
1529.7 784290373 783176959 781203449 779974103 779325902 777320206 775220752 774904907 775361121 775733232
1548 775733232 775683701 775769114 776258588 776589215 775569379 774543583 775098920 775080323 774040103 772207558
1568.4 772207558 769860804 767871678 765183806 760804236 757058620 753892124 749920487 745531440
1584.7 745531440 740973413 735964298 730612338 725306690 719950438 714449346 708950818 703503430
1601.1 703503430 698078692 692618191 687050462 681450307 676126182 671099782 665283859 658641100
1617.4 658641100 654099345 650483787 645980120 641939163 638644397 635796070 634071290 632861078
1633.7 632861078 631402791 631218731 632615328 634721756 637105227 639826596 643530309 647460461
1650 647460461 651357055 656450272 661624014 666367292 671103716 676095068 681473434 686580539 691584289
1668.4 691584289 697012961 702360094 707890630 713793635 719267905 724395752 729698718 736043394
1684.7 736043394 742315173 748014987 753882229 759184062 764260590 769857883 775783598 782399535
1701 782399535 788262486 793462753 798717678 803198636 806882799 810182035 813132823 815840483 818730235
1719.3 818730235 821678281 824298620 826483369 828360856 830283225 832051575 833428502 835173190
1735.7 835173190 837276757 839229643 841005445 842826366 844707608 846352518 847696722 849325180
1752 849325180 851141155 852544546 853528380 854461432 855551064 856628716 857399464 858033121 858704567
1770.3 858704567 859214306 859889984 860884607 861807108 862407029 862869859 863479972 864229679 864764094 864871085
1790.7 864871085 865105629 865772426 866321564 866611660 867031097 867645681 868119538 868422151 868732750 869061470
1811.1 869061470 869328797 869614422 870025456 870460868 870659053 870664895 870834172 871111810 871155500 871344149
1831.5 871344149 871886969 872282207 872398317 872544467 872733653 872685909 872656643 872985840 873460233 873778582
1851.9 873778582 873857200 873927295 874104857 874225318 874226213 874278784 874340951 874240220 874224782 874506414 874839723
1874.4 874839723 874978423 874948502 874984622 875137627 875192761 875104129 875041723 875129819 875208616 875167489 875263453
1896.8 875263453 875508726 875569999 875433028 875390172 875434399 875350833 875259221 875378966 875509202 875352204
1917.2 875352204 875121951 875092149 875116885 875069678 875021994 875092268 875157773 875030220 874886930 874917269 874860883
1939.6 874860883 874500990 874241829 874358654 874449193 874274850 874098182 874060512 873947322 873693585 873542190
1960 873542190 873571217 873491943 873176754 872969389 872980416 872875690 872636259 872539103 872558117 872436404 872197628
1982.5 872197628 872079432 872035027 871827126 871533096 871453881 871521473 871392608 871126950 871024013 870982170
2002.8 870982170 870770991 870539427 870490253 870443106 870196939 869942129 869874835 869819701 869610965 869427741
2023.2 869427741 869392216 869301856 869052231 868887424 868887961 868791401 868546844 868408561 868438184 868376911 868160903
2045.7 868160903 868041635 868047535 867945135 867755413 867702007 867743015 867657304 867493808 867449880 867453456 867339194
2068.1 867339194 867204070 867211342 867251396 867146790 867009163 867054820 867162347 867115557 867048800 867103815 867142081
2090.5 867142081 867055655 866992712 867067218 867133141 867087901 867072344 867169678 867229700 867181957 867178380 867259622 867282689
2115 867282689 867251873 867319405 867471039 867519736 867466211 867483616 867570519 867614508 867627263 867703378 867822170
2137.5 867822170 867880344 867909312 868008554 868134260 868193626 868229866 868333995 868473232 868550479 868591309 868694663
2159.9 868694663 868813097 868840635 868867576 869001329 869145155 869211793 869285345 869417489 869506478 869513392 869553566
2182.3 869553566 869667530 869737387 869738758 869781256 869881094 869941473 869944215 869999826 870130301 870215178 870208859 870214820
2206.8 870214820 870275199 870293260 870270312 870318651 870416522 870445251 870408356 870411098 870474517 870504260 870490015 870547712
2231.3 870547712 870649338 870634973 870547593 870562077 870631635 870600820 870514393 870526135 870633483 870685220 870646656
2253.7 870646656 870617688 870608568 870556235 870516896 870576739 870655119 870647311 870628417 870694280 870769322 870770693 870759487
2278.2 870759487 870823860 870911658 870939195 870968163 871044755 871092975 871072948 871071339 871142626 871196508 871199787 871271014
2302.7 871271014 871393919 871409237 871370435 871459365 871651053 871764541 871740937 871708989 871718645 871684134 871632397
2325.1 871632397 871659756 871752381 871840060 871893823 871891320 871847928 871784925 871679902 871625900 871806383 872188985
2347.5 872188985 872514784 872643709 872605145 872486472 872438014 872522116 872568786 872557521 872598648 872681558 872720003
2370 872720003 872705638 872828662 873134673 873391509 873511851 873637736 873812735 873911262 873912156 873943865 874050498
2392.4 874050498 874137163 874162912 874209404 874285996 874286056 874233782 874289930 874427021 874452293 874373913 874370515 874429584
2416.9 874429584 874379694 874241650 874188244 874205232 874162853 874126434 874220669 874324024 874277532 874210179 874282718
2439.3 874282718 874373913 874316990 874209821 874201894 874203026 874101639 874019563 874086142 874161541 874078810 873970926
2461.7 873970926 873977721 873951852 873812377 873738229 873798907 873812556 873680651 873553813 873534143 873512924 873435378
2484.2 873435378 873413682 873475552 873454988 873291612 873162806 873145401 873087108 872952700 872911453 872952819 872874379
2506.6 872874379 872704148 872643530 872660577 872589171 872480035 872482717 872519076 872415364 872258008 872229517 872226715
2529 872226715 872078061 871912181 871915817 871977925 871898234 871762395 871738911 871710300 871542931 871407211 871455789
2551.5 871455789 871492624 871338606 871180952 871163666 871107697 870906949 870743573 870728731 870691121 870517015
2571.9 870517015 870360792 870298684 870189011 870001078 869881988 869838059 869687915 869430721 869257867 869159698
2592.3 869159698 868964136 868710220 868589401 868521392 868278503 867956579 867765784 867622197 867377758 867135167
2612.7 867135167 867017448 866887391 866607606 866316915 866164804 866016626 865702033 865371823 865227044 865104258
2633.1 865104258 864811718 864510417 864345133 864156425 863838017 863578796 863481164 863324761 862984300 862678170
2653.5 862678170 862530112 862324357 861986160 861755252 861669898 861484945 861158788 860907555 860768855 860568285
2673.9 860568285 860317528 860153854 859992802 859672606 859301865 859073460 858892262 858601689 858297288 858112097
2694.3 858112097 857945204 857647657 857306719 857041478 856764495 856416285 856128991 855945647 855696857 855320215
2714.6 855320215 854966342 854719818 854479194 854178309 853921175 853698492 853356063 852932453 852591455 852357745
2735 852357745 852101386 851762831 851482749 851317465 851136506 850877523 850572646 850223899 849819839 849420249
2755.4 849420249 849114835 848875165 848569036 848189235 847848713 847534299 847164869 846800983 846516371 846185982
2775.8 846185982 845699608 845162213 844693601 844292104 843915045 843568504 843206882 842715561 842133582 841613591
2796.2 841613591 841151416 840586662 839900553 839262843 838767588 838295221 837662101 836904407 836198390 835548520
2816.6 835548520 834881842 834230721 833614826 832933664 832102716 831212282 830393732 829571247 828623712 827605367
2837 827605367 826398790 824716866 822601438 820310295 818024457 815920889 814283609 813298166 812776744
2855.4 812776744 812381446 811888933 811192870 810287654 809166551 807866573 806612134 805554390 804518461
2873.7 804518461 803402364 802424371 801649928 800876021 800050676 799249887 798418581 797455847 796432912
2892.1 796432912 795481741 794500232 793327391 792097330 790994108 789902389 788628757 787194371 785647750
2910.4 785647750 783870161 781814635 779716134 777856410 776337266 775187254 774417937 774045050 774002373
2928.8 774002373 774055600 774188161 774603844 775285423 776149690 777290463 778623700 779771328 780493081
2947.2 780493081 780898273 781183004 781234860 780978978 780759811 780781388 780930161 781117141 781311333 781497598
2967.6 781497598 781678617 781932473 782304108 782672167 783030570 783438206 783773661 784003437 784211695 784435928
2987.9 784435928 784747005 785008848 784954250 784709096 784412742 783932805 783291161 782612920 782013416 781584620
3008.3 781584620 781228542 780771434 780119956 779251993 778260648 777263582 776322842 775384426 774358630
3026.7 774358630 773381710 772557557 771748185 770725548 769501150 768423021 767518997 766473055 765221179
3045.1 765221179 763907909 762655735 761421084 760112703 758810639 757494271 756102741 754803956
3061.4 754803956 753661573 752561092 751400173 750104010 748743534 747485280 746430635 745510161
3077.7 745510161 744452894 743138552 741732001 740337551 738972127 737604678 736124277 734584630
3094 734584630 733160079 731869817 730545282 729028046 727465332 726105332 724852324 723439455 721940696
3112.4 721940696 720565617 719194412 717667162 715890110 713844299 711830735 710069776 708404660
3128.7 708404660 706605196 704691470 702909648 701320469 699654579 697674811 695541799 693504572
3145 693504572 691524565 689645469 687929332 686041534 683788180 681450129 679214299 677034914 674887717
3163.4 674887717 672777057 670666218 668499470 666281104 664051831 661823690 659563899 657288790
3179.7 657288790 655048907 652797103 650493741 648186386 645907640 643615067 641250074 638852596
3196 638852596 636499286 634181798 631877303 629609466 627395213 625154495 622862220 620618820 618425488
3214.3 618425488 616216123 613977849 611762047 609579384 607354760 605122030 603000462 601034701
3230.7 601034701 599124789 597054064 594851017 592774451 590835154 588920355 587095261 585354507
3247 585354507 583545268 581698716 579973936 578343987 576648951 574893177 573218822 571638525 570041955
3265.3 570041955 568479419 567076564 565629542 563934386 562130332 560381711 558715522 557033062
3281.6 557033062 555265844 553521276 551878989 550285220 548640311 546867788 544962823 542938471
3298 542938471 540892124 539018750 537325978 535500109 533288240 530831039 528350592 525920749 523569763
3316.3 523569763 521294236 519046307 516781926 514465630 511992514 509335399 506669223 504096508
3332.6 504096508 501611769 499223381 496760547 494082600 491320521 488531649 485809773 483301491
3348.9 483301491 480713695 477748871 474678099 471875459 469312906 466721863 464071780 461621940
3365.3 461621940 459340543 456836581 453986645 451160014 448681295 446451664 444340974 442289263
3381.6 442289263 440301001 438538939 437146157 436085492 434944540 433395922 431824565 430788338
3397.9 430788338 430076629 428964913 427440286 426201284 425409734 424731433 424066782 423370332 422667265
3416.3 422667265 422166944 421828687 421526909 421426058 421647519 422098219 422594428 423185140 423981190 424650520
3436.6 424650520 424939275 425228834 425963491 427081108 428317249 429586649 430950373 432429343 434021294
3455 434021294 435793012 437750548 439645529 441527158 443799913 446309268 448447078 450049669 451641470
3473.4 451641470 453636050 456037015 458512902 460639238 462665141 465008199 467419833 469716102
3489.7 469716102 472144336 474765033 477434278 480016708 482564330 485144526 487592936 489917696
3506 489917696 492395431 495176226 498206258 501136959 503746927 506414533 509441614 512667298 515693605
3524.4 515693605 518464923 521350503 524534762 527902484 531358242 534788787 538128972 541687489
3540.7 541687489 545488596 549110651 552386343 555699587 559272826 562976182 566769063 570680141
3557 570680141 574720263 578772843 582567632 586097360 590141416 594981968 599753201 604211032 608686328
3575.3 608686328 613301635 618114889 623221755 628386259 633112788 637579858 642663240 647959471
3591.7 647959471 652941406 657997310 663400888 668847322 674195290 679474890 684441507 689283073
3608 689283073 694356501 699532986 704788983 709893286 714739025 719980478 725363493 730141342 734160781
3626.3 734160781 738055468 742920637 747867823 752296627 756506205 760557890 764419436 768082976
3642.6 768082976 771395743 774199188 777092934 780807912 784473777 787488341 790410399 793452203
3659 793452203 796036720 798145413 800123513 801787317 803082228 804755867 806362271 807274580 808735669
3677.3 808735669 810854971 812823713 814606607 816181302 817352831 818213344 819413662 820996404
3693.6 820996404 822434723 823429883 824031830 824631631 825593352 826579809 827101171 827141881 827439070 828602970
3714 828602970 829850018 830564916 830822587 830944896 831181347 831631362 832297385 832809627 832910001 832894564
3734.4 832894564 833353639 834245205 834839761 834554672 833935082 834199905 834497392 834405720 834960043 835925341
3754.8 835925341 836521208 836760700 837129951 837570190 837759078 837842464 837935627 838185072 838670671 839080274
3775.2 839080274 839248657 839268208 839359760 839466512 839538336 839776576 840122938 840360165 840321600 840088665
3795.6 840088665 839979529 839745820 839389443 839620531 839931905 840115726 840621114 841117978 841125548 840763986
3816 840763986 840537071 840212405 840168238 840751052 841192484 841332436 841270685 841155887 841175318 840974033
3836.4 840974033 840494812 840383708 840713739 841315567 841898203 841975868 841231644 839775801 839492500 840677917
3856.8 840677917 841578662 841759145 841459155 841263771 841291666 841070652 840935051 841165483 841525435 841847599
3877.2 841847599 841728151 841501296 841616094 841719151 841807187 841773510 841616273 841827810 842108130 841853023
3897.6 841853023 841259122 840858340 840803623 841177821 841756821 842121184 842236400 842184186 841951489 841717541
3918 841717541 841690660 841769397 841823637 841911972 841941953 841778040 841731131 841998339 842215478 842248082 842215359
3940.4 842215359 842124999 842050135 841981113 841942787 842058301 842191041 842250168 842319608 842392743 842423856 842445850
3962.9 842445850 842497110 842538238 842541337 842576504 842679679 842794240 842828691 842774510 842824638 842982888 842999578
3985.3 842999578 842898190 842870712 842931628 842997074 843035698 843082547
3997.5 843082547
##END=$$ End of the data block
