##TITLE=$$ Begin of the data block
##JCAMP-DX=5.00 $$ ACD/SpecManager v 10.08
##SPECTROMETER/DATA SYSTEM=Alpha
##DATE=07 Apr 2014 11:14:18
##DATA TYPE=INFRARED SPECTRUM
##DATA CLASS=XYDATA
##ORIGIN=
##OWNER=
##NPOINTS=1765
##FIRSTX=399.75695801
##LASTX=3997.56933594
##MAXX=3997.56933594
##MINX=399.75695801
##MAXY=0.87587875
##MINY=0.42170146
##XFACTOR=1.0000000000
##YFACTOR=1.000000000000000e-9
##FIRSTY=0.71607560
##DELTAX=2.03957629
##XUNITS=1/CM
##YUNITS=ARBITRARY UNITS
##XYDATA=(X++(Y..Y))
399.8G16075599J98245j772880j004219O82532n25772j881838q9049J455009l01242
$$ 716075599 716273844 714500964 713496745 714179277 713653505 711771667 711682618 713137627 712836385
418.1G12836385j949489q9109K93433j227438p92801P52270j82688j684487l45707
$$ 712836385 710886896 710797787 711091220 709863782 709070981 709823251 709640563 707956076 707610369
436.5G07610369J013636n54502j531779M03642J172424m44711r16302L93152O40273
$$ 707610369 708624005 708069503 706537724 706941366 708113790 707669079 706752777 707145929 707786202
454.8G07786202q97586j102030L88324l695j474619q88229L99232o45995j731515j53124
$$ 707786202 706888616 705786586 706174910 706171215 704696596 703808367 704207599 703561604 701830089 701676965
475.2G01676965P18832p29144j238167L27051P03573r37045j192450K94566K81215
$$ 701676965 702395797 701666653 700428486 700755537 701459110 700522065 699329615 699624181 699905396
493.6F99905396j186550r85921K35856l73423j550377o19590N18561m82619j475752
$$ 699905396 698718846 697732925 697968781 697595358 696044981 695425391 695943952 695461333 693985581
511.9F93985581m29511K87116r46641j508892l26991p4923j383483j560211l35455
$$ 693985581 693556070 693843186 692896545 691387653 691060662 690985739 689602256 688042045 687706590
530.3F87706590l39508j416386j149594N2094j65343j198650r27031p1287n05328j308083
$$ 687706590 687367082 685950696 684801102 684853196 684687853 683489203 682562172 682490885 681985557 680677474
550.7F80677474p80106j08421q15213j551330r57489m44650j222313j755774j008749
$$ 680677474 679897368 679788947 678973734 677422404 676464915 676020265 674797952 673042178 672033429
569F72033429p14600j521051j692355q11994n90205j401245j445771o30259o15895
$$ 672033429 671318829 669797778 668105423 667293429 666703224 665301979 663856208 663225949 662610054
587.4F62610054j204789r71496l37541p19190j537382j396358r96828j682043k243519
$$ 662610054 661405265 660433769 660096228 659377038 657839656 656443298 655446470 653764427 651520908
605.8F51520908j396477m92454p12633q52406J64092J349568J689136K049327L076732
$$ 651520908 650124431 649631977 648919344 648066938 648231030 649580598 651269734 653319061 656395793
624.1F56395793L516495K791643K358139K941966L048122K057969J646400K224564
$$ 656395793 659912288 662703931 665062070 668004036 671052158 673110127 674756527 676981091
640.4F76981091K002121J096487J477420K551317K142549P16746N60522J809120K632022
$$ 676981091 678983212 680079699 681557119 684108436 686250985 686967731 687528253 689337373 691969395
658.8F91969395K602100K899706L126145K415478J533151K162873K768040K116025
$$ 691969395 694571495 697471201 700597346 703012824 704545975 706708848 709476888 711592913
675.1G11592913J352429J954973K413213J377165P63476J671136J966655Q30233L76761
$$ 711592913 712945342 714900315 717313528 718690693 719454169 721125305 723091960 723922193 724298954
693.5G24298954J200259J261234L01659L66449J463473J519084O51360Q57174J861036
$$ 724298954 725499213 726760447 727062106 727428555 728892028 730411112 731062472 731919646 733780682
711.8G33780682J729369Q77857J239717K148390J665175P82669J374543K178013J436353
$$ 733780682 735510051 736387908 737627625 739776015 741441190 742223859 743598402 745776415 747212768
730.2G47212768N41210J165688J808345R49383L11017J237988J833916R76861O99103
$$ 747212768 747753978 748919666 750728011 751677394 751988411 753226399 755060315 756037176 756736279
748.5G56736279J763820K010524R03428P03394J744330J764477P00652P37310J684963
$$ 756736279 758500099 760510623 761414051 762117445 763861775 765626252 766326904 767064214 768749177
766.9G68749177J339496J16646K02060J005590L91066q09789m92692L41892j99377
$$ 768749177 770088673 770205319 770407379 771412969 771804035 770994246 770501554 770843446 770644069
785.2G70644069q37088K06888J441657J271427J243115K678513L777385L197491K662778
$$ 770644069 769806981 770013869 771455526 772726953 773970068 776648581 780425966 783623457 786286235
803.6G86286235L360987L514349K188504J494586K102018J842737L67224j84894L05772
$$ 786286235 789647222 793161571 795350075 796844661 798946679 800789416 801156640 800971746 801277518
821.9H01277518k31683j703739k025068j376212j721799k641082k273857j248539j454890
$$ 801277518 801045835 799342096 797317028 795940816 794219017 791577935 789304078 788055539 786600649
840.3G86600649k209186j744807o79433l94285n8949J621187L456950L901601M002869
$$ 786600649 784391463 782646656 781967223 781572938 781513989 783135176 786592126 790493727 794496596
858.7G94496596N002141N653202M749597L714084L822804L588497K128065J296043
$$ 794496596 799498737 805151939 809901536 813615620 817438424 821026921 823154986 824451029
875H24451029J775205J615167J79231o12914j80245l73542j489520j581133n45084
$$ 824451029 826226234 827841401 828020632 827407718 827227473 826853931 825364411 823783278 823238194
893.3H23238194k22981n45263J11758J361788J389444N92947O68347J022398J17719
$$ 823238194 823015213 822469950 822581708 823943496 825332940 825925887 826594234 827616632 827734351
911.7H27734351j204610j359582j153230j923025k547502j660824n10037m92275n13673
$$ 827734351 826529741 825170159 824016929 822093904 819546402 817885578 817375541 816883266 816369593
930H16369593M60088J042843K63572l10838K61187M04060n64575j001954n20885p92205
$$ 816369593 816829681 817872524 818136096 817825258 818086445 818490505 817925930 816923976 816403091 815610886
950.4H15610886k056063k668261k451718l030598m489541n216241n286634o266713
$$ 815610886 813554823 810886562 808434844 805404246 800914705 795698464 790411830 784145117
966.8G84145117p767081q038223p330299p078409o865620n579830m134893l897786
$$ 784145117 776378036 768339813 761009514 753931105 747065485 741485655 737350762 733452976
983.1G33452976m047692l280640k408087k520502k653956j805365j013100j244545
$$ 733452976 729405284 726124644 723716557 721196055 718542099 716736734 715723634 714479089
999.4G14479089j467765q80777p41780j857877k810597k752960k883077l685832l896892
$$ 714479089 713011324 712130547 711388767 709530890 706720293 703967333 701084256 697398424 693501532
1017.7F93501532l205001k943695l407657l373742k690256k544582k919256k644778
$$ 693501532 690296531 687352836 683945179 680571437 677881181 675336599 672417343 669772565
1034.1F69772565j840353j660168j944244j669109j205265j510978k047241j809656
$$ 669772565 667932212 666272044 664327800 662658691 661453426 659942448 657895207 656085551
1050.4F56085551j175881r33110o67215K08378Q89361N25296k62380p18951j296759
$$ 656085551 654909670 653976560 653309345 653517723 654407084 654932380 654670000 653951049 652654290
1068.7F52654290k362847l085733k930104k736807l047884l121793k724528k669215
$$ 652654290 650291443 647205710 644275606 641538799 638490915 635369122 632644594 629975379
1085F29975379l115297l170669k560258k046048j798869j212239m43637l15607p47383
$$ 629975379 626860082 623689413 621129155 619083107 617284238 616071999 615628362 615312755 614565372
1103.4F14565372q76724o25670p84993j329363j465678j368940j941800k921164l032148
$$ 614565372 613688648 613062978 612277985 610948622 609482944 608114004 606172204 603251040 600218892
1121.8F00218892k129257j482665j124978M03404K017617J822949J208543J603902
$$ 600218892 598089635 596606970 595481992 595885396 597903013 599725962 600934505 602538407
1138.1F02538407K155602J993179J573503J541674J588524J300811J091123J415789
$$ 602538407 604694009 606687188 608260691 609802365 611390889 612691700 613782823 615198612
1154.4F15198612J840055J893997K078534K820015L570675L926218M325986N023479
$$ 615198612 617038667 618932664 621011198 623831213 627401888 631328106 635654092 640677571
1170.7F40677571N385161N088269M843772N019784M966020M345894L833413L645361
$$ 640677571 646062732 651151001 655994773 661014557 665980577 670326471 674159884 677805245
1187F77805245L047883K006293J367032J282752J115918Q29399J094818J843095K178251
$$ 677805245 680853128 682859421 684226453 685509205 686625123 687454522 688549340 690392435 692570686
1205.4F92570686J988292J990497K128542J766860J195967J192034J529872J409173
$$ 692570686 694558978 696549475 698678017 700444877 701640844 702832878 704362750 705771923
1221.7G05771923J065791J275241J712144J629292J386464J681566K072215J865089
$$ 705771923 706837714 708112955 709825099 711454391 712840855 714522421 716594636 718459725
1238G18459725J514912J636505J726508J224280P33375P93338P81000K99215J00792
$$ 718459725 719974637 721611142 723337650 724561930 725295305 726088643 726869643 727168858 727269650
1256.4G27269650N78701R92715R85146J242995J979053K378166K227068K340615K866208
$$ 727269650 727848351 728841066 729826212 731069207 733048260 735426426 737653494 739994109 742860317
1274.7G42860317K980232K607108K630412L095687L118932K760708K872050L242433
$$ 742860317 745840549 748447657 751078069 754173756 757292688 760053396 762925446 766167879
1291G66167879L001750K369165K242565K437830K045036J370668J320183J501978J102626
$$ 766167879 769169629 771538794 773781359 776219189 778264225 779634893 780955076 782457054 783559680
1309.4G83559680N67019O74784R50217O39975L43860P58111J120269P97213N11884
$$ 783559680 784126699 784801483 785751700 786391675 786735535 787493646 788613915 789411128 789923012
1327.8G89923012P87199Q49247J96874l25501j40965J04189m6253k2233L74794M65870
$$ 789923012 790710211 791559458 791756332 791430831 791289866 791394055 791347802 791325569 791700363 792166233
1348.1G92166233K1100j42634J81675J49369l72052o64413n63204n80847r44972j043260
$$ 792166233 792187333 792044699 792226374 792375743 792003691 791339278 790776074 790195227 789250255 788206995
1368.5G88206995o73891r40561j735210j718462k044797m096746n255461k343059K184630
$$ 788206995 787533104 786592543 784857333 783138871 781094074 776997328 771741867 769398808 771583438
1386.9G71583438L281951J553178L78430j74761q11458j400709j218677j107990j797021
$$ 771583438 774865389 776418567 776796997 776622236 775810778 774410069 773191392 772083402 770286381
1405.3G70286381j919865j304269j054824j215934j188934j064956j042128p23124
$$ 770286381 768366516 767062247 766007423 764791489 763602555 762537599 761495471 760772347
1421.6G60772347m28021r5248k444n17487l98755L60072L55601J88887Q08179J284957
$$ 760772347 760344326 760249078 760246634 759729147 759330392 759690464 760046065 760234952 761043131 762328088
1442G62328088J201690Q98480J090288J823723K121091J962483K362728L798426L920793
$$ 762328088 763529778 764428258 765518546 767342269 769463360 771425843 773788571 777586997 781507790
1460.3G81507790L249228L361285L854275L636717L307104L883422M318118L506243
$$ 781507790 784757018 788118303 791972578 795609295 798916399 802799821 807117939 810624182
1476.6H10624182K639175K312421K098084J326561L36647j99258r3401j00970p33793
$$ 810624182 813263357 815575778 817673862 819000423 819337070 819137812 819044411 818943441 818209648
1495H18209648j430213j398027j248241j334965k328634m330278l269732j923442j882731
$$ 818209648 816779435 815381408 814133167 812798202 810469568 806139290 802869558 800946116 799063385
1513.4G99063385k187193k446294k098858k002537j750708j545787j511931q51333
$$ 799063385 796876192 794429898 792331040 790328503 788577795 787032008 785520077 784668744
1529.7G84668744j043141j952946j247228o20424j909137k071917l87907L87847L56794
$$ 784668744 783625603 781672657 780425429 779805005 777895868 775823951 775436044 775823891 776180685
1548G76180685k9505R2089M93765M13537q96871j118719M16338n4538j014769j796723
$$ 776180685 776151180 776243269 776737034 777150571 776253700 775134981 775551319 775496781 774482012 772685289
1568.4G72685289k355337k016961k673745m362286l788948l218829l991783m397690
$$ 772685289 770329952 768312991 765639246 761276960 757488012 754269183 750277400 745879710
1584.7G45879710m596889n055309n360722n282641n359351n566180n534291n404055
$$ 745879710 741282821 736227512 730866790 725584149 720224798 714658618 709124327 703720272
1601.1G03720272n414904n511879n585254n598724n347073n042195n813956o658554
$$ 703720272 698305368 692793489 687208235 681609511 676262438 671220243 665406287 658747733
1617.4F58747733m575909l621995m499555m062056l325284k874314j727403j179516
$$ 658747733 654171824 650549829 646050274 641988218 638662934 635788620 634061217 632881701
1633.7F32881701j444459k28941J369476K127886K427518K747297L711105L950298
$$ 632881701 631437242 631208301 632577777 634705663 637133181 639880478 643591583 647541881
1650F47541881L935515N148471N216718M801154M795432M995167N351722N117536N040228
$$ 647541881 651477396 656625867 661842585 666643739 671439171 676434338 681786060 686903596 691943824
1668.4F91943824N453468N389571N589187N888462N407751N088985N305588O355584
$$ 691943824 697397292 702786863 708376050 714264512 719672263 724761248 730066836 736422420
1684.7G36422420O251335N684077N861640N311311N127668N658150N947649O589115
$$ 736422420 742673755 748357832 754219472 759530783 764658451 770316601 776264250 782853365
1701G82853365N819023N173266N226254M453659L684163L335297L011823K729416K816975
$$ 782853365 788672388 793845654 799071908 803525567 807209730 810545027 813556850 816286266 819103241
1719.3H19103241K874792K595543K198995J936256J997889J817047J400411J727760
$$ 819103241 821978033 824573576 826772571 828708827 830706716 832523763 833924174 835651934
1735.7H35651934K085209J940966J734435J780927J850665J627624J367867J650333
$$ 835651934 837737143 839678109 841412544 843193471 845044136 846671760 848039627 849689960
1752H49689960J809657J394212R84311R40979J071155J044035P86662O85632P02441
$$ 849689960 851499617 852893829 853878140 854819119 855890274 856934309 857720971 858406603 859109044
1770.3H59109044N08607O57677R64821Q83877N70297M61876O22631P52687N56827J53541
$$ 859109044 859617651 860275328 861240149 862124026 862694323 863156199 863778830 864531517 865088344 865241885
1790.7H65241885K52009O50704N34355K88546M12584O10172M95613L19839L04996L27647
$$ 865241885 865493894 866144598 866678953 866967499 867380083 867990255 868485868 868805707 869110703 869438350
1811.1H69438350K75076K76863L91066M20034J93417J5676J70112K63274M7087K06292
$$ 869438350 869713426 869990289 870381355 870801389 870994806 871010482 871180594 871443868 871490955 871697247
1831.5H71697247N57959M06563J07170J23500J85132l3617k7299L17634M65393L07023
$$ 871697247 872255206 872661769 872768939 872892439 873077571 873043954 873016655 873334289 873799682 874106705
1851.9H74106705O1691N3167J68205J23024J2278Q7738J06752j13666p4208K60592
$$ 874106705 874168396 874221563 874389768 874512792 874525070 874612808 874719560 874605894 874531686 874792278
1872.3H74792278L27647J18911k9087O3658J77919P7129n2512m5121O0320M5538n0127
$$ 874792278 875119925 875238836 875209749 875273407 875451326 875528455 875475943 875430822 875491142 875536680 875486553
1894.7H75486553J07705K45929L8564j48177j5974R1851o3658j06215J12176J17838
$$ 875486553 875594258 875840187 875878751 875730574 875714600 875806451 875742793 875636578 875748754 875866592
1915.1H75866592j85847k33055j3232K8253m5419m0054O3240M3691j53006j77443J1683
$$ 875866592 875680745 875447690 875434458 875462711 875417292 875377238 875440478 875484169 875331163 875153720 875165403
1937.6H75165403l2306l14414k32518J07765O4790j92284k02120o7174j08123k17736
$$ 875165403 875133097 874818683 874586165 874693930 874758720 874566436 874364316 874297142 874189019 873971283
1958H73971283j03414N9426p8141l14951k09272M17j05262k27690q2969K0623j56224
$$ 873971283 873867869 873927295 873849154 873534203 873324931 873325348 873220086 872992396 872909427 872930050 872773826
1980.4H72773826k87354j27673k8789k07186k98023o8724Q3983j21594k74837j06990
$$ 872773826 872486472 872358799 872330010 872122824 871824801 871756077 871840060 871718466 871443629 871336639
2000.8H71336639l1233k18987k57671o2883l8386k33709k56420n0127l5167k29835
$$ 871336639 871305406 871086419 870828748 870765865 870727479 870493770 870237350 870187223 870152056 869922221
2021.2H69922221j83404K444p8857k60055j74701k1100j25766k43425r0719M7326j02281
$$ 869922221 869738817 869741261 869662404 869402349 869227648 869206548 869080782 868837357 868746638 868793964 868691683
2043.6H68691683k33770r0777L3438j09077k04026l8326M9770r7633j79410o6876k39
$$ 868691683 868457913 868367136 868400574 868291497 868087471 868049145 868098915 868001282 867821872 867754996 867754757
2066.1H67754757q9347j05619L2484L9637j27256j26064P1288Q8334q3268o3181R5844
$$ 867754757 867665410 867559791 867592275 867631912 867504656 867378592 867449880 867538214 867454946 867391765 867487609
2088.5H67487609O0857p8082o2049L8982L1709l3021K7955J08719J8537q2433K98Q6724
$$ 867487609 867548466 867470384 867408335 867447317 867479026 867446005 867473960 867582679 867601216 867518783 867519081 867605805
2113H67605805J9074j5676Q6605J62125N0187o0081L4094R9062K206j6451J08778J46568
$$ 867605805 867624879 867609203 867695808 867857933 867908120 867848039 867882133 867981195 867983401 867966950 868075728 868222296
2137.5H68222296N2274L7372J11878R5844L5703N0366J16467J43052Q3088O4552J30296
$$ 868222296 868274570 868311942 868423820 868519664 868555367 868605733 868722200 868865252 868948340 869012892 869143188
2159.9H69143188J15216J1384J6034J15395J28865P3194O6102R6857P5937L9458Q3387
$$ 869143188 869258404 869269788 869285822 869401217 869530082 869603276 869669378 869766235 869842172 869881630 869965017
2182.3H69965017J27733P4327K1159N3942J02997O6996o735K6404R5249O0498P689
$$ 869965017 870092750 870167077 870188236 870242178 870345175 870412171 870405436 870431840 870527089 870587587 870595276
2204.8H70595276L5107N7102J1027j3173M0710R0003N4419n543J7524N8889J3411k1458
$$ 870595276 870630383 870687485 870698512 870685339 870726049 870816052 870870471 870864928 870882452 870941341 870954752 870933294
2229.2H70933294L3558N3107j5854l8624L3021N1498l6120n0426M8876Q1480q35n0366
$$ 870933294 870966852 871019959 871004105 870965481 870998502 871050000 871013880 870963454 871012330 871093810 871092975 871042609
2253.7H71042609L159L1591l0875l4869N7936P4625j1564l6359L3617O3122K2471L4928
$$ 871042609 871045768 871077359 871046484 871011615 871069551 871144176 871132612 871096253 871129870 871192992 871215463 871250391
2278.2H71250391J02103N9962l5465O0P2718K7835m6969O557J09673R1552K7299P6175
$$ 871250391 871352494 871412456 871376991 871377051 871449769 871477604 871430635 871437192 871546865 871638417 871665716 871741891
2302.7H71741891J49667P0274m2498L1233J73151J22667k5452k5928K2293k0743J4901
$$ 871741891 871891558 871961832 871919334 871950567 872123718 872246385 872220933 872195005 872217298 872196555 872211456
2325.1H72211456J20223J06811K7776J3292K9027m6610j49608r1672L1531J51813L15070
$$ 872211456 872331679 872438490 872466266 872479558 872508585 872461975 872312367 872220695 872252226 872404039 872719109
2347.5H72719109L31342J87695R716j12236l6359J45555N7578j05739R060J65344R1374
$$ 872719109 873050451 873238146 873247862 873135626 873099267 873244822 873302400 873196661 873205721 873371065 873462439
2370H73462439k9326Q0407K27749J73092O8963R6976J68324J11103K3365O9439J36078
$$ 873462439 873433113 873513520 873741269 873914361 873983324 874080300 874248624 874359727 874383092 874452531 874588609
2392.4H74588609P2539j5915L994N9127K6703l1471N7042J58906L4690j18196m1485
$$ 874588609 874661148 874645233 874649227 874708354 874735057 874703586 874760628 874919534 874954224 874836028 874794543
2414.8H74794543O2227l3140j16170l874P3373m2259r0242M3810Q2254l2544m2439
$$ 874794543 874856770 874823630 874707460 874703586 874776959 874734700 874644458 874688268 874770522 874737978 874695539
2437.3H74695539Q4937J01805n2393j39713p0810k4200o2108l1233P4685N6505p8499
$$ 874695539 874780476 874882281 874829888 874690175 874619365 874595165 874533057 874501824 874576509 874633014 874554515
2459.7H74554515j03414m590m887j07050p8082M5120J7584j23203j24037j4961k2411
$$ 874554515 874451101 874446511 874441624 874334574 874256492 874301612 874319196 874195993 874071956 874056995 874034584
2482.1H74034584q8752m0054L4809n2094j77443j14382J19m4405j02639k980N8054
$$ 874034584 873945832 873905778 873940587 873888493 873711050 873596668 873596787 873552382 873449743 873446763 873504817
2504.6H73504817r1195k05159p0512M2856p3016j44959j6152M7862r5188j73092n4837
$$ 873504817 873413622 873208463 873137951 873180807 873107791 872962832 872946680 872994542 872899354 872726262 872671425
2527H72671425j3172j38700j35958N6743R7513j06036j88709m7683k8849j49548j02460
$$ 872671425 872658253 872519553 872383595 872440338 872537851 872431815 872243106 872195423 872166574 872017026 871914566
2549.4H71914566L7550k3663j84178j43111M590l8564j88768j41204K1339j0669j69635
$$ 871914566 871952116 871928453 871744275 871601164 871605754 871567190 871378422 871237218 871258557 871247888 871078253
2571.9H71078253j61708p2658j48773k31564j24037j7882j25110k57551j75178r4235
$$ 871078253 870916545 870843887 870695114 870463550 870339513 870321631 870196521 869938970 869763792 869669557
2592.3H69669557k03550k37823q7857o5863k38538k90632j82033j75178k84791k42531
$$ 869669557 869466007 869228184 869140327 869074464 868835926 868545294 868363261 868188083 867903292 867660761
2612.7H67660761o9022j07289l14772l33965j66714j54257l30925l15666j09315j31488
$$ 867660761 867591739 867484450 867169678 866835713 866668999 866514742 866183817 865868151 865758836 865627348
2633.1H65627348l25560k99096j45853j93536l37601k83837j33455j63913k76565k33174
$$ 865627348 865301788 865002692 864856839 864663303 864325702 864041865 863908410 863744497 863467932 863234758
2653.5H63234758j59740k64049l62157k34604q5950j72556l08394k22385j17064k19762
$$ 863234758 863075018 862810969 862448812 862214208 862128258 861955702 861647308 861424923 861307859 861088097
2673.9H61088097k87354j76132j52468l18110l73841k21789j73926k81632k79724j86205
$$ 861088097 860800743 860624611 860472143 860154033 859780192 859558403 859384477 859102845 858823121 858636916
2694.3H58636916k11358l28362l51966k61962k47121l33130k86162j55568k24889m00483
$$ 858636916 858425558 858097196 857745230 857483268 857236147 856903017 856616855 856461287 856236398 855835915
2714.6H55835915l83258k20478j92880k70069k29478k19405l75271m47809l42190k62917
$$ 855835915 855452657 855232179 855039299 854769230 854539752 854320347 853945076 853497267 853155077 852892160
2735H52892160k98142l30567k61486j61409j70708k65062l24309l51488l79801l66569
$$ 852892160 852594018 852263451 852001965 851840556 851669848 851404786 851080477 850728989 850349188 849982619
2755.4H49982619k99871k65240l38734m09960l57807l03626l47316l68297l15249l55959
$$ 849982619 849682748 849417508 849078774 848668814 848311007 848007381 847660065 847291768 846976519 846620560
2775.8H46620560m87030n06282m21881l86537m04298l65734l33309m28379n31494m97103
$$ 846620560 846133530 845627248 845205367 844818830 844414532 844048798 843715489 843287110 842755616 842258513
2796.2H42258513m59254o05166p48575o62803m87209m64975o33300p50243o84500o39677
$$ 842258513 841799259 841194093 840445518 839782715 839295506 838830531 838197231 837446988 836762488 836122811
2816.6H36122811o79910o58632o10470o79374q25226q68679p92145q14319r72807j052976
$$ 836122811 835442901 834784269 834173799 833494425 832669199 831800520 831008375 830194056 829221249 828168273
2837H28168273j213372j657724k083898k273321k272665k079845j618266j004279n88238
$$ 828168273 826954901 825297177 823213279 820939958 818667293 816587448 814969182 813964903 813376665
2855.4H13376665m58121n17607p02262q73446j044154j245082j252115j068771j040339
$$ 813376665 812918544 812400937 811698675 810825229 809781075 808535993 807283878 806215107 805174768
2873.7H05174768j136422j021207p87377p41064q09968q09073q39472r76861j031399
$$ 805174768 804038346 803017139 802229762 801488698 800678730 799869657 799030185 798053324 797021925
2892.1G97021925r57250r98855j182854j219034j080454j079261j274586j430928j526892
$$ 797021925 796064675 795065820 793882966 792663932 791583478 790504217 789229631 787798703 786271811
2910.4G86271811j753927k057969k112806j849175j495480j149953p78138l60847n0723
$$ 786271811 784517884 782459915 780347109 778497934 777002454 775852501 775074363 774713516 774662793
2928.8G74662793O735J01149M24385O95348Q50022J133263J372874J187205P33852
$$ 774662793 774669528 774770677 775195062 775890410 776740432 777873695 779246569 780433774 781167626
2947.2G81167626M24147K84910J5319k53022j82927M77J11222J94550K28047K17259
$$ 781167626 781591773 781876683 781892002 781638980 781456053 781456530 781567752 781762302 781990349 782207608
2967.6G82207608J81973K41518L68357L63886L44515M06742L79741K75970K00391J95265
$$ 782207608 782389581 782631099 782999456 783363342 783707857 784114599 784494340 784770310 784970701 785165966
2987.9G85165966L15547K99274m2200k82943l36110n02706o25372o08504n53727m41015
$$ 785165966 785481513 785780787 785738587 785455644 785119534 784616828 783991456 783382952 782829225 782388210
3008.3G82388210l70085m51147o67155r12011j018763r97960r61363r77040j019537
$$ 782388210 782018125 781566978 780899823 779987812 778969049 777971089 777009726 776032686 775013149
3026.7G75013149r14514p60556q02099j054406j232624j056195q77619j032829j269519
$$ 775013149 774098635 773338079 772535980 771481574 770248950 769192755 768315136 767282307 766012788
3045.1G66012788j350284j281380j240969j282573j266003j298368j383721j287163
$$ 766012788 764662504 763381124 762140155 760857582 759591579 758293211 756909490 755622327
3061.4G55622327j109421j057684j170278j329482j353561j229763j014293r04917
$$ 755622327 754512906 753455222 752284944 750955462 749601901 748372138 747357845 746452928
3077.7G46452928j088322j321375j386702j409650j396298j379550j483023j521111
$$ 746452928 745364606 744043231 742656529 741246879 739850581 738471031 736988008 735466897
3094G35466897j391172j278281j336217j512826j523375j342773j309276j498759j527607
$$ 735466897 734075725 732797444 731461227 729948401 728425026 727082253 725772977 724274218 722746611
3112.4G22746611j341462j345754j543999j805127k039611j980126j745224j651585
$$ 722746611 721405149 720059395 718515396 716710269 714670658 712690532 710945308 709293723
3128.7G09293723j766205j906931j830280j641333j658380j943767k127469k046764
$$ 709293723 707527518 705620587 703790307 702148974 700490594 698546827 696419358 694372594
3145F94372594j973152j860678j705170j899361k264500k305925k187848k179682k212763
$$ 694372594 692399442 690538764 688833594 686934233 684669733 682363808 680175960 677996278 675783515
3163.4F75783515k178729k123653k146066k208948k239406k226233k260983k316237
$$ 675783515 673604786 671481133 669335067 667126119 664886713 662660480 660399497 658083260
3179.7F58083260k285361k243340k253533k256035k268672k334953k379894k377391
$$ 658083260 655797899 653554559 651301026 649044991 646776319 644441366 642061472 639684081
3196F39684081k348840k327621k323568k302587k268136k262115k253652k217352k228677
$$ 639684081 637335241 635007620 632684052 630381465 628113329 625851214 623597562 621380210 619151533
3214.3F19151533k242267k210260k200961k238572k247572k194702k133131k005756
$$ 619151533 616909266 614699006 612498045 610259473 608011901 605817199 603684068 601678312
3230.7F01678312j902819k040565k179921k082884j978397j939357j806438j694262
$$ 601678312 599775493 597734928 595555007 593472123 591493726 589554369 587747931 586053669
3247E86053669j787126j881003j770020j645505j707554j775503j681268j581431j569509
$$ 586053669 584266543 582385540 580615520 578970015 577262461 575486958 573805690 572224259 570654750
3265.3E70654750j534760j435638j467645j660883j785755j780033j715124j691997
$$ 570654750 569119990 567684352 566216707 564555824 562770069 560990036 559274912 557582915
3281.6E57582915j723707j713991j648605j608431j668871j789987j923144k058208
$$ 557582915 555859208 554145217 552496612 550888181 549219310 547429323 545506179 543447971
3298E43447971k054751j868605j716733j847863k194703k424359k467156k433777k354145
$$ 543447971 541393220 539524615 537807882 535960019 533765316 531340957 528873801 526440024 524085879
3316.3E24085879k287566k300084k335906k334833k440095k620638k644956k564787
$$ 524085879 521798313 519498229 517162323 514827490 512387395 509766757 507121801 504557014
3332.6E04557014k457500k372444k516359k734422k748400k756834k752960k567232
$$ 504557014 502099514 499727070 497210711 494476289 491727889 488971055 486218095 483650863
3348.9D83650863k609014k971739l088325k813816k572298k635777k707184k457738
$$ 483650863 481041849 478070110 474981785 472167969 469595671 466959894 464252710 461794972
3365.3D61794972k242475k480269k879828k842128k425015k197713k149999k084971
$$ 461794972 459552497 457072228 454192400 451350272 448925257 446727544 444577545 442492574
3381.6D42492574k013981j824140j449645j076460j129269j535506j568943j029402
$$ 442492574 440478593 438654453 437204808 436128348 434999079 433463573 431894630 430865228
3397.9D30865228o78450j076102j537234j258641p45326o14018o54280p12752p20888
$$ 430865228 430186778 429110676 427573442 426314801 425569475 424955457 424301177 423588425 422867537
3416.3D22867537n40853l53605k39253l2365K37972M52101M75794N03600P13944O93172
$$ 422867537 422326684 421973079 421733826 421701461 421939433 422391534 422867328 423370928 424084872 424778044
3436.6D24778044L64155L19540P05272J064629J203119J286716J423984J535833J636774
$$ 424778044 425142199 425461739 426167011 427231640 428434759 429721475 431145459 432681292 434318066
3455D34318066J807361J941503J851767J877189K299249K520710K074093J499414J582861
$$ 434318066 436125427 438066930 439918697 441795886 444095135 446615845 448689938 450189352 451772213
3473.4D51772213K071857K442688K450198K103061K058148K383918K410948K284616
$$ 451772213 453844070 456286758 458736956 460840017 462898165 465282083 467693031 469977647
3489.7D69977647K433449K611458K651841K602219K586723K590984K433479K297520
$$ 469977647 472411096 475022554 477674395 480276614 482863337 485454321 487887800 490185320
3506D90185320K431453K759725L064692K993553K682388K659559K905071L184617L157556
$$ 490185320 492616773 495376498 498441190 501434743 504117131 506776690 509681761 512866378 516023934
3524.4E16023934K878964K852499L112316L366590L520072L488063L340721L516734
$$ 516023934 518902898 521755397 524867713 528234303 531754375 535242438 538583159 542099893
3540.7E42099893L790736L662050L320634L340006L581524L719688L824711L938734
$$ 542099893 545890629 549552679 552873313 556213319 559794843 563514531 567339242 571277976
3557E71277976M051507M052341L808975L564715M061222M806996M727065M457951M533469
$$ 571277976 575329483 579381824 583190799 586755514 590816736 595623732 600350797 604808748 609342217
3575.3F09342217M685164M852533N119741N159319M753351M540503N114794N281508
$$ 609342217 614027381 618879914 623999655 629158974 633912325 638452828 643567622 648849130
3591.7F48849130M967451N061984N422771N469680N383968N292058M976511M866779
$$ 648849130 653816581 658878565 664301336 669771016 675154984 680447042 685423553 690290332
3608F90290332N063355N173623N261779N089820M874348N288661N344689M708409M004717
$$ 690290332 695353687 700527310 705789089 710878909 715753257 721041918 726386607 731095016 735099733
3626.3G35099733L917932M916907N023062M486620M217089M013598L836631L673733
$$ 735099733 739017665 743934572 748957634 753444254 757661343 761674941 765511572 769185305
3642.6G69185305L330528K809406K856850L682018L642499K943099K874314L072203
$$ 769185305 772515833 775325239 778182089 781864107 785506606 788449705 791324019 794396222
3659G94396222K642929K166629K033353J707971J290619J631201J578927R02295J440286
$$ 794396222 797039151 799205780 801239133 802947104 804237723 805868924 807447851 808350146 809790432
3677.3H09790432K079428J962959J842499J667261J225293P93576J080752J508832
$$ 809790432 811869860 813832819 815675318 817342579 818567872 819361448 820442200 821951032
3693.6H21951032J386344R90510P02024P32004R89676R29057M70579K0802K54452J115263
$$ 821951032 823337376 824327886 825029910 825761914 826751590 827680647 828151226 828172028 828426480 829541743
3714H29541743J262486P68542L13222J53244K29359M24504O49333N01990K4021j17004
$$ 829541743 830804229 831572771 831885993 832039237 832268596 832693100 833342433 833844423 833868444 833751440
3734.4H33751440M86970J004994P03335k28882p09176J25110K80559m4823N58377R14752
$$ 833751440 834238410 835243404 835946739 835717857 835008681 835133791 835414350 835369527 835927904 836842656
3754.8H36842656N32866K11119L79324M69327K48254J25408N2571J95742M82380M24087
$$ 836842656 837375522 837586641 837965965 838435292 838683546 838808954 838861525 839057267 839539647 839963734
3775.2H39963734J59800k1577P2182J23322P2777K18332L60906L18765L9578k53499
$$ 839963734 840123534 840101957 840174139 840297461 840370238 840588570 840949476 841268241 841307819 841054320
3795.6H41054320j68442k10286k76148K56360K59518J10507M53413M46677m5299l50833
$$ 841054320 840885878 840675592 840399444 840655804 840915322 841025829 841479242 841925919 841880620 841529787
3816H41529787j07050j91450k5928N01513L80337J73271J3411j10865o556j77264m68791
$$ 841529787 841422737 841231287 841205359 841706872 842087209 842260480 842273891 842163026 842156470 841979206 841510415
3838.4H41510415j12057L52085N42104M79818O8366o96063j454890l02851J200855
$$ 841510415 841398358 841750443 842292547 842772365 842840731 842144668 840689778 840386927 841587782
3856.8H41587782Q90672J23799l85761k56658P5936j20818j06573K58088M24087K98202
$$ 841587782 842478454 842602253 842216492 841959834 842035770 841914952 841808379 842066467 842490554 842788756
3877.2H42788756j79350j98484J16706M6670J14262N6029j23322J62661K58803k38478
$$ 842788756 842609406 842410922 842527628 842574298 842688560 842744589 842621267 842783928 843042731 842804253
3897.6H42804253o57558m75467N1558N31912O07133L14772M7446j55509l34978j91867
$$ 842804253 842146695 841671228 841722786 842254698 842861831 843176603 843224049 843068540 842733562 842541695
3918H42541695J04427Q1122j8537O8784N7637r4115o676J96397J22488K1279j6511
$$ 842541695 842646122 842727244 842708707 842777491 842835128 842741013 842734337 842930734 843053222 843074501 843057990
3940.4H43057990j05560m1246o259p5996L0995J64568J73033J17957K6882l9458j6273
$$ 843057990 842952430 842911184 842904925 842828929 842859924 843024492 843197525 843315482 843342364 843302906 843286633
3962.9H43286633M1366L5107J3948N8591J15991J40786R5189j6690O080R4235Q106
$$ 843286633 843327999 843363106 843377054 843435645 843551636 843692422 843787611 843770921 843777001 843871236 843879342
3985.3H43879342q2135l0100M8279P7784L7730L0220
$$ 843879342 843797207 843767107 843815386 843893170 843930900 843961120
3997.5H43961120
$$ 843961120
##END=$$ End of the data block
