##TITLE=$$ Begin of the data block
##JCAMP-DX=5.00 $$ ACD/SpecManager v 10.08
##SPECTROMETER/DATA SYSTEM=Alpha
##DATE=07 Apr 2014 11:14:18
##DATA TYPE=INFRARED SPECTRUM
##DATA CLASS=XYDATA
##ORIGIN=
##OWNER=
##NPOINTS=1765
##FIRSTX=399.75695801
##LASTX=3997.56933594
##MAXX=3997.56933594
##MINX=399.75695801
##MAXY=0.87626100
##MINY=0.42205748
##XFACTOR=1.0000000000
##YFACTOR=1.000000000000000e-9
##FIRSTY=0.71874529
##DELTAX=2.03957629
##XUNITS=1/CM
##YUNITS=ARBITRARY UNITS
##XYDATA=(X++(Y..Y))
399.8G18745291k80916j757265p31468M46618j294255k046407K07544J318037p41005
418.1G13866174k264976j74582K24828j352429o29604J159609P8141j707613n40972
436.5G08658576Q95858m67062j313210O58632J138031j066923j453579M80235P42853
454.8G08273411j056671j071453M36842k75016j598835o41644N82576n82814j672507
473.2G02393889k06887O15298p38620j207054K59221O98983p41005j036226K05993
491.5G00243592J33813j070679p53581K74002n42044j755595p00415N46575m45068
509.9F95930600j455784m49896K44856q76009j398087l98576k93434j446008j347542
528.3F88510120j44005l44336j569986j306773m231k25187j258135q38697J36316l53276
$$ plain form
399.8 718745291 718464375 716707110 715975642 716422260 715128005 713081598 713289142 714607179 713866174
418.1 713866174 711601198 711426616 711651444 710299015 709669411 710829020 710907161 709199548 708658576
436.5 708658576 709554434 709087372 707774162 708432794 709570825 708503902 707050323 707530558 708273411
454.8 708273411 707216740 706145287 706582129 706307113 704708278 704066634 704649210 704066396 702393889
473.2 702393889 702187002 702802300 702063680 700856626 701115847 701814830 701073825 700037599 700243592
491.5 700243592 700377405 699306726 698553145 698827147 698285103 696529508 695829093 696375668 695930600
509.9 695930600 694474816 694024920 694269776 693393767 691995680 691597104 691303670 689857662 688510120
528.3 688510120 688366115 688021779 686451793 685145020 685140789 684915602 683657467 682818770 682955086 682601810
548.6F82601810j298607q61883k31922r53138j609206r31024m08948j062333j534164
567F73710585r89795q31425j643718j745820p46071n35130j372517j395642o35207
585.4F63815260o92129j260698r53794k52306o42359j515091j443028j154721j736224
603.7F54164910k108872j386761n74470p02381r12666M5061J412928J922727K240538
622.1F54101014L115595L495275K792836K347111K948225L076375K089381J668453
638.4F75634265K133131J890659J055777J431942K614737K301812P57754M83453J783610
656.7F90087140K711951K637744K863884L147722K487123J528322K135337K773583
673.1G10372806K054691J286805J976788K442121J442075Q38041J616776J847625P99477
$$ plain form
548.6 682601810 681303203 680441320 680209398 679256260 677647054 676716030 676307082 675244749 673710585
567 673710585 672720790 671889365 670245647 668499827 667753756 667218626 665846109 664450467 663815260
585.4 663815260 663123131 661862433 660908639 660656333 660013974 658498883 657055855 655901134 654164910
603.7 654164910 652056038 650669277 650094807 649392426 648479760 648524821 649937749 651860476 654101014
622.1 654101014 657216609 660711884 663504720 665851831 668800056 671876431 673965812 675634265
638.4 675634265 677767396 679658055 680713832 682145774 684760511 687062323 687820077 688303530 690087140
656.7 690087140 692799091 695436835 698300719 701448441 703935564 705463886 707599223 710372806
673.1 710372806 712427497 713714302 715691090 718133211 719575286 720413327 722030103 723877728 724677205
691.4G24677205M61102J302361J268089K67804M18186J515209J463771O14822R37343
709.8G32925892J892865J625180Q16107J253366K145648J648426P25269J273096K105177
728.1G46411026J440763O24537J267434J859069R61959L03745J217544J829267R61840
746.5G56877184O69360J740158J994848R27091P45415J748204J705528O23822O92368
764.8G67723978J622974J254201J22905L16680J077771L85821q31783n77569K47598
783.2G71342576j76609p97391J54913J424968J370787J349926K683223L689646L144682
801.6G84186721K733826L389657L392994K122403J548886K121687J818359L80218j88649
819.9H01506102K66135k31743j650691j965582j364947j710236k592504k265394j297891
$$ plain form
691.4 724677205 725138307 726440668 727708757 727976561 728394747 729909956 731373727 731988549 732925892
709.8 732925892 734818757 736443937 737260044 738513410 740659058 742307484 743032753 744305849 746411026
728.1 746411026 747851789 748476326 749743760 751602829 752564788 752868533 754086077 755915344 756877184
746.5 756877184 757546544 759286702 761281550 762208641 762954056 764702260 766407788 767031610 767723978
764.8 767723978 769346952 770601153 770724058 771040738 772118509 772504330 771672547 771094978 771342576
783.2 771342576 771165967 770368576 770523489 771948457 773319244 774669170 777352393 781042039 784186721
801.6 784186721 786920547 790310204 793703198 795825601 797374487 799496174 801314533 801694751 801506102
819.9 801506102 801772237 801540494 799889803 797924221 796559274 794849038 792256534 789991140 788693249
838.3G88693249j495063k155066j604974n96404m29451j58072J518071L396213L870368
856.6G91038871M002869N029321N612015M656852L720343L900111L574788K052307
872.9H23587477J282811J775563J561761J66893n44906j31368l74854j487017j580238
891.3H24256122n75900k66612n60343J23203J341641J351476N55992O38246J053691
909.6H27917516J63019j206994j373768j155734j916170k536953j672148n55635n31614
928H17131519m97043M74155R58920J85847k38180L46839L57986o36757j025140n30839
948.4H16527307q10921k057433k614618k393901l022015m504204n228758n279958o266832
966.8G84348667p818938q072555p270932o999612o849587n563438m110455l947020
$$ plain form
838.3 788693249 787198186 785043120 783438146 782841742 782412291 782254219 783772290 787168503 791038871
856.6 791038871 795041740 800071061 805683076 810339928 814060271 817960382 821535170 823587477
872.9 823587477 824870288 826645851 828207612 828374505 827829599 827698231 827323377 825836360 824256122
891.3 824256122 823680222 823413610 822853267 822976470 824318111 825669587 826225579 826863825 827917516
909.6 827917516 828080535 826873541 825499773 824344039 822427869 819890916 818218768 817663133 817131519
928 817131519 816634476 817108631 818067551 818253398 818015218 818362057 818720043 818083286 817058146 816527307
948.4 816527307 815716386 813658953 811044335 808650434 805628419 801124215 795895457 790615499 784348667
966.8 784348667 776529729 768457174 761186242 754186630 747337043 741773605 737663150 733716130
983.1G33716130m094839l275096k436579k563357k654195j792848j007318j215458
999.4G14676440j425386r28640q68857j887262k744317k746463k949416l722608l851831
1017.7F93551660l134430k922773l416956l338575k638698k571165k970815k601922
1034.1F69956326j747667j621366j931250j619816j145124j485646k045929j801372
1050.4F56558156j167834r48965o95765J99198Q92580M98533k89917o85811j278698
1068.7F53081477k412558l097057k887368k703786l033877l117919k718448k675057
1085F30435407l136992l178895k527237j981377j759529j225174m84109l55363p32660
1103.4F15054071p99775n78404q15332j380622j476884j365125j956821k951979l076077
$$ plain form
983.1 733716130 729621291 726346195 723909616 721346259 718692064 716899216 715891898 714676440
999.4 714676440 713251054 712322414 711453557 709566295 706821978 704075515 701126099 697403491 693551660
1017.7 693551660 690417230 687494457 684077501 680738926 678100228 675529063 672558248 669956326
1034.1 669956326 668208659 666587293 664656043 663036227 661891103 660405457 658359528 656558156
1050.4 656558156 655390322 654441357 653745592 653944790 654837370 655335903 655045986 654360175 653081477
1068.7 653081477 650668919 647571862 644684494 641980708 638946831 635828912 633110464 630435407
1085 630435407 627298415 624119520 621592283 619610906 617851377 616626203 616142094 615786731 615054071
1103.4 615054071 614254296 613675892 612860560 611479938 610003054 608637929 606681108 603729129 600653052
1121.8F00653052k195477j567006j169503M31955K095282J869857J191020J594246
1138.1F02903426K160251J966774J529813J518488J590133J316309J120984J439810
1154.4F15545988J829386J856685K048432K819538L567040L881395M278302M999340
1170.7F40826106N363405N063295M826963N014122M957139M346371L846049L624797
1187F77868247K991855J972377J393319J334190J129031Q28386J129031J869440K148092
1205.4F92663968J952648J998484K150595J779020J215339J224696J525224J356482
1221.7G05866456J026154J271247J730323J645983J406014J724779K098143J852274
1238G18621373J539767J723528J787126J231670P29144P71284P37369K69652J22129
$$ plain form
1121.8 600653052 598457575 596890569 595721066 596153021 598248303 600118160 601309180 602903426
1138.1 602903426 605063677 607030451 608560264 610078752 611668885 612985194 614106178 615545988
1154.4 615545988 617375374 619232059 621280491 624100029 627667069 631548464 635826766 640826106
1170.7 640826106 646189511 651252806 656079769 661093891 666051030 670397401 674243450 677868247
1187 677868247 680860102 682832479 684225798 685559988 686689019 687517405 688646436 690515876 692663968
1205.4 692663968 694616616 696615100 698765695 700544715 701760054 702984750 704509974 705866456
1221.7 705866456 706892610 708163857 709894180 711540163 712946177 714670956 716769099 718621373
1238 718621373 720161140 721884668 723671794 724903464 725632608 726403892 727141261 727410913 727533042
1256.4G27533042O31810R94384R21667J186609J958966K362192K209008K345383K865195
1274.7G43008256K951920K588212K634526L092468L101587K752602K885997L270984
1291G66286552L022730K399683K287865K446473K021372J359284J323700J506567J108646
1309.4G83762872N84185O97196R52244O26802L54588P97510J136720P85590N20110
1327.8G90217817P93814Q30591K03788k64704r6976N6624j06037m887M26411M72665
1348.1G92529106k9921j73331K02716J47104m01914o44207n08547n65946r42052j022636
1368.5G88590372o69003r56833j747608j720906k055049m123866n279661k336800K205789
1386.9G71906435L286064J565993M05312j59145p97033j396716j226425j109898j803339
$$ plain form
1256.4 727533042 728164852 729159236 730080903 731267512 733226478 735588670 737797678 740143061 743008256
1274.7 743008256 745960176 748548388 751182914 754275382 757376969 760129571 763015568 766286552
1291 766286552 769309282 771708965 773996830 776443303 778464675 779823959 781147659 782654226 783762872
1309.4 783762872 784347057 785044253 785996497 786623299 786977887 787775397 788912117 789697707 790217817
1327.8 790217817 791011631 791842222 792046010 791781306 791684330 791740954 791634917 791630030 792056441 792529106
1348.1 792529106 792499185 792325854 792528570 792675674 792273760 791629553 791121006 790555060 789613008 788590372
1368.5 788590372 787921369 786964536 785216928 783496022 781440973 777317107 772037446 769700646 771906435
1386.9 771906435 775192499 776758492 777163804 777004659 776207626 774810910 773584485 772474587 770671248
1405.3G70671248j917302j299441j083612j244069j147568r76801j027584p77662m68552
1423.6G60728657j29997j3769m87983l64960L73900L28720J18315P80165J284242J163960
1444G63781250Q62777J092612J828969K129436K032220K488017L780425L798902L210246
1462.4G85004854L398001L876806L625214L330409L957272M340470L439009K579927
1478.7H13551962K305806K100229J324952L92497q9467p6950j64032p59840j424610
1497H17160547j419783j277625j295567k173185m200280l371120k024769j884759k171099
1515.4G97342360k456605k082050j954556j711845j522362j539112r32753j109182
1531.7G84033895j951576j198232n45204j823604k063691m22955L38853L09467k3842
$$ plain form
1405.3 770671248 768753946 767454505 766370893 765126824 763979256 763002455 761974871 761197209 760728657
1423.6 760728657 760598660 760584891 760096908 759731948 760105848 760434568 760552883 761333048 762617290 763781250
1444 763781250 764644027 765736639 767565608 769695044 771727264 774215281 777995706 781794608 785004854
1462.4 785004854 788402855 792279661 795904875 799235284 803192556 807533026 810972035 813551962
1478.7 813551962 815857768 817957997 819282949 819675446 819585979 819509029 819344997 818585157 817160547
1497 817160547 815740764 814463139 813167572 810994387 806794107 803422987 801398218 799513459 797342360
1515.4 797342360 794885755 792803705 790849149 789137304 787614942 786075830 785143077 784033895
1531.7 784033895 782082319 780884087 780338883 778515279 776451588 776028633 776367486 776676953 776653111
1550.1G76653111J71363O13630N18859q58725j217901L03149j34170j039386j741767
1568.4G73268163k321303k021074k635837m352867l857792l269434m005730m389524
1584.7G46414602m581571n063116n392611n315245n388259n592704n567789n437255
1601.1G04076052n421520n513608n598962n602599n361259n052506n785287o660223
1617.4F59080088m618347l633737m512489m102170l363550k914071j745224j148045
1633.7F33042455j422346k76267J332700K128601K465367K843321L801703M015446
1650F47930980M022538N104781N093097M757166M827202N089759N429626N150437N080164
1668.4F92485750N483865N363107N549908N886793N424500N118548N358041O362438
$$ plain form
1550.1 776653111 776824474 777438104 777956963 777098238 775880337 776183486 776049316 775009930 773268163
1568.4 773268163 770946860 768925786 766289949 761937082 758079290 754809856 750804126 746414602
1584.7 746414602 741833031 736769915 731377304 726062059 720673800 715081096 709513307 704076052
1601.1 704076052 698654532 693140924 687541962 681939363 676578104 671525598 665740311 659080088
1617.4 659080088 654461741 650828004 646315515 642213345 638849795 635935724 634190500 633042455
1633.7 633042455 631620109 631343842 632676542 634805143 637270510 640113831 643915534 647930980
1650 647930980 651953518 657058299 662151396 666908562 671735764 676825523 682255149 687405586 692485750
1668.4 692485750 697969615 703332722 708882630 714769423 720193923 725312471 730670512 737032950
1684.7G37032950O204307N661547N841315N285978N132854N696833N968094O553233
1701G83377111N787909N172491N200803M411042L672957L366352L053009K727628K798915
1719.3H19568217K880811K602578K195775J924277J979649J820147J421570J725436
1735.7H36118460K064109J911521J740396J832067J895965J631379J323223J615286
1752H50132406J806855J394808R91881R56178J059413R89318P48098P24554P82489
1770.3H59586000N27740O16372R41515Q86619N56528M28081O20425P75456N65410J66654
1790.7H65670800K64406O11127M83751L00706M73022O26147M62115L11553L19958L01421
1811.1H69825006K38776K88665M06981M07815J96635N9784K16305K74837L4511J78218
$$ plain form
1684.7 737032950 743237257 748898804 754740119 760026097 765158951 770855784 776823878 783377111
1701 783377111 789165020 794337511 799538314 803949356 807622313 810988665 814041674 816769302 819568217
1719.3 819568217 822449028 825051606 827247381 829171658 831151307 832971454 834393024 836118460
1735.7 836118460 838182569 840094090 841834486 843666553 845562518 847193897 848517120 850132406
1752 850132406 851939261 853334069 854325950 855282128 856341541 857330859 858078957 858803511 859586000
1770.3 859586000 860113740 860730112 861671627 862558246 863114774 863542855 864163280 864938736 865504146 865670800
1790.7 865670800 865935206 866546333 867030084 867330790 867803812 868429959 868892074 869203627 869523585 869825006
1811.1 869825006 870063782 870352447 870759428 871167243 871363878 871423662 871639967 871914804 871949315 872127533
1831.5H72127533N12660L58760R2149J56045K30670l5704o8187L12686M80294K97427
1851.9H74464333N2869P9275J96456J13905j1087Q9467J32203q9228q1301K26379L10063
1874.4H75483334J23382j8299R4652K16484P0811r2745n5850N9664L1293m8995J00493
1896.8H75964224K19465L3676j23560j2934M2557j02937q1062J64211J57356j83523
1917.2H76077473k58028p034L4213o3598k7179R3996M5598j56165j52468L0935l3141
1939.6H75584602l12030k31862Q8513J3351k33352j71065j3352j07944k42710j26362
1960H74247789K7001r8705k94864j73688P748j22725k48611r1494K7538j41204k52306
1982.5H72886479q4043k1159k29419l14474r4950L6657j46031k39790o8724l7730k22683
$$ plain form
1831.5 872127533 872640193 872998953 873091102 873247147 873477817 873442113 873373926 873686612 874166906 874464333
1851.9 874464333 874517202 874596477 874792933 874906838 874895751 874985218 875117421 875028193 874946892 875173271 875483334
1874.4 875483334 875606716 875588417 875683069 875899553 875970364 875877619 875821769 875881433 875912726 875863731 875964224
1896.8 875964224 876183689 876217365 876093805 876080871 876123428 876020491 875939429 876103640 876260996 876077473
1917.2 876077473 875819445 875812411 875846624 875783026 875755847 875849843 875895441 875739276 875586808 875617743 875584602
1939.6 875584602 875272572 875040710 875129223 875142574 874909222 874738157 874724805 874616861 874374151 874247789
1960 874247789 874274790 874176085 873881221 873707533 873715281 873592556 873343945 873252451 873279989 873138785 872886479
1982.5 872886479 872802436 872781277 872551858 872237384 872142434 872179091 872033060 871793270 871724546 871686816 871464133
2004.9H71464133k52127q2434n6028k00033k08795q6606j13725k40624j53006J6332
2025.3H70087087p0751k45213j73628l1710j11520k18749r5785K6405j21355k44558
2045.7H68800223q6069K5928j23382j99199l4809M6552r8765j62781k5093K3126r2446
2068.1H68073285j05143L1054K3782j52588j45256P8618J13607n3287m3809O7413P15
2090.5H67888391j09613m6670N9425J7286n1499K6226J06514L4332l8802L8206J12832
2113H68036628K7120l7849O8784J46448K4796o5923N0426J27136L2306j3709P8976
2135.4H68475139J30534O0439K7895J07289J31547O0022L4630R3818J27375Q3685P3195
2157.9H69405568J15275R2566J6987M7565J53959J51693P3970O6876J09136P4566j788
$$ plain form
2004.9 871464133 871212006 871129572 871073544 870873511 870664716 870578110 870464385 870223761 870070755 870087087
2025.3 870087087 870016336 869771123 869597495 869565785 869454265 869235516 869139731 869166136 869044781 868800223
2045.7 868800223 868714154 868740082 868616700 868417501 868382692 868429244 868330479 868167698 868142605 868165731 868073285
2068.1 868073285 867968142 867999196 868022978 867870390 867725134 867803752 867917359 867864072 867820263 867887676 867888391
2090.5 867888391 867778778 867732108 867791533 867808819 867757320 867783546 867890060 867924392 867885590 867923796 868036628
2113 868036628 868063748 868025899 868094683 868241131 868265927 868200004 868250430 868377566 868409872 868396163 868475139
2135.4 868475139 868605673 868666112 868694007 868801296 868932843 868992865 869027495 869121313 869248688 869332373 869405568
2157.9 869405568 869520843 869613409 869630396 869677961 869831920 869983613 870057583 870124459 870233595 870308161 870306373
2180.3H70306373L7372J27792J01507L7551N2511R3461O5147j192K4557R4474P4982
2202.7H71014535K4319M7684N8114j0788l2544N6267J27017M7505n6446p629P6950
2225.2H71344984M6312r715L1352Q2791J4186n5433N37L6597j3709j7166M2558N2690
2249.6H71555984j5080l7730K3306L2007m5299n6982K5809N1140L458J2993Q1241O7473
2274.1H71698320k4796k1815P6175P6890Q94L0219J07050N1439n0366K1756J58191
2296.5H72123957J04129k9206K2292J40786Q8573R715Q5712J70826J08123j5497m9233
2319H72760177k8849n9485k8253J01030J39117N1200L994L6716l755r0897n6624K0206
2343.5H72844577J20580K91705L28124J99795J7821o5803O1929J97589M5777j55568
$$ plain form
2180.3 870306373 870343745 870471537 870573044 870610595 870663106 870756567 870821714 870820522 870845079 870939553 871014535
2202.7 871014535 871038854 871086538 871144652 871133864 871101320 871157587 871284604 871332109 871275663 871268034 871344984
2225.2 871344984 871391296 871381581 871412933 871495724 871509910 871454477 871455014 871491611 871477902 871460736 871503294 871555984
2249.6 871555984 871540904 871503174 871526480 871558487 871513188 871456206 871482015 871533155 871536613 871549606 871630847 871698320
2274.1 871698320 871673524 871651709 871727884 871804774 871805668 871835887 871942937 871994376 871944010 871965766 872123957
2296.5 872123957 872228086 872198880 872221172 872361958 872450531 872460246 872545958 872716784 872824907 872809410 872760177
2319 872760177 872731328 872671843 872643590 872744620 872883737 872934937 872938931 872975647 872971892 872880995 872824371 872844577
2343.5 872844577 872965157 873256862 873584986 873784781 873802602 873736799 873798728 873996317 874042094 873886526
2363.8H73886526m9651J35303Q4578m6730O4850K42591J74523L9458P8976J56164Q3626
2386.3H74850214J7464R4235J28626L2306k5272K9385P4744J2219m1366P3135J51575
2408.7H75397265L993r0420K3663O5148p4625j36316j1384N1915n9247q7857M1008
2431.2H75123143P2718j4305L099J05322P8141r0301j42157r239K2352r0480o9677
2453.6H74988616N5372K1816r6143o1095M0412j7285j34170p1585N0843l577j28388
2476H74644816q6129J2636l9339j04367m9353P093n7995j35959o5922Q523q1003j43349
2500.5H73909652j1682O7055q4937j83701m4763K5749j07348j42336K98N7519o1691
2522.9H73423815j36793o8128o1333j53721j00135O7293N2035j39057j88470n1320
$$ plain form
2363.8 873886526 873836875 873972178 874056756 874010026 874074876 874317467 874491990 874531448 874610424 874766588 874850214
2386.3 874850214 874867678 874961913 875090539 875122845 875097573 875126958 875201702 875213921 875172555 875245690 875397265
2408.7 875397265 875401258 875310838 875334501 875399649 875325024 875188708 875177324 875229239 875169992 875082135 875123143
2431.2 875123143 875195861 875181556 875184655 875289977 875368118 875277817 875135660 875126421 875148773 875058293 874988616
2453.6 874988616 875043988 875065804 874969661 874908566 874948978 874931693 874797523 874725938 874776781 874773204 874644816
2476 874644816 874558687 874571323 874531984 874427617 874378264 874385357 874327362 874191403 874125481 874134004 874053001 873909652
2500.5 873909652 873897970 873965025 873880088 873696387 873651624 873677373 873570025 873427689 873427987 873485506 873423815
2522.9 873423815 873287022 873218894 873157561 873003840 872903705 872970998 873023033 872883976 872695506 872644186
2543.3H72644186m2498j71781j22249N8890K4080j64807j38342J6033n3584k00689
2563.7H71849239j21832J2636n6922j85967j20699l0339j54555k47001j04666j8895
2584.1H70820999j73628k72215j48058o3419j75953k44319j06812q3685k96056l33726
2604.5H68923128j61231j35004k40446k13801p4029j08064l01897l28660j92285j92404
2624.9H66975307l28421l02255j31965j58787l22342k61724r9897j76966l44873k72035
2645.3H64576042j05202j71423l24548k76148j70112k33650l14414k24829j11640j76906
2665.7H62467170k89023k25306j39057k22206k71619j62780j48773l25620l96312k50280
2686.1H60036194j84595k82049k72930j52409j78158l05772l26991k83122l11912l53276
$$ plain form
2543.3 872644186 872601688 872429907 872307658 872366548 872390628 872225821 872087479 872103512 872049928 871849239
2563.7 871849239 871727407 871740043 871683121 871497154 871376455 871346116 871191561 870944560 870839894 870820999
2584.1 870820999 870647371 870375156 870227098 870163679 869987726 869743407 869636595 869552910 869256854 868923128
2604.5 868923128 868761897 868626893 868386447 868172646 868098617 867990553 867688656 867359996 867167711 866975307
2624.9 866975307 866646886 866344631 866212666 866053879 865731537 865469813 865369916 865192950 864848077 864576042
2645.3 864576042 864470840 864299417 863974869 863698721 863528609 863294959 862980545 862755716 862644076 862467170
2665.7 862467170 862178147 861952841 861813784 861591578 861319959 861157179 861008406 860682786 860286474 860036194
2686.1 860036194 859851599 859569550 859296620 859144211 858966053 858660281 858333290 858050168 857738256 857384980
2706.5H57384980k52188j42276k42829l85821l46184k28822k20895k91049k68340k34008
2726.9H54772568l48270m30286l32236k12670k46167l61085l25978j97410j78278k20537
2747.3H51919651k68817l51608m13596l74973k60890k35259l61860m36127l48628k79605
2767.7H48588288l26514l37959k76685l53574n33760n54383m32670l67462l70324l50595
2788.1H44684362l76701m90129n46277m82082m51684n80311o97374o34015n05089m95315
2808.5H39425385o32286p26402o83427o57499o80744o50108o20067p04289q31604q51154
2828.9H32387805q01086q51214r67324j017928j224757j708328k107322k249241k260626
2847.2H19199979k089441j594543r54747n51462m61877n39243o96301q85487j105666
$$ plain form
2706.5 857384980 857132792 856990516 856747687 856361866 856015682 855786860 855565965 855274916 855006576 854772568
2726.9 854772568 854424298 853994012 853661776 853449106 853202939 852841854 852515876 852318466 852140188 851919651
2747.3 851919651 851650834 851299226 850885630 850510657 850249767 850014508 849652648 849216521 848867893 848588288
2767.7 848588288 848261774 847923815 847647130 847293556 846759796 846205413 845772743 845405281 845034957 844684362
2788.1 844684362 844307661 843817532 843271255 842789173 842337489 841757178 841059804 840425789 839920700 839425385
2808.5 839425385 838793099 838066697 837383270 836725771 836045027 835394919 834774852 834070563 833238959 832387805
2828.9 832387805 831586719 830735505 829768181 828750253 827525496 825817168 823709846 821460605 819199979
2847.2 819199979 817110538 815515995 814561248 814009786 813547909 813008666 812312365 811426878 810321212
2865.6H10321212j263321j196086j034498j064718j157045r87888p60138p60376p99895
2883.9H01297247p73429q39234r93550j033067r41217r85086j173556j208961j098633
2902.3G92250514j124382j325190j459897j501262j719415k062082k108157j822412
2918.6G79127717j511335j187444p86424l56555j9669N7459J25289M18603O85930Q67605
2939G77421176J160145J358688J163960P54237M51982K81989o973k94209k16782L5405
2959.4G82109618J78397K07424J93536J97411J92940K53797L79383L89695L88921M57763
2979.8G84948885L76761K21312J96875K41041L16441K53558n0843k31087k89857m90189
3000.2G85492897o54936o78599n92053m20153l29137m15623o40690q94845j009464
$$ plain form
2865.6 810321212 809057891 807861805 806827307 805762589 804605544 803617656 802857518 802097142 801297247
2883.9 801297247 800523818 799684584 798691034 797657967 796716750 795731664 794558108 793349147 792250514
2902.3 792250514 791126132 789800942 788341045 786839783 785120368 783058286 780950129 779127717
2918.6 779127717 777616382 776428938 775642514 775285959 775266290 775323749 775449038 775867641 776553571 777421176
2939 777421176 778581321 779940009 781103969 781858206 782310188 782592177 782585204 782290995 782074213 782109618
2959.4 782109618 782288015 782495439 782688975 782886386 783079326 783333123 783712506 784102201 784491122 784948885
2979.8 784948885 785325646 785546958 785743833 785984874 786301315 786554873 786504030 786272943 785983086 785492897
3000.2 785492897 784837961 784159362 783567309 783147156 782818019 782402396 781761706 780866861 779857397
3018.5G79857397r94980r40800r29356j005768r51410p90596q00669j024425j201332
3036.9G71218061j059234q88645j010776j237750j342416j285136j250803j302481
3053.2G61840820j286566j311958j378178j264632j108825j083672j165808j292944
3069.5G51948237j309573j196981j050234r64701j085460j289189j379788j434922
3085.8G42237389j426339j357019j423478j518488j429200j277626j318097j519322
3102.2G30967820j551748j350402j273931j478910j535475j328349j331747j544535
3118.5G19572723j788259k022862j991868j761079j653552j760483j889825j811564
3134.8G04893231j634955j654744j942516k147674k065063j949131j838267j746654
$$ plain form
3018.5 779857397 778862417 777921617 776992261 775986493 775035083 774244487 773443818 772419393 771218061
3036.9 771218061 770158827 769270182 768259406 767021656 765679240 764394104 763143301 761840820
3053.2 761840820 760554254 759242296 757864118 756599486 755490661 754406989 753241181 751948237
3069.5 751948237 750638664 749441683 748391449 747426748 746341288 745052099 743672311 742237389
3085.8 742237389 740811050 739454031 738030553 736512065 735082865 733805239 732487142 730967820
3102.2 730967820 729416072 728065670 726791739 725312829 723777354 722449005 721117258 719572723
3118.5 719572723 717784464 715761602 713769734 712008655 710355103 708594620 706704795 704893231
3134.8 704893231 703258276 701603532 699661016 697513342 695448279 693499148 691660881 689914227
3151.1F89914227j965702k290428k286255k145529k159059k208233k153873k109707
3167.4F72595441k163469k220870k225756k220690k264977k288639k249897k262413
3183.7F54698730k318502k302647k250433k278208k383709k441228k388835k315104
3200.1F36020064k304673k327502k287745k254605k270461k232849k205372k234042
3216.4F17902815k233088k198755k206266k258122k261639k146900j965999j915992
3232.7F00716054k112865k246499k105057j953900j886487j771689j708150j828253
3249E85103154j881301j742304j668334j739800j782775j699388j614272j592100j518130
3267.4E69864750j396835j458287j671374j784086j794756j733362j681686j721501
$$ plain form
3151.1 689914227 687948525 685658097 683371842 681226313 679067254 676859021 674705148 672595441
3167.4 672595441 670431972 668211102 665985346 663764656 661499679 659211040 656961143 654698730
3183.7 654698730 652380228 650077581 647827148 645548940 643165231 640724003 638335168 636020064
3200.1 636020064 633715391 631387889 629100144 626845539 624575078 622342229 620136857 617902815
3216.4 617902815 615669727 613470972 611264706 609006584 606744945 604598045 602632046 600716054
3232.7 600716054 598603189 596356690 594251633 592297733 590411246 588639557 586931407 585103154
3249 585103154 583221853 581479549 579811215 578071415 576288640 574589252 572974980 571382880 569864750
3267.4 569864750 568467915 567009628 565338254 563554168 561759412 560026050 558344364 556622863
3283.7E56622863j743376j689733j621186j631379j759529j946569k082705k043248
3300E42105138j836836j683176j833856k206385k460122k491772k402544k308488k303302
3318.4E22578657k367258k351225k291918k463102k708018k693355k538681k397597
3334.7E02767503k343952k521962k761156k796888k789915k740174k528042k572834
3351D81712580k970785l135711k869606k604008k627939k676725k466560k287060k512008
3369.3D57562178k894222k862633k461373k196879k097904k055437k022236j838178
3385.7D39133316j455515j069814j133561j555235j573473j029461o80537j072019
3402D29563701j536995j275450p95603o37650o18697o83337p37548n96195l88742k18659
$$ plain form
3283.7 556622863 554879487 553189754 551568568 549937189 548177660 546231091 544148386 542105138
3300 542105138 540268302 538585126 536751270 534544885 532084763 529592991 527190447 524881959 522578657
3318.4 522578657 520211399 517860174 515568256 513105154 510397136 507703781 505165100 502767503
3334.7 502767503 500423551 497901589 495140433 492343545 489553630 486813456 484285414 481712580
3351 481712580 478741795 475606084 472736478 470132470 467504531 464827806 462361246 460074186 457562178
3369.3 457562178 454667956 451805323 449343950 447147071 445049167 442993730 440971494 439133316
3385.7 439133316 437677801 436607987 435474426 433919191 432345718 431316257 430635720 429563701
3402 429563701 428026706 426751256 425955653 425318003 424699306 424015969 423278421 422682226 422293484 422074825
3422.4D22074825j7345K34305M85570N18501N32031P45624P06792L54945K96832O78628
3442.8D26610708J068086J252681J305759J362860J496166J671016J839727J962841
3459.1D38569844J867443J845092K253800K505690K115816J583427J620919K060801
3475.4D54422832K436965K426863K053618K041996K409577K416611K256572K394408
3491.7D72859442K593398K684504K622485K563477K580553K458245K318918K427340
3508D93108362K786577L086596K950788K660155K724767L005862L231883L152728K885521
3526.4E19593239K875924L122449L366172L548563L525734L342032L496528L760814
3542.7E46631455L631056L312230L377914L630340L710688L790915L957331M105031
$$ plain form
3422.4 422074825 422057480 422291785 422777355 423295856 423827887 424573511 425280303 425635248 425932080 426610708
3442.8 426610708 427678794 428931475 430237234 431600094 433096260 434767276 436607003 438569844
3459.1 438569844 440437287 442282379 444536179 447041869 449157685 450741112 452362031 454422832
3475.4 454422832 456859797 459286660 461340278 463382274 465791851 468208462 470465034 472859442
3491.7 472859442 475452840 478137344 480759829 483323306 485903859 488362104 490681022 493108362
3508 493108362 495894939 498981535 501932323 504592478 507317245 510323107 513554990 516707718 519593239
3526.4 519593239 522469163 525591612 528957784 532506347 536032081 539374113 542870641 546631455
3542.7 546631455 550262511 553574741 556952655 560582995 564293683 568084598 572041929 576146960
3559E76146960M075647L812313L581047M084587M846334M773081M472911M494131M626572
3577.4F14913583M846155N163134N234181M871786M587412N051613N261779N006253
3593.7F54935896N114973N481720N505621N399943N341470N022466M839778N028010
3610F96669877N184531N294859N141258M886449N225718N324781M755974M068911L957152
3628.4G40509510M846752M945397M476309M211366M015565L852844L664077L356039
3644.7G73877859K913237K904355L605306L580511K903581K805769L023982K623201
3661G98237801K125918J993180J708329J320481J619935J533389Q82626J446962K105117
3679.4H12973738J971245J826584J687944J294493Q39949J076341J472771J329303
$$ plain form
3559 576146960 580222607 584034920 587615967 591700554 596546888 601319969 605792880 610287011 614913583
3577.4 614913583 619759738 624922872 630157053 635028839 639616251 644667864 649929643 654935896
3593.7 654935896 660050869 665532589 671038210 676438153 681779623 686802089 691641867 696669877
3610 696669877 701854408 707149267 712290525 717176974 722402692 727727473 732483447 736552358 740509510
3628.4 740509510 745356262 750301659 754777968 758989334 763004899 766857743 770521820 773877859
3644.7 773877859 776791096 779695451 783300757 786881268 789784849 792590618 795614600 798237801
3661 798237801 800363719 802356899 804065228 805385709 807005644 808539033 809421659 810868621 812973738
3679.4 812973738 814944983 816771567 818459511 819754004 820593953 821670294 823143065 824472368
3695.7H24472368R57906O85811O67155R16958R39130N69165J35899K69472J042962
3714H30656826J210750P59542L28421J90139K57313M08948O31273N13255O7473p0334
3734.4H34953606M65095R22740O44624k11537o23882K04385K71618j30475N14508R49084
3754.8H37959766N98610J98781K53260M03107L03626J89960M8279J58370M75049M60625
3775.2H41049433K31862K8312M0054Q6725Q7559K41757L67343L15666L7432k50280
3795.6H42235863j56402k08557l07918K12074K34246J03950M62413M96149M18m17114
3816H42655122k18749k44617p8202M86851M55618K67565N2452j01327L2067j25170
3836.4H43181610m16875r5784K80976M93705N23865J45138o34432j496732m49419J146972
$$ plain form
3695.7 824472368 825430274 826116085 826783240 827700198 828639328 829208493 829344392 829613864 830656826
3714 830656826 831867576 832627118 832955539 833145678 833402991 833811939 834443212 834956467 835023940 834953606
3734.4 834953606 835418701 836341441 836986065 836774528 836150646 836355031 836626649 836496174 837010682 837959766
3754.8 837959766 838558376 838757157 839010417 839413524 839717150 839907110 839955389 840113759 840588808 841049433
3775.2 841049433 841281295 841309607 841349661 841436386 841523945 841765702 842133045 842448711 842486143 842235863
3795.6 842235863 842079461 841870904 841562986 841775060 842009306 842113256 842575669 843071818 843072236 842655122
3816 842655122 842436373 842191756 842113554 842600405 843056023 843323588 843376040 843274713 843306780 843181610
3836.4 843181610 842764735 842668951 842949927 843443632 843967497 844112635 843478203 841981471 841532052 842679024
3856.8H42679024R25660J96636l28303l01420J0848j07468r3579K17855L76225L12805
3877.2H43888283j06693j67250J22368N6267P4387j252j85073J14024K82645j31786
3897.6H43945920m87625l89516j15157K85507M90665L15666J52052J8477j92881j94191
3918H43828917J2993M0293m8160L4511Q9705n0903n96K27988J57356r894q2135j21653
3942.5H44078422Q940L4571r0659m589J24633J13130R8943P1824j729K8670J24514
3964.9H44586670P8977j4902J8776O3538M6313J5378O139J02997J39833L7908J4365
3987.3H45095992L1054j2517l7670L457Q5115
3997.5H45165431
$$ plain form
3856.8 842679024 843604684 843801320 843473017 843171597 843182445 843074977 842981398 843199253 843575478 843888283
3877.2 843888283 843781590 843614340 843736708 843792975 843867362 843866110 843681037 843795061 844077706 843945920
3897.6 843945920 843458295 843068779 842953622 843239129 843729794 844045460 844197512 844215989 844023108 843828917
3918 843828917 843841910 843882203 843834043 843868554 843958259 843907356 843906760 844134748 844292104 844282210 844200075 844078422
3942.5 844078422 844087362 844121933 844031274 844026685 844151318 844264448 844363391 844435215 844433486 844462156 844586670
3964.9 844586670 844665647 844650745 844669521 844733059 844779372 844794750 844800889 844903886 845043719 845081627 845095992
3987.3 845095992 845127046 845114529 845076859 845080316 845165431
3997.5 845165431
##END=$$ End of the data block
