##TITLE=$$ Begin of the data block
##JCAMP-DX=5.00 $$ ACD/SpecManager v 10.08
##SPECTROMETER/DATA SYSTEM=Alpha
##DATE=07 Apr 2014 11:14:18
##DATA TYPE=INFRARED SPECTRUM
##DATA CLASS=XYDATA
##ORIGIN=
##OWNER=
##NPOINTS=1765
##FIRSTX=399.75695801
##LASTX=3997.56933594
##MAXX=3997.56933594
##MINX=399.75695801
##MAXY=0.88530266
##MINY=0.49397230
##XFACTOR=1.0000000000
##YFACTOR=1.000000000000000e-9
##FIRSTY=0.77262914
##DELTAX=2.03957629
##XUNITS=1/CM
##YUNITS=ARBITRARY UNITS
##XYDATA=(X++(Y..Y))
$$ plain form
399.8 772629142 769187689 770474255 771950543 768831015 766253769 768354774 769439995 766287863
416.1 766287863 764786720 767561734 766588271 762611151 762802422 765756726 764596522 761356056 762423515
434.4 762423515 764494121 762047827 759664237 761937618 763863742 761334658 759518504 761480808
450.7 761480808 762187958 759576261 758739769 760975122 760705471 758024633 758060217 759966969 758804202
469.1 758804202 756228268 757145882 758974552 757227600 754998982 756162643 757377505 755439997 754157722
487.5 754157722 755937040 756707847 754440665 753383934 754933953 754822910 752163768 751470804 753105402
505.8 753105402 752727866 750484943 750257790 751412451 750365973 748313785 748682857 749580026 747993648
524.2 747993648 745918512 746165812 746556938 744712889 743056417 743840635 744251907 742218673 740883410
$$ packed form
399.8G72629142l441453J286566J476288l119528k577246K101005J085221l152132
416.1G66287863j501143K775014r73463l977120J91271K954304j160204l240466J067459
434.4G62423515K070606k446294k383590K273381J926124k529084j816154J962304
450.7G61480808P07150k611697q36492K235353k69651k680838L5584J906752j162767
469.1G58804202k575934R17614J828670j746952k228618J163661J214862j937508j282275
487.5G54157722J779318P70807k267182j056731J550019j11043k659142o92964J634598
505.8G53105402l77536k242923k27153J154661j046478k052188L69072Q97169j586378
524.2G47993648k075136K47300L91126j844049j656472P84218M11272k033234j335263
$$ plain form
542.5 740883410 741828799 741828680 739882112 739204228 740372181 740137756 738145471 737439275 737969398 736847758
562.9 736847758 734606326 734180450 734654546 733188391 730994999 730591178 730690718 729094326 727348387
581.3 727348387 727550805 727852046 726277888 724746406 724955738 725095749 723821700 722779930 722809017
599.6 722809017 722138762 720137000 718764842 718661010 718022525 716567218 716194510 717080593 717712939
618 717712939 718373299 720476449 723530531 725741565 727302194 729697049 732478857 734224796 735437572
636.3 735437572 737394333 739421129 740326405 740898788 742383838 744131386 745072126 745734513 746919692
654.7 746919692 748357117 749873638 752004743 754723072 756736219 757207155 758130312 760798872 762950838
673.1 762950838 764198959 765561283 767355561 768824458 769748390 770879507 772327125 773317873 773880303
$$ packed form
542.5G40883410R45389j19j946568o77884J167953k34425j992285p06196N30123j121640
562.9G36847758k241432m25876M74096j466155k193392m03821R9540j596392j745939
581.3G27348387K02418L01241j574158j531482K09332J40011j274049j041770K9087
599.6G22809017o70255k001762j372158j03832o38485j455307l72708Q86083O32346
618G17712939O60360K103150L054082K211034J560629K394855K781808J745939J212776
636.3G35437572J956761K026796R05276N72383J485050J747548R40740O62387J185179
654.7G46919692J437425J516521K131105K718329K013147M70936R23157K668560K151966
673.1G62950838J248121J362324J794278J468897R23932J131117J447618R90748N62430
$$ plain form
691.4 773880303 774760067 775893927 776640475 777177155 778110445 779224217 780024171 780793965 781968355
709.8 781968355 783268332 784319818 785385132 786671162 787829340 788794279 789924860 791218162 792327821
728.1 792327821 793255687 794313431 795457602 796322882 796981335 797858834 798837900 799592495 800409198
746.5 800409198 801631510 802892923 803788304 804634392 805771470 806832194 807541370 808347344 809392869
764.8 809392869 810124695 810455739 811018884 811815381 812091231 811890304 811940432 812157154 811911643 811372578
785.2 811372578 811340034 811869860 812354624 813066244 814754903 817047000 819070041 821099341 823819220
803.6 823819220 826583624 828442693 829880595 831653893 833222270 833932936 834337473 834970295 835183024
821.9 835183024 834432602 833436966 832761049 831654489 829722643 828067422 827195942 826071382 824317634
$$ packed form
691.4G73880303Q79764J133860P46548N36680R33290J113772P99954P69794J174390
709.8G81968355J299977J051486J065314J286030J158178R64939J130581J293302J109659
728.1G92327821R27866J057744J144171Q65280O58453Q77499R79066P54595Q16703
746.5H00409198J222312J261413Q95381Q46088J137078J060724P09176Q05974J045525
764.8H09392869P31826L31044N63145P96497K75850k00927N0128K16722k45511n39065
785.2H11372578l2544N29826M84764P11620J688659K292097K023041K029300K719879
803.6H23819220K764404J859069J437902J773298J568377P10666M04537O32822K12729
821.9H35183024p50422r95636o75917j106560j931846j655221q71480j124560j753748
$$ plain form
840.3 824317634 822961986 822414815 821760297 820878148 821079016 822737694 824799955 827068329 830420554
858.7 830420554 834512770 837918103 840620697 843748271 847014666 849017859 850042224 851593494
875 851593494 853434324 854203284 854178369 854627192 855166674 854529858 853317082 852961540 852975667 852217317
895.4 852217317 851575911 852326334 853415608 853488743 853486240 854467988 855234146 854559779 853489995 853118181
915.8 853118181 852403939 850473046 848674178 848141491 847813070 846881688 846633255 847724557 848516345
934.1 848516345 848148108 848067820 848900020 849088907 848123014 847597837 847814023 847047687 844984174 843246400
954.5 843246400 842027068 839634001 835869312 832397878 829200029 824438453 818223476 812530756
970.8 812530756 807558715 802017570 796409249 792388022 789565325 786262453 782705128 780344844
$$ packed form
840.3H24317634j355648n47171o54518q82149K00868J658678K062261K268374L352225
858.7H30420554M092216L405333K702594L127574L266395K003193J024365J551270
875H51593494J840830P68960k4915M48823N39482o36816j212776l55542J4127p58350
895.4H52217317o41406P50423J089274P3135k503R81748P66158o74367j069784l71814
915.8H53118181p14242j930893j798868n32687l28421r31382k48433J091302P91788
934.1H48516345l68237q0288Q32200J88887r65893n25177K16186p66336k063513j737774
954.5H43246400j219332k393067l764689l471434l197849m761576o214977n692720
970.8H12530756m972041n541145n608321m021227k822697l302872l557325k360284
$$ plain form
987.1 780344844 778795898 776627719 774343431 773391426 773182392 772187591 770903587 770607948 770423174
1005.5 770423174 768770635 766350746 764584482 762741923 759647727 756347895 754174888 752206266
1021.8 752206266 749270797 746324122 744472504 742761910 740213811 737893641 736748815 735663414
1038.1 735663414 733706236 731940985 731109440 729960740 727746844 725791276 724950492 724209011 723063290
1056.5 723063290 722714186 723625898 724298596 723779380 723014355 722448647 720944583 718255639 715857208
1074.8 715857208 714276910 712257445 709433973 707049966 705350339 703048229 699981987 697611392
1091.2 697611392 696405828 695279181 693988204 693568945 693938792 693728149 692798257 692351580 692412853
1109.5 692412853 691752732 690340698 689275563 688298702 686103880 683137357 681280971 680693448 680136144
$$ packed form
987.1G80344844j548946k168179k284288r52005k09034r94801j284004k95639j84774
1005.5G70423174j652539k419889j766264j842559l094196l299832k173007j968622
1021.8G52206266k935469k946675j851618j710594k548099k320170j144826j085401
1038.1G35663414j957178j765251q31545j148700k213896j955568q40784p41481j145721
1056.5G23063290l49104R11712O72698n19216p65025n65708j504064k688944k398431
1074.8G15857208j580298k019465k823472k384007j699627k302110l066242k370595
1091.2F97611392j205564j126647j290977m19259L69847k10643r29892m46677O1273
1109.5F92412853o60121j412034j065135r76861k194822k966523j856386n87523n57304
$$ plain form
1127.9 680136144 680120230 681651354 683598399 684686303 685606539 687508464 689860046 691334188 692196131
1146.2 692196131 693617225 695297539 696220875 696890473 698457301 700528800 702090263 703745782 706692278
1164.6 706692278 710434079 713859141 717427611 721997619 726789653 730700552 734332919 738601625
1180.9 738601625 742707253 745611846 747974694 750614405 752689004 753340542 753533959 754345596 755139709
1199.3 755139709 755314887 755911767 757713854 759639323 760719299 761748075 763342500 764519930 764726758
1217.6 764726758 765122354 766391337 767444611 767703593 768309951 769814968 771103859 771673739 772632241
1236 772632241 774405301 775808573 776374996 777171969 778497040 779209316 779051244 779216409 779992342
1254.3 779992342 780292809 780049384 780553639 781990469 783194244 784110010 785844505 788338006 790402472
$$ packed form
1127.9F80136144j5914J531124J947045J087904R20236J901925K351582J474142Q61943
1146.2F92196131J421094J680314R23336O69598J566828K071499J561463J655519K946496
1164.6G06692278L741801L425062L568470M570008M792034L910899L632367M268706
1180.9G38601625M105628K904593K362848K639711K074599O51538J93417Q11637P94113
1199.3G55139709J75178N96880J802087J925469J079976J028776J594425J177430K06828
1217.6G64726758L95596J268983J053274K58982O06358J505017J288891N69880R58502
1236G72632241J773060J403272N66423P96973J325071P12276j58072J65165P75933
1254.3G79992342L00467k43425N04255J436830J203775R15766J734495K493501K064466
$$ plain form
1272.7 790402472 792016923 794235706 796931386 799013913 800655186 802963793 805745482 807889521
1289 807889521 809605360 811897993 814380825 815955639 816970944 818472803 820095360 820828557 821103811
1307.4 821103811 821960092 822947323 823117733 823028266 823664069 824557483 824819744 824968040 825847983 826805472
1327.8 826805472 826887667 826723516 827133954 827392757 826702476 826038122 826423824 826920092 826664329 826393187
1348.1 826393187 826778829 827018142 826449215 825907648 825973153 825630307 824327171 823394954 823234141 822601020
1368.5 822601020 821166575 819676101 818515003 817030191 814007401 808933198 803462803 801149905
1384.9 801149905 803626060 808178544 811280012 812041342 811226249 810504496 810175896 809402108 807895720
1403.2 807895720 806409597 805563033 804513633 803053856 802126408 801645994 800433457 798802853 798472285
$$ packed form
1272.7G90402472J614451K218783K695680K082527J641273K308607K781689K144039
1289H07889521J715839K292633K482832J574814J015305J501859J622557P33197K75254
1307.4H21103811Q56281R87231J70410q9467O35803Q93414K62261J48296Q79943R57489
1327.8H26805472Q2195j64151M10438K58803o90281o64354L85702M96268k55763k71142
1348.1H26393187L85642K39313n68927n41567O5505l42846j303136r32217j60813o33121
1368.5H22601020j434445j490474j161098j484812l022790n074203n470395k312898
1384.9H01149905K476155M552484L101468P61330q15093p21753l28600p73788j506388
1403.2H07895720j486123q46564j049400j459777r27448m80414j212537j630604l30568
$$ plain form
1421.6 798472285 798781395 798645794 798173904 797995627 798368096 798472404 798036456 798538923 799973965
1439.9 799973965 800913870 801433086 802296102 803594768 804930449 806256473 807734847 809361160 811895609
1458.3 811895609 815292358 818509996 821351826 823957324 826437235 828868866 831571221 834438741
1474.6 834438741 837235570 839915454 841932893 843001544 843508720 843749344 843525708 843181551 843236208
1493 843236208 842997074 841843426 840489030 839731812 839089215 836829782 832625151 830821037 830524385
1511.3 830524385 829439700 827266514 825070441 823574007 821872652 820427835 819681287 819144428 818509579
1529.7 818509579 817035854 815296412 814713836 813760817 810934544 809289038 809815705 810360789 810400307
1548 810400307 810366571 810622692 810601413 809823692 808127344 807771623 808753431 808774829 808036208 806590080
$$ packed form
1421.6G98472285L09110j35601m71890j78277L72469J04308m35948N02467J435042
1439.9G99973965R39905N19216Q63016J298666J335681J326024J478374J626313K534449
1458.3H11895609L396749L217638K841830K605498K479911K431631K702355K867520
1474.6H34438741K796829K679884K017439J068651N07176K40624k23636l44157N4657
1493H43236208k39134j153648j354396p57218o42597k259433m204631j804114k96652
1511.3H30524385j084685k173186k196073j496434j701355j444817p46548n36859o34849
1529.7H18509579j473725j739442n82576r53019k826273j645506N26667N45084L9518
1548H10400307l3736K56121k1279p77721j696348l55721R81808K1398p38621j446128
$$ plain form
1568.4 806590080 804517150 802876592 800726652 797302186 794468880 792076409 789206684 785946667
1584.7 785946667 782173634 778046548 773924887 769679070 765017807 760338068 755983412 751555979
1601.1 751555979 746793628 742056012 737471163 732717693 727943242 723419487 718268454 712597489
1617.4 712597489 708881974 705981076 702557623 699589133 697049856 694999635 693913341 692751169
1633.7 692751169 691160977 691417933 693302870 695441425 697366059 699514985 703207314 707107723
1650 707107723 710312605 715157926 720766962 725393772 729471207 733740449 738634288 743036330 746805966
1668.4 746805966 751194894 755943179 760500550 765225410 769751728 773751974 777359188 781997681
1684.7 781997681 787462175 792302966 796867609 800734580 804165244 808035016 812213361 817210972
$$ packed form
1568.4H06590080k072930j640558k149940l424466k833306k392471k869725l260017
1584.7G85946667l773033m127086m121661m245817m661263m679739m354656m427433
1601.1G51555979m762351m737616m584849m753470m774451m523755n151033n670965
1617.4G12597489l715515k900898l423453k968490k539277k050221j086294j162172
1633.7F92751169j590192K56956J884937K138555J924634K148926L692329L900409
1650G07107723L204882M845321N609036M626810M077435M269242M893839M402042L769636
1668.4G46805966M388928M748285M557371M724860M526318M000246L607214M638493
1684.7G81997681N464494M840791M564643L866971L430664L869772M178345M997611
$$ plain form
1701 817210972 821945369 825863659 829779506 833290040 836095750 838338256 840053976 841826558 844445467
1719.3 844445467 847109318 849154651 850756228 852058053 853250504 854196370 854922175 856419802 858148932
1737.7 858148932 859467983 860686660 861990869 863286495 864378631 865361691 866804063 868357539
1754 868357539 869391799 870033801 870548785 871283293 872305751 872919321 873043060 873112738 873370051 874108195
1774.4 874108195 875038385 875797510 876318216 876655757 877042055 877678514 878076494 877753198 877584994 878327429
1794.8 878327429 879034519 879131615 879234076 879853368 880428493 880538881 880543232 880868316 881315708 881500840
1815.2 881500840 881638825 882029414 882246554 881973267 881806195 882037699 882153451 882334113 882817924 883224487
1835.6 883224487 883341491 883251131 883075237 882975519 883197546 883530080 883903146 884315372 884390295 884171844
$$ packed form
1701H17210972M734397L918290L915847L510534K805710K242506J715720J772582K618909
1719.3H44445467K663851K045333J601577J301825J192451R45866P25805J497627J729130
1737.7H58148932J319051J218677J304209J295626J092136R83060J442372J553476
1754H68357539J034260O42002N14984P34508J022458O13570J23739O9678K57313P38144
1774.4H74108195R30190P59125N20706L37541L86298O36459L97980l23296j68204P42435
1794.8H78327429P07090R7096J02461O19292N75125J10388M351L25084M47392J85132
1815.2H81500840J37985L90589K17140k73287j67072K31504J15752J80662M83811M06563
1835.6H83224487J17004r0360j75894r9718K22027L32534L73066M12226P4923k18451
$$ plain form
1856 884171844 884195566 884533644 884676576 884496033 884237170 884070814 884152293 884396791 884714961 885048687
1876.4 885048687 885105550 884945273 884998620 885188580 885034323 884612978 884674847 885107875 885146499 884980738
1896.8 884980738 885110140 885302663 885162532 884918809 884963810 885105550 885022998 884912610 884957552 884878993
1917.2 884878993 884570062 884351492 884512782 884841979 884829283 884645641 884699166 884757578 884521067 884293258
1937.6 884293258 884314418 884238005 883968472 883906066 884093642 884112000 883776248 883511484 883606732 883673131 883427739
1960 883427739 883232296 883278906 883157253 882776737 882625818 882793725 882843494 882617354 882460654 882505298
1980.4 882505298 882420123 882090747 881874084 881913126 881828666 881556690 881502211 881609499 881496012 881214678
2000.8 881214678 881115913 881183326 881075978 880776048 880617917 880629599 880466342 880155563 880080402 880190253
$$ packed form
1856H84171844K3722L38078J42932j80543k58863j66356Q1479K44498L18170L33726
1876.4H85048687N6863j60277N3347J89960j54257m21345O1869M33028L8624j65761
1896.8H84980738J29402J92523j40131k43723M5001J41740q2552j10388M4942p8559
1917.2H84878993l08931k18570J61290L29197j2696j83642N3525N8412k36511k27809
1937.6H84293258K1160p6413k69533o2406J87576J8358l35752k64764R5248O6399k45392
1960H83427739j95443M6610j21653l80516j50919J67907M9769k26140j56700M4644
1980.4H82505298q5175l29376k16663L9042q4460k71976n4479J07288j13487k81334
2000.8H81214678r8765O7413j07348k99930j58131J1682j63257l10779p5161J09851
$$ plain form
2021.2 880190253 880155802 879963875 879837096 879797578 879662395 879466176 879427791 879476845 879361033 879146278
2041.6 879146278 879076958 879095197 878978193 878796637 878772676 878848374 878813505 878710687 878700078 878697693 878546894
2064 878546894 878382921 878409386 878499746 878471971 878387094 878373086 878407896 878387928 878346682 878395081 878477335 878456652
2088.5 878456652 878399253 878439605 878507197 878489316 878454447 878498614 878590584 878643632 878638029 878645837 878684759 878686011
2113 878686011 878662646 878722608 878864884 878940880 878914356 878940582 879040241 879072070 879030466 879050255 879179537
2135.4 879179537 879292905 879307687 879303277 879369497 879461884 879498661 879546702 879686058 879828215 879864335 879856527
2157.9 879856527 879922390 880008698 880016983 880061150 880240560 880376339 880337477 880303681 880427599 880538821 880513072
2180.3 880513072 880562425 880778015 880897284 880822837 880788982 880902469 880975246 880922794 880960405 881161809 881245494
$$ packed form
2021.2H80190253l4451j91927j26779l9518j35183j96219l8385M9054j15812k14755
2041.6H79146278o9320J8239j17004j81556k3961P5698l4869j02818j0609k385j50799
2064H78546894j63973K6465R0360k7775q4877j4008L4810j9968m1246M8399Q2254k0683
2088.5H78456652n7399M0352O7592j7881l4869M4167R1970N3048n603P808L8922J252
2113H78686011k3365N9962J42276P5996k6524K6226R9659L1829m1604J9789J29282
2135.4H79179537J13368J4782m410O6220R2387L6777M8041J39356J42157L6120p808
2157.9H79856527O5863Q6308Q285M4167J79410J35779l8862l3796J23918J11222k5749
2180.3H80513072M9353K15590J19269p4447l3855J13487P2777n2452L7611K01404Q3685
$$ plain form
2202.7 881245494 881123841 881108820 881283462 881314099 881126046 881091833 881295919 881377578 881266475 881275117 881442606
2225.2 881442606 881459177 881293535 881274164 881447673 881482363 881331742 881321669 881466866 881437063 881269515
2245.6 881269515 881309450 881469429 881399274 881183088 881168723 881308019 881253481 881080627 881146729 881339967
2265.9 881339967 881293535 881105602 881132483 881308973 881302297 881180942 881309032 881582975 881554723 881293833
2286.3 881293833 881205916 881215334 880990803 880674899 880622208 880641222 880340219 879907191 879661620 879383743
2306.7 879383743 878780603 878128290 877844572 877695739 877128243 876210511 875424564 874817312 874177516 873584688
2327.1 873584688 873176038 872841299 872424603 872001946 871774018 871592462 871245682 871362090 872802913
2345.5 872802913 874617338 875045776 873752177 871688306 869835258 868448973 867850363 868106067 868776619
$$ packed form
2202.7H81245494j21653j5021J74642L0637j88053l4213K04086Q1659j11103Q642J67489
2225.2H81442606J6571j65642j9371J73509L4690j50621j0073J45197k9803j67548
2245.6H81269515L9935J59979p0155k16186j4365J39296n4538j72854O6102J93238
2265.9H81339967m6432j87933K6881J76490o676j21355J28090K73943k8252k60890
2286.3H81293833q7917R418k24531l15904n2691J9014l01003m33028k45571k77877
2306.7H79383743o03140o52313k83718j48833n67496r17732p85947o07252o39796n92828
2327.1H73584688m08650l34739m16696m22657k27928j81556l46780J16408J440823
2345.5H72802913J814425M28438j293599k063871j853048j386285n98610K55704O70552
$$ plain form
2363.8 868776619 869698882 871063590 872781634 874447107 875953913 877545893 879188836 880521059
2380.2 880521059 881457686 882239878 882879794 883139789 883103013 883173704 883391619 883428693 883292198 883302093
2400.6 883302093 883436382 883388877 883236587 883319438 883518577 883473694 883299351 883332193 883484483 883405268
2421 883405268 883161485 883132577 883273542 883249402 883127511 883198440 883343279 883282244 883143485 883204758 883352041
2443.4 883352041 883296311 883129299 883140743 883239567 883152723 883000970 883045316 883153975 883067548 882912517 882927001
2465.8 882927001 882970333 882831633 882694840 882787049 882894456 882762790 882581055 882584333 882617354 882475138
2486.2 882475138 882331789 882407248 882501960 882376850 882185757 882147431 882165611 882071078 881993294 882067561 882104516
2508.7 882104516 881951511 881800056 881807983 881794930 881648719 881550193 881617248 881684363 881569505 881408036 881386280
$$ packed form
2363.8H68776619R22263J364708J718044J665473J506806J591980J642943J332223
2380.2H80521059R36627P82192O39916K59995l6776P0691K17915L7074j36495R895
2400.6H83302093J34289m7505j52290Q2851J99139m4883j74343L2842J52290p9215
2421H83405268k43783k8908J40965k4140j21891P0929J44839o1035j38759O1273J47283
2443.4H83352041n5730j67012J1444R8824q6844j51753M4346J08659q6427j55031J4484
2465.8H82927001M3332j38700j36793R2209J07407j31666j81735L278L3021j42216
2486.2H82475138j43349P5459R4712j25110j91093l8326J8180r4533p7784P4267L6955
2508.7H82104516j53005j51455P927j3053j46211r8526O7055O7115j14858j61469k1756
$$ plain form
2531.1 881386280 881380081 881269693 881201327 881267726 881280720 881115496 880981445 881008387 881000459 880852520 880759120
2553.5 880759120 880811095 880803585 880650818 880517125 880482078 880434096 880307138 880221009 880243778 880207479 880022228
2576 880022228 879861236 879787445 879654527 879465103 879394114 879441559 879384041 879163265 878971636 878879189 878740966
2598.4 878740966 878524482 878388643 878358066 878270507 878066599 877872109 877770245 877641618 877410293 877219021
2618.8 877219021 877128422 877001226 876797140 876621842 876490593 876305223 876045287 875867248 875831187 875721395
2639.2 875721395 875451922 875216842 875087261 874919653 874690354 874559224 874520898 874341547 874021351 873841524
2659.6 873841524 873821914 873705089 873465538 873297036 873235345 873120725 872897208 872737229 872693241 872559309
2680 872559309 872256517 872003913 871896327 871700346 871366262 871138692 871035635 870841384 870579302 870435655
$$ packed form
2531.1H81386280o199j10388o8366O6399J2994j65224j34051K6942p928j47939r3400
2553.5H80759120N1975p510j52767j33693l5047m7982j26958q6129K2769l6299j85251
2576H80022228j60992p3791j32918j89424p0989M7445n7518k20776j91629r2447j38223
2598.4H78740966k16484j35839l0577q7559k03908j94490j01864j28627k31325j91272
2618.8H77219021r0599j27196k04086j75298j31249j85370k59936j78039l6061j09792
2639.2H75721395k69473k35080j29581j67608k29299j31130l8326j79351l20196j79827
2659.6H73841524j9610j16825k39551j68502o1691j14620k23517j59979m3988j33932
2680H72559309l02792k52604j07586j95981l34084k27570j03057j94251k62082j43647
$$ plain form
2700.4 870435655 870351076 870142221 869836867 869615674 869471908 869236887 868948400 868781209 868716538 868551433
2720.8 868551433 868273735 868113399 867984593 867627442 867221177 867044568 866996527 866814733 866492569 866262853
2741.2 866262853 866159260 866029739 865870893 865728974 865528226 865204036 864854753 864613235 864386499 864047289
2761.6 864047289 863772988 863703907 863609970 863299549 862954319 862761497 862521052 862068713 861660004 861477792
2782 861477792 861292124 860953033 860665023 860457003 860088110 859585881 859217346 858976364 858593345 858027041
2802.3 858027041 857496262 857132912 856810451 856334686 855801880 855398118 854978979 854383707 853800178 853351355
2822.7 853351355 852829993 852179646 851628721 851194084 850607038 849789858 848967791 848081350 846738458
2841.1 846738458 844983339 843229592 841594577 840005696 838713109 838063657 837885499 837739885 837438881
$$ packed form
2700.4H70435655q4579k08855l05354k21193j43766k35021k88487j67191o4671j65105
2720.8H68551433k77698j60336j28806l57151m06265j76609m8041j81794l22164k29716
2741.2H66262853j03593j29521j58846j41919k00748l24190l49283k41518k26736l39210
2761.6H64047289k74301o9081r3937l10421l45230j92822k40445m52339m08709j82212
2782H61477792j85668l39091k88010k08020l68893n02229l68535k40982l83019n66304
2802.3H58027041n30779l63350l22461m75765n32806m03762m19139n95272n83529m48823
2822.7H53351355n21362o50347n50925m34637n87046q17180q22067q86441j342892
2841.1H46738458j755119j753747j635015j588881j292587o49452j78158j45614l01004
$$ plain form
2859.5 837438881 837033093 836543679 835827887 834900081 834071875 833469689 832768440 831838667 831098258 830644548
2879.9 830644548 830076098 829345763 828714967 828146160 827410579 826580644 825915873 825279891 824359238 823318899
2900.2 823318899 822428524 821520865 820381999 819160163 818038046 816796124 815143108 813332200 811831355
2918.6 811831355 810663581 809733331 809179425 809092402 809228301 809229791 809240460 809579432 810124815 810734451
2939 810734451 811608672 812759578 813714921 814149737 814328671 814575732 814641535 814335942 814096689 814221203
2959.4 814221203 814479411 814638317 814812958 815132380 815485775 815848172 816308439 816795766 817176819 817399979
2979.8 817399979 817465067 817441702 817388058 817412019 817693770 818015099 817945719 817609727 817281783 816879570
3000.2 816879570 816353738 815808296 815411150 815229237 815051615 814684153 814149320 813465953 812623978 811765850
$$ packed form
2859.5H37438881m05788m89414p15792r27806q28206o02186p01249r29773p40409m53710
2879.9H30644548n68450p30335o30796n68807p35581q29935o64771o35982r20653j040339
2900.2H23318899q90375r07659j138866j221836j122117j241922j653016j810908j500845
2918.6H11831355j167774r30250n53906q7023J35899J490J0669L38972N45383O09636
2939H10734451Q74221J150906R55343M34816J78934K47061O5803l05593k39253J24514
2959.4H14221203K58208J58906J74641L19422L53395L62397M60267M87327L81053K23160
2979.8H17399979O5088k3365n3644K3961K81751L21329o9380l35992l27944m02213
3000.2H16879570n25832n45442l97146j81913j77622l67462n34833o83367q41975q58128
$$ plain form
3020.6 811765850 811048985 810378790 809586167 808793306 808172405 807587922 806781650 805823445 805093944 804549634
3041 804549634 803759634 802678525 801582754 800587118 799595535 798587203 797639668 796637714 795505166
3059.3 795505166 794463336 793630600 792839408 791887224 790794849 789769292 788879871 788101852 787400007
3077.7 787400007 786557794 785460353 784282625 783152163 782110691 781075299 779846489 778526187
3094 778526187 777351737 776320755 775295377 774170637 772992909 771853924 770734310 769559503 768400431
3112.4 768400431 767368019 766344547 765156150 763646007 761825442 760085285 758693814 757435262
3128.7 757435262 755972624 754359901 752935767 751707673 750345528 748685181 746906519 745190740
3145 745190740 743530393 742026865 740705431 739167750 737199187 735154927 733288229 731506050 729704142
$$ packed form
3020.6H11765850p16865o70195p92623p92861o20901n84483q06272r58205p29501n44310
3041H04549634p90000j081109j095771r95636r91583j008332r47535j001954j132548
3059.3G95505166j041830q32736p91192r52184j092375j025557q89421p78019p01845
3077.7G87400007q42213j097441j177728j130462j041472j035392j228810j320302
3094G78526187j174450j030982j025378j124740j177728j138985j119614j174807j159072
3112.4G68400431j032412j023472j188397j510143j820565j740157j391471j258552
3128.7G57435262j462638j612723j424134j228094j362145j660347j778662j715779
3145G45190740j660347j503528j321434j537681j968563k044260j866698j782179j801908
$$ plain form
3163.4 729704142 727879226 726067364 724220991 722307503 720407963 718544185 716636539 714701593
3179.7 714701593 712797940 710863233 708842874 706791222 704764009 702759385 700703084 698554575
3196 698554575 696459293 694480717 692497075 690497398 688510597 686492860 684468091 682484627 680542290
3214.3 680542290 678626835 676677346 674687564 672732890 670804977 668852746 666941583 665208876
3230.7 665208876 663548112 661671698 659648955 657767057 656026781 654324293 652737856 651214123
3247 651214123 649527431 647786915 646252215 644840598 643310785 641676009 640143335 638739049 637336493
3265.3 637336493 635982454 634771705 633495390 631937444 630222619 628547430 626965165 625413954
3281.6 625413954 623840392 622264266 620708168 619228721 617770374 616138935 614301741 612324536
$$ packed form
3163.4G29704142j824916j811862j846373j913488j899540j863778j907646j934946
3179.7G14701593j903653j934707k020359k051652k027213k004624k056301k148509
3196F98554575k095282j978576j983642j999677j986801k017737k024769j983464j942337
3214.3F80542290j915455j949489j989782j954674j927913j952231j911163j732707
3230.7F65208876j660764j876414k022743j881898j740276j702488j586437j523733
3247F51214123j686692j740516j534700j411617j529813j634776j532674j404286j402556
3265.3F37336493j354039j210749j276315j557946j714825j675189j582265j551211
3281.6F25413954j573562j576126j556098j479447j458347j631439j837194j977205
$$ plain form
3298 612324536 610348582 608611822 607054889 605286181 603137672 600779355 598372161 596013427 593715906
3316.3 593715906 591439426 589190543 586970150 584736526 582350969 579766929 577180803 574712098
3332.6 574712098 572338104 570025742 567602098 564966261 562254429 559512258 556835234 554387629
3348.9 554387629 551869094 548951566 545912266 543125629 540565252 537979901 535311759 532856047
3365.3 532856047 530661643 528261662 525435328 522589505 520123303 517944992 515870094 513854563
3381.6 513854563 511940539 510245621 508907080 507898748 506766140 505238354 503777087 502860844
3397.9 502860844 502240956 501225412 499770194 498551220 497792959 497203231 496599317 495893866 495149940
3416.3 495149940 494588375 494218498 493972301 493976444 494304538 494831175 495331138 495877117 496630281 497280419
$$ packed form
3298F12324536j975954j736760j556933j768708k148509k358317k407194k358734k297521
3316.3E93715906k276480k248883k220393k233624k385557k584040k586126k468705
3332.6E74712098k373994k312362k423644k635837k711832k742171k677024k447605
3348.9E54387629k518535k917528l039300k786637k560377k585351k668142k455712
3365.3E32856047k194404k399981k826334k845823k466202k178311k074898k015531
3381.6E13854563j914024j694918j338541j008332j132608j527786j461267r16243
3397.9E02860844o19888j015544j455218j218974p58261n89728o03914p05451p43926
3416.3D95149940n61565l69877k46197M143L28094N26637M99963N45979P53164O50138
$$ plain form
3436.6 497280419 497579634 497884393 498603463 499691278 500936687 502236366 503573000 504989803 506585300
3455 506585300 508399248 510334611 512183011 514047921 516280651 518712580 520767450 522312224 523878217
3473.4 523878217 525847852 528168678 530503929 532537043 534526289 536763728 539024413 541235566
3489.7 541235566 543621182 546137512 548646510 551078081 553434253 555757165 557967007 560084105
3506 560084105 562363505 565010190 567956030 570797145 573324561 575843573 578565955 581445575 584208548
3524.4 584208548 586721420 589340806 592321873 595499337 598734379 601948738 605035782 608201683
3540.7 608201683 611535192 614775896 617825329 620880842 624011159 627264500 630693495 634200931
3557 634200931 637824178 641526878 644864142 647691667 651098073 655619979 660070956 663997710 667856336
$$ packed form
3436.6D97280419K99215L04759P19070J087815J245409J299679J336634J416803J595497
3455E06585300J813948J935363J848400J864910K232730K431929K054870J544774J565993
3473.4E23878217J969635K320826K335251K033114J989246K237439K260685K211153
3489.7E41235566K385616K516330K508998K431571K356172K322912K209842K117098
3506E60084105K279400K646685K945840K841115K527416K519012K722382K879620K762973
3524.4E84208548K512872K619386K981067L177464L235042L214359L087044L165901
3540.7F08201683L333509L240704L049433L055513L130317L253341L428995L507436
3557F34200931L623247L702700L337264K827525L406406M521906M450977L926754L858626
$$ plain form
3575.3 667856336 671896815 676182210 680713713 685056508 688796639 692549109 697124839 701752007
3591.7 701752007 705986142 710352004 715008080 719731808 724514186 729080260 733066976 736985803
3608 736985803 741298020 745685458 750079751 754190743 758035481 762544513 767390251 771445751 774236798
3626.3 774236798 776813328 780984342 785466731 789323926 792876363 796172380 799323916 802327514
3642.6 802327514 804696977 806108296 807693481 810984552 814427614 816823840 819191277 821894288
3659 821894288 824036539 825576246 826894820 827682316 828072846 829118490 830010295 830358267 831806779
3677.3 831806779 833863080 835581124 836988449 837815166 837876797 837979138 839137554 840857267 842350841
3695.7 842350841 843312085 843778849 844289303 845271230 846121609 846201837 845731735 846016347 847498536 848757684
$$ packed form
3575.3F67856336M040479M285395M531503M342795L740131L752470M575730M627168
3591.7G01752007M234135M365862M656076M723728M782378M566074L986716L918827
3608G36985803M312217M387438M394293M110992L844738M509032M845738M055500K791047
3626.3G74236798K576530M171014M482389L857195L552437L296017L151536L003598
3642.6H02327514K369463J411319J585185L291071L443062K396226K367437K703011
3659H21894288K142251J539707J318574P87496L90530J045644Q91805L47972J448512
3677.3H31806779K056301J718044J407325Q26717O1631J02341J158416J719713J493574
3695.7H42350841R61244M66764N10454R81927Q50379Q0228m70102K84612J482189J259148
$$ plain form
3716.1 848757684 849147677 849044263 848958790 849040747 849365950 849917352 850095153 849580169 849098861 849844158
3736.5 849844158 851418912 852153361 851360738 850423336 850737333 850764811 850459099 851460874 852862000
3754.8 852862000 853354752 853359222 853789091 854339361 854498565 854400039 854317665 854697466 855407476 855734050
3775.2 855734050 855557203 855426490 855636775 855818093 855971515 856289625 856578708 856665552 856417716 856011629
3795.6 856011629 855754733 855238140 854793549 855175853 855481505 855704188 856382847 856848061 856514096 855867684
3816 855867684 855533600 855090201 855110288 855801761 856271565 856491923 856491387 856345117 856215358 855728090 855090737
3838.4 855090737 855151176 855767250 856587410 857277155 857257545 856045306 854158878 854197323 855761826 856644571
3858.8 856644571 856525064 855946898 855798960 855879962 855573356 855476737 855867386 856435716 856769800 856456637
$$ packed form
3716.1H48757684L89993j03414q5473Q1957L25203N51402J77801n14984m81308P45297
3736.5H49844158J574754P34449p92623r37402L13997K7478l05712J001775J401126
3754.8H52862000M92752M470M29869N50270J59204r8526q2374L79801P10010L26574
3775.2H55734050j76847j30713K10285J81318J53422L18110K89083Q6844k47836m06087
3795.6H56011629k56896n16593m44591L82304L05652K22683O78659M65214l33965o46412
3816H55867684l34084m43399K0087O91473M69804K20358n36j46270j29759m87268o37353
3838.4H55090737O0439O16074Q20160O89745j9610j212239j886428L8445J564503Q82745
3858.8H56644571j19507n78166j47938Q1002l06606r6619L90649N68330L34084l13163
$$ plain form
3879.2 856456637 856209636 856336057 856394470 856595159 856600702 856396496 856704295 857058287 856722474 855989635
3899.6 855989635 855459750 855364740 855889261 856711507 857259154 857418895 857219040 856821895 856657267 856748879
3920 856748879 856756091 856715500 856837630 856903136 856728554 856662512 856918931 857176900 857172787 856955945 856784225
3942.5 856784225 856844902 856937349 856945336 857053459 857231855 857309699 857322752 857311487 857263267 857308924 857456207
3964.9 857456207 857483923 857353449 857273936 857324302 857434154 857588232 857732415 857842326 857896864 857813418
3985.3 857813418 857695043 857690275 857721508 857692480 857702434 857820928
3997.5 857820928
$$ packed form
3879.2H56456637k47001J26421N8413K00689N543k04206L07799L53992l35813p32839
3899.6H55989635n29885r5010N24521Q22246N47647J59741j99855l97145j64628R1612
3920H56748879P212m0591J22130O5506j74582o6042K56419K57969m113k16842j71720
3942.5H56784225O0677R2447P987J08123J78396P7844J3053j1265m8220M5657J47283
3964.9H57456207K7716j30474p9513N0366J09852J54078J44183J09911N4538q3446
3985.3H57813418j18375m768L1233k9028R954J18494
3997.5H57820928
##END=$$ End of the data block
