##TITLE=$$ Begin of the data block
##JCAMP-DX=5.00 $$ ACD/SpecManager v 10.08
##SPECTROMETER/DATA SYSTEM=Alpha
##DATE=07 Apr 2014 11:14:18
##DATA TYPE=INFRARED SPECTRUM
##DATA CLASS=XYDATA
##ORIGIN=
##OWNER=
##NPOINTS=1765
##FIRSTX=399.75695801
##LASTX=3997.56933594
##MAXX=3997.56933594
##MINX=399.75695801
##MAXY=0.88554174
##MINY=0.49410048
##XFACTOR=1.0000000000
##YFACTOR=1.000000000000000e-9
##FIRSTY=0.77480668
##DELTAX=2.03957629
##XUNITS=1/CM
##YUNITS=ARBITRARY UNITS
##XYDATA=(X++(Y..Y))
399.8G74806678m502594J053870J757383l009021k474308K264201R34899l192544r23037
418.1G66715527L112614j300276m166841L07083L038466j349330l497600J005053K121031
436.5G65985727k468466k535582K022147J655996k580702j511336K268017M99785l061712
454.8G60273874q29101K445877m53294k921462J18435K118885r69588k293051R46164
473.2G58436739J396776k094090k280176J272798J443386j761020j292705J713455
489.5G56835163P57277k318502j111746J564086r4652k617419o79731J596570l66688
507.9G53564358k235294k89917J070977j134515k264261J45912R01401j505971j967669
526.2G46285021N16057N04136k041399j844704O83009M76182j778364j300872Q05557
$$ y = [774806678, 770304084, 771357954, 773115337, 770106316, 767632008, 769896209, 770831108, 767638564, 766715527, 769828141, 768527865, 764361024, 764668107, 767706573, 766357243, 762859643, 763864696, 765985727, 763517261, 760981679, 763003826, 764659822, 762079120, 760567784, 762835801, 763335586, 760273874, 759444773, 761890650, 761437356, 758515894, 758634329, 760753214, 759783626, 757490575, 758436739, 759833515, 757739425, 755459249, 756732047, 758175433, 756414413, 755121708, 756835163, 757592440, 755273938, 754162192, 755726278, 755631626, 753014207, 752334476, 753931046, 753564358, 751329064, 751039147, 752110124, 750975609, 748711348, 748857260, 749758661, 748252690, 746285021, 746801078, 747305214, 745263815, 743419111, 744102120, 744578302, 742799938, 741499066, 742304623]
544.6G42304623M5598j782000n77808J053095n02706k140700o36995O92189j097501
562.9G37357795k438247o18637N16475j260400k033174l44634J61171j553238j828253
581.3G27958858R8467K86162j513183j484871R1195o1929j327217q93474K42770o37412
601.7G22759366k158940j456320l2067n26965j417756m01497R22978P54714P36415
620G19179928K049566K937078K135336J486719K327621K825558J816929J155913J851260
638.4G37765908K036751R36091N28633J527131J869440R37581N29766J082897J480579
656.7G48694777J673043K250374K745092K053141N99027Q66353K386809K050638J328468
675.1G64647722J410723J741111J404166R57132J218319J501500J085878O62386Q41916
$$ y = [742304623, 742350221, 740568221, 739990413, 741043508, 740540802, 738400102, 737763107, 738455296, 737357795, 734919548, 734300911, 734817386, 733556986, 731523812, 731179178, 731340349, 729787111, 727958858, 728057325, 728343487, 726830304, 725345433, 725436628, 725374699, 724047482, 723154008, 723396778, 722759366, 720600426, 719144106, 719112039, 718585074, 717167318, 716765821, 717688799, 718443513, 719179928, 721229494, 724166572, 726301908, 727788627, 730116248, 732941806, 734758735, 735914648, 737765908, 739802659, 740738750, 741267383, 742794514, 744663954, 745601535, 746131301, 747214198, 748694777, 750367820, 752618194, 755363286, 757416427, 758015454, 758881807, 761268616, 763319254, 764647722, 766058445, 767799556, 769203722, 770160854, 771379173, 772880673, 773966551, 774628937, 775470853]
693.5G75470853J023650O98030N56350R39786J042485P39038Q10564J204550J263142
711.8G83748448J007855J001894J237393J189887J037598J168191J296044J136362
728.1G92823672R93848J079083J064598P69913O21200Q80897J008809P91132Q07166
746.5H00840318J173794J227916Q76486Q52704J174748J104355P39813P78079R84430
764.8H09752643P35283L45349M67897O92427L11196j17958R2805K77102j98603n56588
785.2H11801553o9857N19037N08845P42376J699507K274812K038121K079427K629697
803.6H24223518K572596J810134J526892J878321J647949O79195L16263O37233K12252
821.9H35504353q17299j010895o49929j072406j865626j597583q32677j083255j725435
$$ y = [775470853, 776494503, 777192533, 777748883, 778688669, 779731154, 780470192, 781280756, 782485306, 783748448, 784756303, 785758197, 786995590, 788185477, 789223075, 790391266, 791687310, 792823672, 793817520, 794896603, 795961201, 796731114, 797352314, 798233211, 799242020, 800033152, 800840318, 802014112, 803242028, 804118514, 804971218, 806145966, 807250321, 807990134, 808768213, 809752643, 810487926, 810833275, 811301172, 811993599, 812304795, 812186837, 812279642, 812556744, 812358141, 811801553, 811731696, 812250733, 812759578, 813501954, 815201461, 817476273, 819514394, 821593821, 824223518, 826796114, 828606248, 830133140, 832011461, 833659410, 834338605, 834654868, 835292101, 835504353, 834687054, 833676159, 833026230, 831953824, 830088198, 828490615, 827657938, 826574683, 824849248]
840.3H24849248j360953o26445p78317r68039J89841J710653K102315K299607L402233
858.7H30820143M081905L347755K686619L156066L277779J953602R77337J585543J909733
877H53796482P72715p0632M50552N48124o63519j180053l13639n5373q29935o28471
897.4H51826251P49468J059771N7042m8876R35256Q07822n96344j029194l43144p19547
917.8H52698505k005994j833558m66884k75314r49621l18289J006842P55727l37302
936.2H48274112k1577Q67903J96099r76443n33819K30551p89047k127766j725614j125336
956.6H42269063k342045l787041l506422l207684m750013o205380n707502n009353
972.9H07753623n554855n585671l997385k820015l313780l545642k340019j578748
$$ y = [824849248, 823488295, 822861850, 822083533, 821115494, 821305335, 823015988, 825118303, 827417910, 830820143, 834902048, 838249803, 840936422, 844092488, 847370267, 849323869, 850301206, 851886749, 853796482, 854569197, 854498565, 854949117, 855497241, 854833722, 853653669, 853340030, 853284657, 852454722, 851826251, 852575719, 853635490, 853692532, 853643656, 854578912, 855386734, 854790390, 853761196, 853418052, 852698505, 850692511, 848858953, 848392069, 848116755, 847167134, 846848845, 847855687, 848611414, 848274112, 848252535, 849120438, 849316537, 848340094, 847806275, 848036826, 847247779, 845120013, 843394399, 842269063, 839927018, 836139977, 832633555, 829425871, 824675858, 818470478, 812762976, 807753623, 802198768, 796613097, 792615712, 789795697, 786481917, 782936275, 780596256, 779017508]
989.2G79017508k228916k309203r67264k66254j033544j246632k33888j61886j657784
1007.5G68912137k428532j765967j827716l085912l278195k133728j967132k960145
1023.9G49464810k939046j817703j693189k531707k294004j151979j112521j974702
1040.2G33949959j769423q14915j128495k201259j960754q54969p37906j152754l75390
1058.5G22954094Q85070O38604n44906p52508n17667j454413k671241k422691j625359
1076.9G14488983k039611k811253k375365j697421k304077l049671k311826j173020
1093.2F96726739j133978j294374m35591L56316j80661q82328m35293M3869o80863
1111.6F92083836j441658j087964r79185k202987l003300j877188n80430n89431q1479
$$ y = [779017508, 776788592, 774479389, 773512125, 773245871, 772212327, 770965695, 770731807, 770569921, 768912137, 766483605, 764717638, 762889922, 759804010, 756525815, 754392087, 752424955, 749464810, 746525764, 744708061, 743014872, 740483165, 738189161, 737037182, 735924661, 733949959, 732180536, 731365621, 730237126, 728035867, 726075113, 725220144, 724482238, 723329484, 722954094, 723839164, 724477768, 723932862, 723180354, 722662687, 721208274, 718537033, 716114342, 714488983, 712449372, 709638119, 707262754, 705565333, 703261256, 700211585, 697899759, 696726739, 695592761, 694298387, 693862796, 694219112, 694038451, 693156123, 692720830, 692764699, 692083836, 690642178, 689554214, 688575029, 686372042, 683368742, 681491554, 680911124, 680321693, 680240214]
1129.9F80240214J501381J968861J131415R66549J921833K314448J441121Q89242J454592
1148.3F93829656J680910R02415O56902J565278K026558J508653J660168K977073L752411
1166.6G10560024L410399L575921M608869M807830L893793L583491M206776M099250
1182.9G42746353K945602K375960K600134K015889O49273K50339Q36015P76947J89066
1201.3G55385578O34074J801908J908183J071274J013518J594484J201272K19166L84748
1219.7G65214205J262307J059890K78234O37591J509428J249015N32628R62972J800478
1238G74506748J410305N61655Q16881J357973P23958j53482J92642P99299K95698k62975
1258.4G80248702M79459J419664J186371Q92222J731395K495110K038479J583159K212525
$$ y = [680240214, 681741595, 683710456, 684841871, 685808420, 687730253, 690044701, 691485822, 692375064, 693829656, 695510566, 696412981, 697069883, 698635161, 700661719, 702170372, 703830540, 706807613, 710560024, 713970423, 717546344, 722155213, 726963043, 730856836, 734440327, 738647103, 742746353, 745691955, 748067915, 750668049, 752683938, 753333211, 753583550, 754419565, 755196512, 755385578, 756019652, 757821560, 759729743, 760801017, 761814535, 763409019, 764610291, 764829457, 765214205, 766476512, 767536402, 767814636, 768452227, 769961655, 771210670, 771743298, 772706270, 774506748, 775917053, 776478708, 777295589, 778653562, 779377520, 779224038, 779416680, 780215979, 780511677, 780248702, 780728161, 782147825, 783334196, 784226418, 785957813, 788452923, 790491402, 792074561, 794287086]
1276.8G94287086K709031K095043J647413K309501K776802K138018J709700K296031
1293.1H11968625K505719J591802J019597J517355J629115P17163K74896Q74639R90867
1311.4H23089778J66178r4533O33896R21905K77757J27435Q73327R54569O7591j64687
1331.8H26853216M17351K71619o61671o44744L92080M93526k81572k90454L81410K23041
1352.2H27153802n77092n32985P4267l03566j241446r20057j78635o33240j420676
1370.6H21420372j472712j161218j516223l049016n071163n454600k300381K466201
1386.9H03861260M535556L144086Q45253p87198p64668l99828q30472j483679j431405
1405.3H06688905q42691j070618j479566r38714m48883j134038j602053l85344K49624
$$ y = [794287086, 796996117, 799091160, 800738573, 803048074, 805824876, 807962894, 809672594, 811968625, 814474344, 816066146, 817085743, 818603098, 820232213, 820949376, 821224272, 822098911, 823089778, 823255956, 823161423, 823795319, 824717224, 824994981, 825122416, 825995743, 826950312, 827017903, 826853216, 827270567, 827542186, 826880515, 826235771, 826627851, 827121377, 826839805, 826549351, 826930761, 827153802, 826576710, 826043725, 826117992, 825814426, 824572980, 823652923, 823474288, 822841048, 821420372, 819947660, 818786442, 817270219, 814221203, 809150040, 803695440, 801395059, 803861260, 808396816, 811540902, 812386155, 811598957, 810834289, 810434461, 809603989, 808120310, 806688905, 805846214, 804775596, 803296030, 802357316, 801908433, 800774395, 799172342, 798786998, 799036622]
1423.6G99036622j90377m91798j50144L90410J12176m02093N01573J361251Q78275
1442H01045895N26964R06229J297713J297474J350283J599848J795173K540290L244639
1460.3H15604508L128111K823234K580047K466499K484262K778888K871633K739489
1476.6H37476671K634108K019584J089096N34654L13103j42932l79086l4689k46883
1495H43263626j126110j398623p94292n80430k090752m080951j886607l97086j115381
1513.4H29793394k123714k131522j478970j703143j481294p99179n88298o58691j418948
1531.7H17409635j678467n81205q95023k703846j657605M03643M31120K265j8239K82943
1552.1H10995221M3273o65128j583040m45425Q20398m6313p26580j399756k069771
$$ y = [799036622, 798846245, 798354447, 798204303, 798594713, 798706889, 798304796, 798806369, 800167620, 801045895, 801572859, 802479088, 803776801, 805074275, 806424558, 808024406, 809819579, 812359869, 815604508, 818732619, 821555853, 824135900, 826602399, 829086661, 831865549, 834737182, 837476671, 840110779, 842130363, 843219459, 843754113, 844067216, 843924284, 843545198, 843510509, 843263626, 842137516, 840738893, 839944601, 839364171, 837273419, 833192468, 831305861, 830908775, 829793394, 827669680, 825538158, 824059188, 822356045, 820874751, 820075572, 819487274, 818828583, 817409635, 815731168, 815149963, 814254940, 811551094, 809893489, 810297132, 810728252, 810730517, 810712278, 810995221, 811038494, 810373366, 808790326, 808344901, 809165299, 809118986, 808392406, 806992650, 804922879]
1570.5H04922879j656115k105117l393650k908051k470434k906501l290475l800690
1586.8G82391846m134416m110277m223943m650950m695237m380941m461527m800260
1603.1G46934295m751683m550457m695475m752755m522323n125285n661487l728807
1619.4G09146023k888143l426135l022134k588272k068401j073897j113355j559376
1635.7F91406310K15411J836717K124965J982749K259910L719389L880024L267765
1652G10693240M871428N512536M570663M077077M278123M896224M442989L874183M464686
1670.4G51681149M730344M525840M704177M523635M044474L686785M634202N333960
1686.7G87864566M752576M556120L910184L526508L958881M208029M957258M660845
$$ y = [804922879, 803266764, 801161647, 797767997, 794859946, 792389512, 789483011, 786192536, 782391846, 778257430, 774147153, 769923210, 765272260, 760577023, 756196082, 751734555, 746934295, 742182612, 737632155, 732936680, 728183925, 723661602, 718536317, 712874830, 709146023, 706257880, 702831745, 699809611, 697221339, 695152938, 694079041, 692965686, 691406310, 691621721, 693458438, 695583403, 697566152, 699826062, 703545451, 707425475, 710693240, 715564668, 721077204, 725647867, 729724944, 734003067, 738899291, 743342280, 747216463, 751681149, 756411493, 760937333, 765641510, 770165145, 774209619, 777896404, 782530606, 787864566, 792617142, 797173262, 801083446, 804609954, 808568835, 812776864, 817734122, 822394967]
1703H22394967L866971L855705L466248K812386K290964J787722J785517K513826K569318
1721.4H47343624K033770J635313J351475J270473J055062P68304J396895J661181
1737.7H58516097J308560J206637J289964J295030J133978J005828J361609J470566
1754H68588269J023590O54757N35965P54834J005232O19173J82450J26600K75671O97732
1774.4H74464273Q60036P15196N28932L62038L69847N97775L99411k78771j39535P22051
1794.8H78601253O89030J18971J23918N91457N45203J05739k39L33310M64797J93238
1815.2H81766677J40965L82423K14160k46227j38342K35974J16229J79232M81307M03285
1835.6H83535683J02759r7752j47522o6638J93477K71380L26693L89099Q1301j87218
$$ y = [822394967, 826261938, 830117643, 833583891, 836396277, 838687241, 840474963, 842260480, 844774306, 847343624, 849377394, 851012707, 852364182, 853634655, 854689717, 855458021, 856854916, 858516097, 859824657, 861031294, 862321258, 863616288, 864750266, 865756094, 867117703, 868588269, 869611859, 870266616, 870802581, 871557415, 872562647, 873181820, 873364270, 873490870, 873766541, 874464273, 875324309, 876039505, 876568437, 876930475, 877300322, 877898097, 878297508, 878018737, 877879202, 878601253, 879290283, 879409254, 879533172, 880124629, 880669832, 880775571, 880775332, 881108642, 881573439, 881766677, 881907642, 882290065, 882504225, 882257998, 882119656, 882355630, 882471859, 882651091, 883132398, 883535683, 883638442, 883540690, 883393168, 883326530, 883520007, 883791387, 884118080, 884507179, 884588480, 884401262]
1856H84401262N7280L49760J27077j99258k29895j27554M6730K06709L18586L15607
1876.4H85266304L1054j60396N9307J87993j46807l82423Q9765M09662M471j61827
1896.8H85197103J57118J87516j75297k68936O0260J91033o5625j29640M4763o0797
1917.2H85137498l03089k11060J53482K81453m8161j70350Q1301N2392k62379k19703
1937.6H84491384P0751l8445k91586j11103J66952K9862l08692k40564J03414N8472
1958H83930445k65122k19881L0756j22190l70383j35720J72556L4690k30074j32740
1978.4H82692337O1214r9719l52680k16961N8055o8784k72155p0095R7692j14500k95520
2000.8H81418884j18733P0811q5473k56658r8050L4094j86860l50178j16586P0929
$$ y = [884401262, 884458542, 884808302, 884935379, 884736121, 884506226, 884378672, 884425402, 884632111, 884950697, 885266304, 885297358, 885136962, 885196269, 885384262, 885237455, 884855032, 884944797, 885354459, 885358930, 885197103, 885354221, 885541737, 885366440, 885097504, 885157764, 885348797, 885283172, 885153532, 885198295, 885137498, 884834409, 884623349, 884776831, 885058284, 885010123, 884839773, 884921074, 884973466, 884711087, 884491384, 884562135, 884523690, 884232104, 884121001, 884287953, 884317815, 884009123, 883768559, 883871973, 883930445, 883665323, 883445442, 883476198, 883354008, 882983625, 882847905, 883020461, 883055151, 882825077, 882692337, 882753551, 882653832, 882301152, 882084191, 882142246, 882073462, 881801307, 881731212, 881828904, 881714404, 881418884, 881300151, 881370962, 881285489, 881028831, 880930781, 880964875, 880778015, 880427837, 880311251, 880382180]
2021.2H80382180o6459j84417r0182l2901j56880k10523m6492M8101r8705j76311k9981
2043.6H79337430J8120j57058k07067r179R3460m3631j26898j6749J2636j32918j57058
2066.1H78611088J8477R0599k0921q7261r298M8100l0398p0989L6359J08898K0504
2088.5H78715158n8592J3411O1691k5213o0975M1365J20282P6652n36p093K5212m589
2113H78896773l3319M8756J30177Q2254l874L0577J05262M6790l8266L7252J54257
2135.4H79456639J02938j6809j8001O7056R2208M4763P7844J69098J18673j8954j3054
2157.9H80062401J05024R9063j3233K3783J72555J45137k1815j7762J36912J11818
2178.2H80803883l2604M3452K10285J29581n6744l4332R9361M7147q8036J8299J97768
$$ y = [880382180, 880315721, 880131304, 880041122, 880008221, 879851341, 879640818, 879594326, 879642427, 879543722, 879367411, 879337430, 879355550, 879198492, 878991425, 878982246, 879075706, 879032075, 878905177, 878888428, 878901064, 878768146, 878611088, 878629565, 878720164, 878699243, 878611982, 878602684, 878650784, 878620386, 878549397, 878585756, 878694654, 878715158, 878656566, 878669977, 878731668, 878706455, 878645480, 878686845, 878807127, 878883779, 878883243, 878876150, 878901362, 878896773, 878863454, 878912210, 879042387, 879124641, 879120767, 879151344, 879256606, 879303396, 879265130, 879302382, 879456639, 879559577, 879542768, 879524767, 879591823, 879684031, 879728794, 879806638, 879975736, 880094409, 880075455, 880062401, 880167425, 880266488, 880253255, 880277038, 880449593, 880594730, 880572915, 880555153, 880692065, 880803883, 880771279, 880814731, 881025016, 881154597, 881097853, 881063521, 881162882, 881210029, 881121993, 881140292, 881338060]
2200.7H81338060Q1420j01626J1206J73330K8312j68264q583K20060R4176j13905k1100
2223.1H81533086J43826J1981j73628k3425J73449L2723j27017K1756J35839n3049
2243.5H81675541j65820L9995J66833l3438j96457l5822J07050o9082j55151R7633
2263.9H81431282K00271n9843j98662J6093J67370o0q5354J54078K36214p4745k55525
2286.3H81531119n6803L4630k31564l40223m3154M7207k96116m37736k21849k28643
2306.7H79756868n67317o16551k41279j53721o02364r08315o97732n04673n96463n72205
2327.1H74296248l61383k99454m52876m80473k73466k48849l49820K08557J475513
2345.5H73513997J771628M00365j240492j913726j743019j407564o50763K48730O72936
$$ y = [881338060, 881419480, 881317854, 881329060, 881502390, 881530702, 881362438, 881353855, 881573915, 881668091, 881554186, 881533086, 881676912, 881688893, 881515265, 881491840, 881665289, 881698012, 881570995, 881592751, 881728590, 881675541, 881509721, 881549716, 881716549, 881683111, 881486654, 881450832, 881557882, 881488800, 881333649, 881431282, 881631553, 881571710, 881373048, 881389141, 881556511, 881556451, 881471097, 881625175, 881861389, 881786644, 881531119, 881474316, 881508946, 881277382, 880937159, 880894005, 880941212, 880645096, 880207360, 879985511, 879756868, 879189551, 878573000, 878331721, 878178000, 877575636, 876667321, 875969589, 875464916, 874868453, 874296248, 873934865, 873635411, 873182535, 872702062, 872428596, 872179747, 871829927, 872038484, 873513997, 875285625, 875685990, 874445498, 872531772, 870788753, 869381189, 868730426, 868979156, 869652092]
2363.8H69652092Q68917J281738J630485J532615J381337J555622J640022J301467
2380.2H80844295Q95619P61271O46412K63393m9770P7546K50936M3571j76788j5795
2400.6H83540690J49786m0948j72138N0247J92225n782j67668j8656J28627l4094j95146
2423H83427143k7358J49369J2755j15216L8386J17957n9187j22607P3970J58071l7134
2445.4H83616149j49488J669O2227j17898j56760N0068J14202p7307j34528L9161N3167
2467.9H83300662j32382j57118M6969J04785j08481j81555k39L3498j49369j37508
2488.3H82619262J01089Q8871j67191j84477R895K1875j21653q5354P1048K0683j56224
2510.7H82217824j43826J3471J729j29044q4699N9128J9252j60157j62065Q464J0848
$$ y = [869652092, 870521009, 871802747, 873433232, 874965847, 876347184, 877902806, 879542828, 880844295, 881739914, 882501185, 883147597, 883410990, 883361220, 883438766, 883689702, 883733273, 883556485, 883540690, 883690476, 883649528, 883477390, 883527637, 883719862, 883714080, 883546412, 883527756, 883656383, 883622289, 883427143, 883399785, 883549154, 883561909, 883446693, 883485079, 883603036, 883543849, 883421242, 883495212, 883653283, 883616149, 883466661, 883468330, 883530557, 883412659, 883255899, 883305967, 883420169, 883342862, 883208334, 883247495, 883300662, 883168280, 883011162, 883058131, 883162916, 883054435, 882872880, 882872641, 882906139, 882756770, 882619262, 882720351, 882809222, 882642031, 882457554, 882467449, 882489324, 882367671, 882282317, 882353365, 882374048, 882217824, 882073998, 882087469, 882089198, 881960154, 881875455, 881934583, 881953835, 881793678, 881631613, 881640077, 881650925]
2533.1H81650925j31548r7036O2644L2723j53601j61886P927K7359j13011j04129L1889
2555.6H81052256o915j49726j32561k1100m0174j40845r4593L4511k1040j71483j38521
2578H80169809m7982j25468k11417j12474J1444n6863j75834j48058q6486j49608k35557
2600.4H78831506j64092m1544r3043k33829k23518j13010j25349k03490j54316p4744
2620.8H77404571j44244k32756j58489p9035j70887k79546j95920m3571r9421k56300
2641.2H75744402k22027j19924j89722k66314j44839k4378j50263k96236j79946m7564
2661.6H74103189j49966k35736j11461l4034j68264k67327j41620j7524j49489l25083
2682H72502685k35856q0883j76967l12447k08497j11461k44677l13222j21713J79j59264
$$ y = [881650925, 881519377, 881422341, 881484985, 881517708, 881364107, 881202221, 881210148, 881237507, 881124496, 881020367, 881052256, 881045341, 880895615, 880763054, 880741954, 880701780, 880560935, 880466342, 880500853, 880479813, 880308330, 880169809, 880121827, 879996359, 879784942, 879672468, 879683912, 879627049, 879451215, 879303157, 879216671, 879067063, 878831506, 878667414, 878625870, 878532827, 878298998, 878075480, 877962470, 877837121, 877633631, 877479315, 877404571, 877260327, 877027571, 876869082, 876790047, 876619160, 876339614, 876143694, 876100123, 876000702, 875744402, 875522375, 875402451, 875212729, 874946415, 874801576, 874777198, 874626935, 874330699, 874150753, 874103189, 873953223, 873717487, 873606026, 873571992, 873403728, 873136401, 872994781, 872977257, 872827768, 872502685, 872266829, 872185946, 872008979, 871696532, 871488035, 871376574, 871131897, 870818675, 870696962, 870697141, 870537877]
2704.5H70537877l10302k35736j68383k71499l02494j57118o9618j71423k62380j46985
2724.8H68441939j22547l46482l89278j78515r6143k31743l19182k08557j09375j44064
2745.2H66296053j61648j36793j92523k98798l03089k04087k23338l68059l12984q8990
2765.6H64005744o5207k49565l07262k00092k77818m86791m07636j69456j90854l45588
2786H61305475l12805k34067l56198n00083l78787k15709l47674n50628n29945l81350
2806.4H57498229l61801n16832n33938l65555l85523n75900n80013m43458m92991o52968
2826.8H52589250n90682m54188o03020q34167q21352q93593j328170j708090j736224
2845.2H43619764j654208j602411j282752o42180k08140k06649l32236l72589m38750
$$ y = [870537877, 870227575, 869991839, 869823456, 869551957, 869249463, 869092345, 869022727, 868851304, 868588924, 868441939, 868319392, 867972910, 867583632, 867405117, 867308974, 867077231, 866758049, 866549492, 866440117, 866296053, 866134405, 865997612, 865805089, 865506291, 865203202, 864999115, 864775777, 864407718, 864094734, 864005744, 863940537, 863690972, 863383710, 863183618, 862905800, 862419009, 862011373, 861841917, 861651063, 861305475, 860992670, 860758603, 860402405, 859902322, 859523535, 859307826, 858960152, 858409524, 857879579, 857498229, 857136428, 856619596, 856085658, 855720103, 855334580, 854758680, 854178667, 853735209, 853242218, 852589250, 851998568, 851544380, 850941360, 850107193, 849285841, 848392248, 847064078, 845355988, 843619764, 841965556, 840363145, 839080393, 838438213, 838230073, 838023424, 837691188, 837318599, 836879849]
2863.5H36879849p05182r58741q61823o11663o64830q54433p04348n00322o05821o91772
2883.9H29720914n93245n98490p84397q37207o53922o49989r49562j050830q69333
2902.3H22733939q81017j130223j223087j116991j236022j657366j816273j496554
2918.6H12176406j164913r46343n57482n1498J78396K8670j967L04818N59867O59883
2939H11185837Q82089J100063Q94249M09722J98543K64466O4969k98679k24590J40667
2959.4H14617336K63870J57833J77264L23832L43799L40879M68314N06103L85940K46644
2979.8H17831814R1255l8743n8711O6638L01719K79904j27972l36349k86042l91007
3000.2H17332506n26547n47827m32431k12074j50740l18348n23031p15017q97289q95440
$$ y = [836879849, 836174667, 835215926, 834354103, 833742440, 833077610, 832223177, 831518829, 831018507, 830412686, 829720914, 829127669, 828529179, 827744782, 826907575, 826253653, 825603664, 824654102, 823603272, 822733939, 821852922, 820722699, 819499612, 818382621, 817146599, 815489233, 813672960, 812176406, 811011493, 810065150, 809507668, 809456170, 809634566, 809663236, 809661269, 809966087, 810525954, 811185837, 812067926, 813167989, 814062238, 814471960, 814670503, 814934969, 814999938, 814701259, 814476669, 814617336, 814881206, 815039039, 815216303, 815540135, 815883934, 816224813, 816693127, 817199230, 817585170, 817831814, 817923069, 817884326, 817825615, 817892253, 818193972, 818473876, 818345904, 818009555, 817723513, 817332506, 816805959, 816258132, 815825701, 815613627, 815462887, 815144539, 814621508, 813906491, 813009202, 812113762]
3020.6H12113762o76155n94855p64071p98226o21319n67317q32855j019061p20203
3038.9H05519700m92811p75576j103341j121521r83417r43542r86636r62674j015902
3057.3G97134280j144886j038670q07822q01563j007915j130581j030862q87752p62284
3075.6G88521945o55651q01980j094341j188219j137733j050055j038313j204789j300335
3094G79050529j191258j060486j048386j143515j174450j079142j066566j205921j218796
3112.4G68862009j055241j032114j209795j505554j771390j700819j412093j292587
3128.7G57882416j450717j590669j429081j237214j353145j664578j802207j732647
3145G45622158j669824j492679j309753j555204j978397k009154j817524j792371j865685
$$ y = [812113762, 811437607, 810842752, 810078681, 809280455, 808659136, 808091819, 807258964, 806239903, 805519700, 805026889, 804251313, 803147972, 802026451, 801043034, 800099492, 799112856, 798150182, 797134280, 795989394, 794950724, 794142902, 793341339, 792333424, 791202843, 790171981, 789284229, 788521945, 787866294, 787064314, 785969973, 784781754, 783644021, 782593966, 781555653, 780350864, 779050529, 777859271, 776798785, 775750399, 774606884, 773432434, 772353292, 771286726, 770080805, 768862009, 767806768, 766774654, 765564859, 764059305, 762287915, 760587096, 759175003, 757882416, 756431699, 754841030, 753411949, 752174735, 750821590, 749157012, 747354805, 745622158, 743952334, 742459655, 741149902, 739594698, 737616301, 735607147, 733789623, 731997252, 730131567]
3163.4G30131567j853526j803339j853704j904428j861990j872301j968026j973629
3179.7G15040624j908302j931429j995444j997829j978397j998663k075315k145171
3196F99010074k083719j966297j974583k032161k023041k020121k035439k002179j942277
3214.3F80930257j930952j974285j992404j982510j990378j982928j868546j669168
3230.7F65539086j632869j871705k042711j919627j771331j723588j613080j520694
3247F51443481j613736j691222j583338j484513j543403j600027j531362j454711j418770
3265.3F37522399j296520j169264j329661j620829j707613j641750j573682j577020
3281.6F25606060j592517j554847j524210j480996j483739j653492j863420j984537
$$ y = [730131567, 728278041, 726474702, 724620998, 722716570, 720854580, 718982279, 717014253, 715040624, 713132322, 711200893, 709205449, 707207620, 705229223, 703230560, 701155245, 699010074, 696926355, 694960058, 692985475, 690953314, 688930273, 686910152, 684874713, 682872534, 680930257, 678999305, 677025020, 675032616, 673050106, 671059728, 669076800, 667208254, 665539086, 663906217, 662034512, 659991801, 658072174, 656300843, 654577255, 652964175, 651443481, 649829745, 648138523, 646555185, 645070672, 643527269, 641927242, 640395880, 638941169, 637522399, 636225879, 635056615, 633726954, 632106125, 630398512, 628756762, 627183080, 625606060, 624013543, 622458696, 620934486, 619453490, 617969751, 616316259, 614452839, 612468302]
3298F12468302j953304j740813j561224j735807k156973k391636k395272k324879k240003
3316.3E93968391k197682k213657k237797k271652k447546k628505k567351k432823
3332.6E74971378k386332k352297k422631k619743k737701k783060k688885k430737
3348.9E54549992k492309k881407l034890k850711k626956k605557k627611k403915
3365.3E33026636k210975k467513k899706k861500k419412k152324k082467j995445
3381.6E13937294j890480j716197j367688j008689j088500j499772j491428r23574
3397.9E02950966n94854j024425j473308j187861p38054o18816o20007p19786p75039
3416.3D95198816n63711l31253k03371J8746L23802N30332N05388N16147P23242O98656
$$ y = [612468302, 610514998, 608774185, 607212961, 605477154, 603320181, 600928545, 598533273, 596208394, 593968391, 591770709, 589557052, 587319255, 585047603, 582600057, 579971552, 577404201, 574971378, 572585046, 570232749, 567810118, 565190375, 562452674, 559669614, 556980729, 554549992, 552057683, 549176276, 546141386, 543290675, 540663719, 538058162, 535430551, 533026636, 530815661, 528348148, 525448442, 522586942, 520167530, 518015206, 515932739, 513937294, 512046814, 510330617, 508962929, 507954240, 506865740, 505365968, 503874540, 502950966, 502356112, 501331687, 499858379, 498670518, 497932464, 497313648, 496693641, 495973855, 495198816, 494635105, 494303852, 494100481, 494119227, 494443029, 494973361, 495478749, 495994896, 496718138, 497416794]
3436.6D97416794L60042K89589O97911J119673J256764J259327J342178J455664J568556
3455E06766498J798093J983166J836956J800418K234459K484858K070426J503706J527846
3473.4E24006426J980007K357125K338708J997888J969337K247274K266705K169252
3489.7E41332722K321005K506494K534926K452970K406358K407849K294719K172113
3506E60429156K284169K606928K898217K813458K492189K486766K765596K970099K836526
3524.4E84583104K574741K640129K929628L123819L222049L209531L116310L242492
3540.7F08641803L373981L204405K995730L028750L142774L311396L497243L559231
3557F34755313L609419L622055L338695K937376L463269M475474M391909L904521L865957
$$ y = [497416794, 497776836, 498066425, 498764336, 499884009, 501140773, 502400100, 503742278, 505197942, 506766498, 508564591, 510547757, 512384713, 514185131, 516419590, 518904448, 520974874, 522478580, 524006426, 525986433, 528343558, 530682266, 532680154, 534649491, 536896765, 539163470, 541332722, 543653727, 546160221, 548695147, 551148117, 553554475, 555962324, 558257043, 560429156, 562713325, 565320253, 568218470, 571031928, 573524117, 576010883, 578776479, 581746578, 584583104, 587157845, 589797974, 592727602, 595851421, 599073470, 602283001, 605399311, 608641803, 612015784, 615220189, 618215919, 621244669, 624387443, 627698839, 631196082, 634755313, 638364732, 641986787, 645325482, 648262858, 651726127, 656201601, 660593510, 664498031, 668363988]
3575.3F68363988M037917M248798M512787M406154L844440L796279M544616M634559
3591.7G02389538M317820M443467M676044M669964M694224M542708M016101L960610
3608G37710476M358292M392921M364849M092812L845513M530132M841626M014849K818525
3626.3G74969995K692163M193723M429639L843367L529608L249526L139615L004491
3642.6H03052127K369762J508117J724124L206849L245651K310217K373576K687156
3659H22477579K120137J561523J369297Q43466M02033R88126Q75413L78549J433432
3677.3H32449555K084434J795948J444876Q83222J53780N9664J018107J632035J449406
3695.7H42971027R79483N00560M96983R67324Q70407J49369l81231K34067J304150
$$ y = [668363988, 672401905, 676650703, 681163490, 685569644, 689414084, 693210363, 697754979, 702389538, 706707358, 711150825, 715826869, 720496833, 725191057, 729733765, 733749866, 737710476, 742068768, 746461689, 750826538, 754919350, 758764863, 763294995, 768136621, 772151470, 774969995, 777662158, 781855881, 786285520, 790128887, 793658495, 796908021, 800047636, 803052127, 805421889, 806930006, 808654130, 811860979, 815106630, 817416847, 819790423, 822477579, 824597716, 826159239, 827528536, 828372002, 828774035, 829762161, 830637574, 831016123, 832449555, 834533989, 836329937, 837774813, 838658035, 838811815, 838871479, 839889586, 841521621, 842971027, 843950510, 844451070, 844948053, 845915377, 846785784, 846935153, 846553922, 846787989, 848092139]
3714H48092139J154303M06325o139k3902P8738L72052O41048K68162l93212l56555
3734.4H50232959O87897J327693N51224p85172q65280L15666M6551l18706Q89838J354158
3754.8H53436828N67019O6518L87669M77910J46687m9591n3883L44635O62982L38316
3775.2H56325090j22011j36494J29342J28746J42157K85089K37703J05143j38641l44038
3795.6H56612086k91526m96447l43382L96311K28762J95623P14064M53889m02987p11441
3816H56354952l47555l75211Q2135O55949M10557J93596P272r3997n5253m14193o03974
3838.4H55814278k8491N45621Q67367P36117P212j143992j833915n9009J460373Q90196
3858.8H57255757n5015n47827j79648R1732k64407j41024L11315N28037L42429k33889
$$ y = [848092139, 849246442, 849652767, 849646628, 849622726, 849701464, 850073516, 850714564, 850982726, 850589514, 850232959, 850920856, 852248549, 852799773, 852014601, 851149321, 851464987, 851511538, 851192832, 852082670, 853436828, 854003847, 854070365, 854458034, 854935944, 855082631, 855033040, 854979157, 855323792, 855986774, 856325090, 856203079, 856066585, 856195927, 856324673, 856466830, 856751919, 856989622, 857094765, 856956124, 856612086, 856320560, 855824113, 855480731, 855877042, 856105804, 856301427, 857015491, 857469380, 857066393, 856354952, 856007397, 855632186, 855714321, 856370270, 856780827, 856974423, 856981695, 856887698, 856832445, 856418252, 855814278, 855785787, 856331408, 857198775, 857934892, 857942104, 856798112, 854964197, 854905188, 856365561, 857255757, 857200742, 856652915, 856473267, 856564999, 856300592, 856159568, 856470883, 856998920, 857341349, 857107460]
3879.2H57107460j56104J60992O3956J30355j20222k85745K64704L75390k08914o00815
3899.6H56731057n07712j55390M42505P46608N02527J78873j40845m01140k20358Q4221
3920H57260346l993r3281J29521J49190j13726q4638J84893K17021L0517j49309j16647
3942.5H57409894R2388P6055o2167N4895K03252J22786J3411l7611j10030j8000J55508
3964.9H57900381R8407k9981p689M6313L2783M2915R0182J29401J16349r597j08122
3987.3H58301342k8730P5936K4975n5254j4484
3997.5H58303785
$$ y = [857107460, 856951356, 857112348, 857176304, 857306659, 857186437, 856900692, 857165396, 857540786, 857331872, 856731057, 856223345, 856067955, 856510460, 857257068, 857759595, 857938468, 857797623, 857396483, 857176125, 857260346, 857256353, 857163072, 857292593, 857441783, 857328057, 857243419, 857428312, 857645333, 857675850, 857526541, 857409894, 857502282, 857578337, 857516170, 857571065, 857774317, 857897103, 857910514, 857872903, 857762873, 857744873, 857900381, 857998788, 857968807, 857961118, 858007431, 858040214, 858083129, 858173311, 858302712, 858419061, 858409464, 858301342, 858272612, 858348548, 858373523, 858318269, 858303785]
##END=$$ End of the data block
