##TITLE=$$ Begin of the data block
##JCAMP-DX=5.00 $$ ACD/SpecManager v 10.08
##SPECTROMETER/DATA SYSTEM=Alpha
##DATE=07 Apr 2014 11:14:18
##DATA TYPE=INFRARED SPECTRUM
##DATA CLASS=XYDATA
##ORIGIN=
##OWNER=
##NPOINTS=1765
##FIRSTX=399.75695801
##LASTX=3997.56933594
##MAXX=3997.56933594
##MINX=399.75695801
##MAXY=0.88545185
##MINY=0.49418005
##XFACTOR=1.0000000000
##YFACTOR=1.000000000000000e-9
##FIRSTY=0.77205980
##DELTAX=2.03957629
##XUNITS=1/CM
##YUNITS=ARBITRARY UNITS
##XYDATA=(X++(Y..Y))
$$ plain form
399.8 772059798 768624961 770023882 771401286 768224835 765982091 768228292 769026995 765845239 764663935
418.1 764663935 767445982 766425371 762480497 762400270 765069604 763985991 760858774 761957407 764343977
436.5 764343977 762353361 760198414 762238920 763468981 760486603 758943677 761513531 762329936 759336054
454.8 759336054 758566737 761105418 760599852 757554770 757527947 759498179 758406818 755993128 756956995
473.2 756956995 758594036 756685913 754451036 755617559 756895661 755153477 753926694 755536914
489.5 755536914 756188452 754112720 753393888 755052567 754718721 751719773 750774026 752272487 751964331
507.9 751964331 749994457 750001013 751165628 749948919 747655392 747891366 748838425 747329593 745368183
526.2 745368183 745826960 746306598 744335711 742603302 743388236 743758440 741788566 740526140 741471469
$$ packed form
399.8G72059798l434837J398921J377404l176451k242744K246201P98703l181756j181304
418.1G64663935K782047j020611l944874q0227K669334j083613l127217J098633K386570
436.5G64343977j990616k154947K040506J230061k982378j542926K569854Q16405k993882
454.8G59336054p69317K538681n05566l045082k6823J970232j091361k413690R63867
473.2G56956995J637041j908123k234877J166523J278102j742184j226783J610220
489.5G55536914O51538k075732p18832J658679l33846k998948r45747J498461l08156
507.9G51964331j969874O556J164615j216709k293527K35974R47059j508832j961410
526.2G45368183M58777M79638j970887j732409P84934L70204j969874j262426R45329
$$ plain form
544.6 741471469 741556525 739642799 738750160 739602864 739211738 737301171 736780524 737388670 736203849
562.9 736203849 733848751 733329654 733872592 732631683 730634034 730312586 730405092 728802681 727115691
581.3 727115691 727373540 727703631 726169348 724623919 724752188 724825203 723532498 722497404 722531617
599.6 722531617 721861362 719858348 718462408 718320191 717738330 716377020 716004014 716976404 717814326
618 717814326 718592346 720713437 723699212 725793839 727261245 729599178 732363105 734127104 735435605
636.3 735435605 737519681 739583611 740392208 740846038 742386162 744315982 745330632 745916128 747032762
654.7 747032762 748514652 750128210 752336979 755124450 757121086 757387102 758143604 760935843 763212323
673.1 763212323 764448583 765771270 767544627 768990874 769976795 771249890 772852838 773980439 774567068
$$ packed form
544.6G41471469Q5056j913726q92639Q52704l91126j910567n20647O08146j184821
562.9G36203849k355098n19097N42938j240909j997649l21448R2506j602411j686990
581.3G27115691K57849L30091j534283j545429J28269P3015j292705j035094L4213
599.6G22531617o70255k003014j395940j42217n81861j361310l73006R72390Q37922
618G17814326P78020K121091K985775K094627J467406K337933K763927J763999J308501
636.3G35435605K084076K063930Q08597M53830J540124J929820J014650N85496J116634
654.7G47032762J481890J613558K208769K787471J996636K66016P56502K792239K276480
673.1G63212323J236260J322687J773357J446247R85921J273095J602948J127601N86629
$$ plain form
691.4 774567068 775352597 776392579 777127981 777693689 778586447 779600799 780329049 781103730 782329261
709.8 782329261 783659399 784716189 785737932 786913037 787984192 788971722 790163398 791518748 792725861
728.1 792725861 793692529 794713140 795809507 796586692 797153950 798031330 799113393 799965024 800740361
746.5 800740361 801814735 802988350 803914964 804811656 805953562 807015538 807767570 808600008 809601486
764.8 809601486 810301960 810643137 811170816 811926603 812246382 812110186 812149465 812309384 812060714 811547279
785.2 811547279 811514139 812079549 812597275 813236952 814828038 817116618 819218755 821313918 823990345
803.6 823990345 826675415 828563869 830075622 831872463 833455384 834133863 834461153 835100114 835337043
821.9 835337043 834500849 833423018 832785547 831765711 829891384 828255236 827390254 826269925 824524462
$$ packed form
691.4G74567068P85529J039982P35402N65708Q92758J014352P28250P74681J225531
709.8G82329261J330138J056790J021743J175105J071155R87530J191676J355350J207113
728.1G92725861R66668J020611J096367P77185N67258Q77380J082063Q51631P75337
746.5H00740361J074374J173615R26614Q96692J141906J061976P52032Q32438J001478
764.8H09601486P00474L41177N27679P55787L19779j36196L9279J59919k48670n13435
785.2H11547279l3140N65410N17726O39677J591086K288580K102137K095163K676427
803.6H23990345K685070J888454J511753J796841J582921O78479L27290O38961K36929
821.9H35337043q36194j077831o37471j019836j874327j636148q64982j120329j745463
$$ plain form
840.3 824524462 823235691 822746754 822061360 821160495 821420074 823121965 825132310 827301025 830583513
858.7 830583513 834632397 838008344 840714157 843849897 847125173 849134624 850143313 851711273
875 851711273 853582442 854314685 854253590 854744136 855292678 854602158 853398502 853083611 853081346 852323830
895.4 852323830 851708353 852412462 853429794 853481114 853484333 854465783 855209470 854502261 853454649 853174686
915.8 853174686 852506995 850546777 848752439 848258972 847915232 846922576 846629560 847705483 848459125
934.1 848459125 848017693 847888172 848710656 848920405 847973645 847461283 847734928 847025931 844969690 843230128
954.5 843230128 842006981 839588881 835795462 832314372 829130709 824370146 818148613 812493622
970.8 812493622 807555497 802001119 796387076 792401314 789606154 786275327 782702744 780390978
$$ packed form
840.3H24524462j288771m88937o85394r00865K59579J701891K010345K168715L282488
858.7H30583513M048884L375947K705813L135740L275276K009451J008689J567960
875H51711273J871169P32243o1095M90546N48542o90520j203656l14891k265p57516
895.4H52323830o15477P04109J017332N1320L219R81450P43687p07209j047612k79963
915.8H53174686o67691j960218j794338m93467l43740r92656k93016J075923P53642
934.1H48459125m41432j29521Q22484K09749r46760n12362K73645p08997k056241j739562
954.5H43230128j223147k418100l793419l481090l183663m760563o221533n654991
970.8H12493622m938125n554378n614043l985762k795160l330827l572583k311766
$$ plain form
987.1 780390978 778867185 776672184 774378359 773406327 773097515 772010863 770730913 770446658 770213664
1005.5 770213664 768520057 766116023 764388144 762564421 759480774 756228626 754113615 752158284
1021.8 752158284 749222040 746323347 744538367 742804110 740179658 737845480 736721992 735648036
1038.1 735648036 733708620 731974721 731185555 730101943 727943778 725990355 725117087 724331260 723153055
1056.5 723153055 722815812 723744333 724382460 723818660 723062098 722534299 721063972 718409300 716015577
1074.8 716015577 714391589 712331235 709512174 707158089 705479205 703167915 700087845 697762668
1091.2 697762668 696627021 695521653 694208205 693764508 694166183 694033802 693158507 692715168 692745149
1109.5 692745149 692045391 690611362 689556897 688579082 686337471 683315158 681427419 680804193 680176497
$$ packed form
987.1G80390978j523793k195001k293825r72032l08812j086652j279950k84255k32994
1005.5G70213664j693607k404034j727879j823723l083647l252148k115011j955331
1021.8G52158284k936244k898693j784980j734257k624452k334178j123488j073956
1038.1G35648036j939416j733899p89166j083612k158165j953423q73268p85827j178205
1056.5G23153055l37243R28521O38127n63800p56562n27799j470327k654672k393723
1074.8G16015577j623988k060354k819061k354085j678884k311290l080070k325177
1091.2F97762668j135647j105368j313448m43697M01675j32381q75295m43339K9981
1109.5F92745149o99758j434029j054465r77815k241611l022313j887739o23226o27696
$$ plain form
1127.9 680176497 680130541 681718349 683729351 684847116 685780644 687652469 689926028 691369534 692255676
1146.2 692255676 693667352 695323706 696256220 696956635 698521972 700534225 702067614 703760266 706705987
1164.6 706705987 710387349 713785589 717378438 721959352 726721048 730599880 734223008 738482356
1180.9 738482356 742579043 745481491 747828722 750437081 752480268 753131211 753369808 754230320 755031765
1199.3 755031765 755190134 755796432 757613838 759522378 760579765 761607766 763217390 764406919 764620543
1217.6 764620543 765018344 766271174 767313957 767612576 768284798 769819379 771088243 771625221 772577584
1236 772577584 774370909 775779545 776338935 777172983 778547585 779274881 779152095 779360831 780114532
1254.3 780114532 780364275 780104518 780598462 782011628 783188522 784082472 785821855 788317323 790350974
$$ packed form
1127.9F80176497m5956J587808K011002J117765R33528J871825K273559J443506Q86142
1146.2F92255676J411676J656354R32514P00415J565337K012253J533389J692652K945721
1164.6G06705987L681362L398240L592849M580914M761696L878832L623128M259348
1180.9G38482356M096687K902448K347231K608359K043187O50943K38597Q60512Q01445
1199.3G55031765J58369O06298J817406J908540J057387J028001J609624J189529K13624
1217.6G64620543L97801J252830J042783K98619O72222J534581J268864N36978R52363
1236G72577584J793325J408636N59390Q34048J374602P27296j22786K08736P53701
1254.3G80114532K49743k59757M93944J413166J176894Q93950J739383K495468K033651
$$ plain form
1272.7 790350974 791932344 794136882 796813309 798874021 800525725 802871525 805680156 807816803
1289 807816803 809505284 811799884 814317882 815913796 816947103 818484604 820111334 820820510 821104825
1307.4 821104825 821997762 823008239 823197722 823144495 823812306 824703276 824936032 825057030 825910389 826836467
1327.8 826836467 826914966 826801240 827275515 827574074 826914072 826262474 826618493 827061355 826782644 826533318
1348.1 826533318 826926470 827139616 826557338 826028585 826118827 825824440 824567080 823608339 823404908 822784662
1368.5 822784662 821395755 819956243 818799019 817245841 814148903 809049070 803613842 801359236
1384.9 801359236 803846419 808358073 811479151 812348664 811604321 810850441 810427964 809563100 808057845
1403.2 808057845 806612253 805750072 804670990 803198993 802282810 801891327 800821364 799216211 798800528
$$ packed form
1272.7G90350974J581370K204538K676427K060712J651704K345800K808631K136647
1289H07816803J688481K294600K517998J595914J033307J537501J626730P09176K84315
1307.4H21104825Q92937J010477J89483n3227O67811Q90970K32756J20998Q53359R26078
1327.8H26836467P8499j13726M74275K98559o60002o51598L56019M42862k78711k49326
1348.1H26533318L93152K13146n82278n28753R0242k94387j257360r58741k03431o20246
1368.5H22784662j388907j439512j157224j553178l096938n099833n435228k254606
1384.9H01359236K487183M511654L121078Q69513p44343p53880m22477q64864j505255
1403.2H08057845j445592q62181j079082j471997r16183l91483j069963j605153m15683
$$ plain form
1421.6 798800528 799049258 798872828 798394620 798238993 798610330 798722208 798324585 798772097 800065756
1439.9 800065756 800924301 801466465 802405834 803725839 805013776 806355536 807974696 809813023 812363029
1458.3 812363029 815563023 818664968 821493328 824051976 826511204 829089642 831992209 834856331
1474.6 834856331 837524056 840107739 842099905 843196213 843776941 844149053 844015300 843571663 843519926
1493 843519926 843343258 842267096 840840816 840015054 839454532 837474108 833475828 831482053 830978215
1511.3 830978215 829841018 827762723 825709164 824294209 822597146 821086526 820273101 819653749 818963051
1529.7 818963051 817560256 815900683 815309107 814447641 811819732 810177565 810550570 810932279 810901880
1548 810901880 810881376 811154664 811207652 810632885 809148908 808609545 809318423 809242725 808510423 807105839
$$ packed form
1421.6G98800528K48730j76430m78208j55627L71337J11878l97623M47512J293659
1439.9H00065756Q58545N42164R39369J320005J287937J341760J619160J838327K550006
1458.3H12363029L199994L101945K828360K558648K459228K578438K902567K864122
1474.6H34856331K667725K583683J992166J096308N80728L72112j33753m43637n1737
1493H43519926j76668j076162j426280q25762n60522j980424l998280j993775n03838
1511.3H30978215j137197k078295k053559j414955j697063j510620q13425o19352o90698
1529.7H18963051j402795j659573n91576q61466k627909j642167L73005L81709l0399
1548H10901880k0504K73288N2988n74767j483977n39363P08878p5698p32302j404584
$$ plain form
1568.4 807105839 805001557 803302109 801220179 797886431 794975340 792473793 789551675 786247671
1584.7 786247671 782414436 778240025 774113894 769905865 765272617 760570824 756168187 751708448
1601.1 751708448 746950865 742215276 737615168 732864261 728103340 723615110 718535602 712889433
1617.4 712889433 709133148 706225395 702800512 699769199 697162986 695062816 693960667 692882240
1633.7 692882240 691386938 691573322 693369627 695514083 697545230 699851096 703582585 707472801
1650 707472801 710793614 715670943 721111596 725645840 729754746 734104633 739041448 743514955 747428536
1668.4 747428536 751872361 756564975 761101127 765812397 770323396 774380445 778122783 782779455
1684.7 782779455 788059294 792784214 797344029 801261187 804793537 808722675 812896430 817857087
$$ packed form
1568.4H07105839k104282j699448k081930l333748k911091k501547k922118l304004
1584.7G86247671l833235m174411m126131m208029m633248m701793m402637m459739
1601.1G51708448m757583m735589m600108m750907m760921m488230n079508n646169
1617.4G12889433l756285k907753l424883l031313k606213k100170j102149j078427
1633.7F92882240j495302J86384J796305K144456K031147K305866L731489L890216
1650G07472801L320813M877329N440653M534244M108906M349887M936815M473507L913581
1668.4G47428536M443825M692614M536152M711270M510999M057049L742338M656672
1684.7G82779455N279839M724920M559815L917158L532350L929138M173755M960657
$$ plain form
1701 817857087 822522938 826387703 830210626 833618104 836394131 838688612 840531945 842404306 844921410
1719.3 844921410 847447574 849476039 851101935 852415740 853655815 854720891 855555654 856972992
1735.7 856972992 858593822 859885156 861098111 862403810 863733470 864904344 865895748 867194057
1752 867194057 868627429 869653702 870328724 870883584 871627569 872602582 873226941 873460472 873643756 873921156
1772.4 873921156 874556839 875372767 876092613 876617908 876959145 877340138 877937675 878321409 878071189 877961636
1792.8 877961636 878664255 879328489 879458249 879601419 880158782 880660772 880784631 880825162 881144583 881560981
1813.2 881560981 881725967 881859899 882258713 882508993 882284701 882140279 882384717 882520974 882670283 883112073
1833.6 883112073 883509934 883604169 883502305 883398473 883377850 883550406 883781254 884094119 884496570 884595811
$$ packed form
1701H17857087M665851L864765L822923L407478K776027K294481J843333J872361K517104
1719.3H44921410K526164K028465J625896J313805J240075J065076Q34763J417338
1735.7H56972992J620830J291334J212955J305699J329660J170874R91404J298309
1752H67194057J433372J026273O75022N54860P43985R75013O24359K33531J83284K77400
1772.4H73921156O35683Q15928P19846N25295L41237L80993N97537L83734k50220j09553
1792.8H77961636P02619O64234J29760J43170N57363N01990J23859M0531L19421M16398
1813.2H81560981J64986J33932L98814K50280k24292j44422K44438J36257J49309M41790
1833.6H83112073L97861R4235j01864j03832k0623J72556K30848L12865M02451R9241
$$ plain form
1854 884595811 884412766 884468079 884809494 884927094 884741426 884556532 884467185 884493887 884660721 884970367
1874.4 884970367 885299444 885338008 885166883 885220051 885410547 885247171 884835005 884899974 885310471 885340810
1894.7 885340810 885168552 885275900 885451853 885313809 885081291 885157228 885339200 885241687 885091901 885160148
1915.1 885160148 885137320 884853482 884656191 884815633 885082185 885005653 884812593 884893477 884961545 884721518
1935.5 884721518 884504914 884552836 884508133 884219408 884101152 884261787 884273350 883947670 883709967 883813798
1955.9 883813798 883871317 883624554 883428752 883465886 883341432 882976115 882833004 882984817 882996559 882735550
1976.3 882735550 882589936 882665753 882580340 882236183 882033288 882117331 882069409 881794989 881722450 881827772
1996.7 881827772 881703913 881398678 881289840 881352782 881247044 880970776 880828857 880837202 880683422 880382001
$$ packed form
1854H84595811j83045N5313L41415J17600j85668j84894q9347K6702J66834L09646
1874.4H84970367L29077L8564j71125N3168J90496j63376m12166O4969M10497L0339
1894.7H85340810j72258J07348J75953j38044k32518P5937J81972r7513j49786O8247
1915.1H85160148k2828k83838j97291J59442K66552p6532j93060Q0884O8068k40027
1935.5H84721518k16604M7922m4703k88725j18256J60635J1563l25680k37703J03831
1955.9H83813798N7519k46763j95802L7134j24454l65317j43111J51813J1742k61009
1976.3H82735550j45614P5817q5413l44157k02895Q4043m7922k74420p2539J05322
1996.7H81827772j23859l05235j08838O2942j05738k76268j41919Q345j53780l01421
$$ plain form
2017.1 880382001 880291104 880366564 880287886 880079508 879988730 879995406 879872084 879667580 879618585 879651904 879528403
2039.6 879528403 879326642 879285514 879325688 879201233 878993750 878957033 879033506 878986895 878857493 878818214 878792763
2062 878792763 878639758 878491759 878548086 878671110 878645003 878546178 878529131 878561735 878528416 878474057 878531694
2084.4 878531694 878635287 878639519 878602266 878635705 878685415 878653407 878604829 878654540 878792286 878904045 878905118
2106.9 878905118 878876805 878906786 878916681 878881991 878918111 879031122 879102945 879096389 879113495 879196286 879236758 879203737
2131.3 879203737 879248917 879432797 879565060 879542530 879512429 879586160 879674911 879697561 879760146 879929006 880062282
2153.8 880062282 880057156 880035400 880121410 880236149 880278707 880333900 880486250 880595446 880560815 880563557 880696714
2176.2 880696714 880769610 880721986 880771816 880981803 881092489 881026387 881029665 881170511 881243765 881195426 881229639
$$ packed form
2017.1H80382001r0897P5460p8678k08378r0778O676j23322k04504m8995L3319j23501
2039.6H79528403k01761m1128M0174j24455k07483l6717P6473m6611j29402l9279k5451
2062H78792763j53005j47999N6327J23024k6107r8825j7047L2604l3319n4359N7637
2084.4H78531694J03593M232l7253L3439M9710l2008m8578M9711J37746J11759J073
2106.9H78905118k8313K9981R895l4690L6120J13011P1823o556J7106Q2791M0472l3021
2131.3H79203737M5180J83880J32263k2530l0101P3731Q8751K2650O2585J68860J33276
2153.8H80062282n126k1756Q6010J14739M2558N5193J52350J09196l4631K742J33157
2176.2H80696714P2896m7624M9830K09987J10686o6102L278J40846P3254m8339L4213
$$ plain form
2198.6 881229639 881404221 881472349 881360888 881356716 881526291 881555557 881400347 881410003 881614208 881655872 881518662
2221.1 881518662 881523311 881681144 881699502 881551743 881534874 881701469 881736755 881590664 881578505 881715655 881698728
2243.5 881698728 881563425 881613791 881767452 881707966 881509006 881493151 881605685 881510496 881323695 881426930
2263.9 881426930 881662250 881627202 881449103 881498635 881672442 881629825 881499827 881642580 881899536 881843925
2284.3 881843925 881581247 881533384 881607592 881414056 881082475 881007195 881036699 880767405 880352736 880119801
2304.7 880119801 879843175 879231393 878618956 878407836 878296494 877767324 876921713 876202226 875626147 874999881
2325.1 874999881 874437213 874067545 873714983 873236835 872805119 872568429 872324824 871972322 872138083 873535216
2345.5 873535216 875259757 875685990 874506354 872644484 870938778 869539559 868895531 869180620 869839966
$$ packed form
2198.6H81229639J74582O8128j11461m172J69575K9266j55210R656K04205M1664j37210
2221.1H81518662M649J57833J8358j47759j6869J66595L5286j46091j2159J37150j6927
2243.5H81698728j35303N0366J53661n9486j98960j5855J12534r5189j86801J03235
2263.9H81426930K35320l5048j78099M9532J73807m2617j29998J42753K56956n5611
2284.3H81843925k62678m7863P4208j93536l31581p5280K9504k69294m14669k32935
2304.7H80119801k76626o11782o12437k11120j11342n29170q45611p19487n76079o26266
2325.1H74999881n62668l69668l52562m78148m31716k36690k43605l52502J65761J397133
2345.5H73535216J724541M26233j179636j861870j705706j399219o44028K85089O59346
$$ plain form
2363.8 869839966 870635033 871895552 873572409 875169158 876580656 878086448 879668951 880965531
2380.2 880965531 881854117 882586598 883208692 883466125 883425236 883499563 883717835 883722842 883545756 883542418 883681297
2402.6 883681297 883646548 883507848 883588374 883800447 883810401 883656979 883644879 883765578 883716345 883510292 883468986
2425 883468986 883586526 883555830 883416116 883469582 883639574 883624196 883509636 883583248 883737028 883666933 883476496
2447.5 883476496 883478105 883572757 883486748 883352935 883415222 883535624 883454621 883287370 883288443 883331478 883190870
2469.9 883190870 883032501 883088410 883196354 883093178 882901847 882886529 882927001 882801831 882672191 882742882
2490.3 882742882 882826567 882702291 882539213 882562339 882619381 882492959 882364392 882413208 882434368 882272542
2510.7 882272542 882112801 882123709 882135928 882010102 881937146 882026792 882061422 881903231 881755769 881768167 881754398
$$ packed form
2363.8H69839966P95067J260519J676857J596749J411498J505792J582503J296580
2380.2H80965531Q88586P32481O22094K57433m0889P4327K18272N007j77086l338J38879
2402.6H83681297l4749j38700Q0526K12073R954j53422j2100J20699m9233k06053m1306
2425H83468986J17540l0696j39714N3466J69992j5378j14560P3612J53780p0095j90437
2447.5H83476496J609R4652q6009j33813O2287J20402q1003j67251J073M3035j40608
2469.9H83190870j58369N5909J07944j03176j91331j5318M0472j25170j29640P0691
2490.3H82742882Q3685j24276j63078K3126N7042j26422j28567M8816K1160j61826
2510.7H82272542j59741J0908J2219j25826p2956Q9646L4630j58191j47462J2398j3769
$$ plain form
2533.1 881754398 881598413 881521165 881620228 881649554 881484091 881328702 881330431 881316960 881163776 881068528 881129026
2555.6 881129026 881125093 880950332 880791426 880769610 880737960 880593419 880510807 880577266 880570114 880390227 880228341
2578 880228341 880165398 880052090 879858017 879775643 879815876 879754961 879554451 879375339 879280925 879156530 878938079
2600.4 878938079 878771067 878723860 878627121 878414989 878235340 878135741 877991140 877766788 877591074 877513826
2620.8 877513826 877402246 877196133 877024889 876910686 876718938 876453876 876290500 876254261 876132071 875860274
2641.2 875860274 875614405 875466824 875312865 875116706 874995351 874951184 874780953 874468744 874270678 874223113
2661.6 874223113 874088287 873846531 873704791 873657644 873508811 873268485 873142898 873116136 872949421 872629821
2682 872629821 872413516 872341990 872139454 871781647 871555090 871457756 871249616 870973647 870841324 870785177
$$ packed form
2533.1H81754398j55985p7248R9063K9326j65463j55389J729j3471j53184r5248O0498
2555.6H81129026l933j74761j58906k1816l1650j44541q2612O6459p152j79887j61886
2578H80228341o2943j13308j94073q2374M0233o0915k00510j79112r4414j24395k18451
2600.4H78938079j67012m7207r6739k12132j79649r9599j44601k24352j75714p7248
2620.8H77513826j11580k06113j71244j14203j91748k65062j63376l6239j22190k71797
2641.2H75860274k45869j47581j53959j96159j21355m4167j70231l12209j98066m7565
2661.6H74223113j34826k41756j41740m7147j48833k40326j25587k6762j66715l19600
2682H72629821k16305p1526k02536l57807k26557r7334k08140k75969j32323n6147
$$ plain form
2702.4 870785177 870593071 870295525 870068014 869907379 869684994 869428217 869265020 869166017 868988097 868763447
2722.8 868763447 868642569 868481219 868079364 867678523 867534339 867480040 867265463 866943538 866720855 866580188
2743.2 866580188 866399884 866227865 866110444 865935028 865640998 865346909 865149319 864942312 864616215 864341974
2763.6 864341974 864251912 864123881 863785267 863441408 863281548 863054693 862566769 862130582 861958146 861801863
2784 861801863 861495614 861192524 860930741 860542834 860053122 859705210 859489262 859114110 858548939 858037353
2804.4 858037353 857701242 857382178 856868505 856300533 855898619 855494380 854928613 854379117 853942215 853423059
2824.8 853423059 852744579 852143884 851678789 851052403 850206196 849408627 848554671 847235918 845504284
2843.1 845504284 843738258 842065990 840479791 839220226 838567078 838355541 838177621 837869108 837511897
$$ packed form
2702.4H70785177j92106k97546k27511j60635k22385k56777j63197r9003j77920k24650
2722.8H68763447j20878j61350m01855m00841j44184n4299k14577l21925k22683j40667
2743.2H66580188j80304j72019j17421j75416k94030k94089j97590k07007l26097k74241
2763.6H64341974r0062j28031l38614l43859j59860k26855m87924m36187j72436j56283
2784H61801863l06249l03090k61783l87907m89712l47912k15948l75152n65171n11586
2804.4H58037353l36111l19064n13673n67972m01914m04239n65767n49496m36902n19156
2824.8H53423059o78480o00695m65095o26386q46207p97569q53956j318753j731634
2843.1H45504284j766026j672268j586199j259565o53148k11537j77920l08513l57211
$$ plain form
2861.5 837511897 837090731 836407661 835464835 834589243 833949566 833270133 832413018 831719041 831250787 830657601
2881.9 830657601 829917073 829264641 828661799 827921569 827144742 826531410 825885117 824917793 823846161
2900.2 823846161 822970390 822092950 820958674 819722235 818575561 817307293 815657377 813871980 812387526
2918.6 812387526 811242461 810332716 809767544 809654057 809779406 809791148 809809625 810157299 810728252 811361909
2939 811361909 812233806 813365877 814313173 814756036 814951718 815206349 815259337 814929724 814687610 814841032
2959.4 814841032 815128922 815291822 815440834 815757036 816148043 816530764 816984057 817444444 817793250 818028212
2979.8 818028212 818140090 818123162 818048179 818091273 818399787 818715572 818633378 818296492 817981362 817599714
3000.2 817599714 817098141 816569269 816143036 815887511 815674067 815343738 814841032 814126611 813249826 812417269
$$ packed form
2861.5H37511897m21166o83070r42826q75592o39677o79433q57115o93977m68254n93186
2881.9H30657601p40528o52432o02842p40230p76827o13332o46293r67324j071632
2900.2H23846161q75771q77440j134276j236439j146674j268268j649916j785397j484454
2918.6H12387526j145065r09745n65172j13487J25349J1742J8477L47674N70953O33657
2939H11361909Q71897J132071R47296M42863J95682K54631N2988l29613k42114J53422
2959.4H14841032K87890J62900J49012L16202L91007L82721M53293M60387L48806K34962
2979.8H18028212J11878j6928p4983M3094L08514L15785q2194l36886l15130l81648
3000.2H17599714n01573n28872m26233k55525k13444l30329n02706p14421q76785q32557
$$ plain form
3020.6 812417269 811767578 811131477 810299516 809467494 808872640 808341980 807541251 806553304 805826008 805301130
3041 805301130 804531276 803464770 802353084 801335156 800335288 799324512 798377037 797377944 796256542
3059.3 796256542 795241892 794444084 793665111 792719483 791651309 790616572 789684176 788896620 788226247
3077.7 788226247 787409484 786297083 785082817 783943474 782921910 781901836 780693710 779395878
3094 779395878 778206229 777128816 776064992 774925828 773774564 772711635 771649063 770449042 769222915
3112.4 769222915 768154323 767143726 765980721 764491916 762700558 760969222 759532750 758220613
3128.7 758220613 756757081 755154550 753689528 752429247 751097322 749454796 747659981 745942175
3145 745942175 744280517 742762923 741433442 739918292 738000035 735988855 734119534 732304633 730459571
$$ packed form
3020.6H12417269o49691o36101q31961q32022n94854n30660q00729r87947p27296n24878
3041H05301130p69854j066506j111686j017928r99868j010776r47475r99093j121402
3059.3G96256542j014650p97808p78973r45628j068174j034737r32396p87556o70373
3077.7G88226247q16763j112401j214266j139343j021564j020074j208126j297832
3094G79395878j189649j077413j063824j139164j151264j062929j062572j200021j226127
3112.4G69222915j068592j010597j163005j488805j791358j731336j436472j312137
3128.7G58220613j463532j602531j465022j260281j331925j642526j794815j717806
3145G45942175j661658j517594j329481j515150j918257k011180j869321j814901j845062
$$ plain form
3163.4 730459571 728612602 726804852 724984527 723112881 721242964 719345391 717357099 715371549
3179.7 715371549 713452876 711503208 709475517 707469642 705530167 703557849 701470375 699321926
3196 699321926 697225213 695194185 693187654 691199958 689210773 687189817 685155094 683142126 681176186
3214.3 681176186 679247439 677288532 675288022 673307955 671350718 669382691 667483985 665763617
3230.7 665763617 664097607 662229896 660227895 658357799 656610489 654890418 653261542 651681125
3247 651681125 650006175 648306370 646728337 645252109 643711448 642095149 640579760 639143884 637704074
3265.3 637704074 636375308 635193646 633884490 632285655 630587339 628952146 627388239 625821590
3281.6 625821590 624217510 622619569 621048331 619562387 618107915 616482258 614653111 612694442
$$ packed form
3163.4G30459571j846969j807750j820325j871646j869917j897573j988292j985550
3179.7G15371549j918673j949668k027691k005875j939475j972318k087474k148449
3196F99321926k096713k031028k006531j987696j989185k020956k034723k012968j965940
3214.3F81176186j928747j958907k000510j980067j957237j968027j898706j720368
3230.7F65763617j666010j867711k002001j870096j747310j720071j628876j580417
3247F51681125j674950j699805j578033j476228j540661j616299j515389j435876j439810
3265.3F37704074j328766j181662j309156j598835j698316j635193j563907j566649
3281.6F25821590j604080j597941j571238j485944j454472j625657j829147j958669
$$ plain form
3298 612694442 610730946 608978033 607410789 605661809 603512526 601134777 598745942 596433938 594177663
3316.3 594177663 591928720 589649200 587364376 585138500 582802236 580234706 577622175 575107455
3332.6 575107455 572720647 570424438 568015635 565384507 562658608 559874296 557123780 554613054
3348.9 554613054 552090943 549206555 546174407 543367624 540805221 538230062 535586417 533150136
3365.3 533150136 530905247 528433204 525563240 522669971 520172358 518009186 515968800 513978422
3381.6 513978422 512064040 510349393 509002149 508010149 506928563 505449235 503978431 503036678 502402425
3399.9 502402425 501358449 499888539 498688966 497943759 497320741 496675968 495968103 495241612 494707942
3418.3 494707942 494381398 494180053 494206637 494556755 495112181 495589137 496076524 496799171 497473091 497839481
$$ packed form
3298F12694442j963496j752913j567244j748980k149283k377749k388835k312004k256275
3316.3E94177663k248943k279520k284824k225876k336264k567530k612531k514720
3332.6E75107455k386808k296209k408803k631128k725899k784312k750516k510726
3348.9E54613054k522111k884388l032148k806783k562403k575159k643645k436281
3365.3E33150136k244889k472043k869964k893269k497613k163172k040386j990378
3381.6E13978422j914382j714647j347244r92000j081586j479328j470804r41753o34253
3399.9E02402425j043976j469910j199573p45207o23018o44773p07865p26491n33670
3418.3D94707942l26544k01345K6584L50118N55426M76956M87387P22647O73920L66390
$$ plain form
3438.7 497839481 498202443 498945594 500030458 501250982 502537906 503902972 505343854 506905675 508683622
3457 508683622 510641336 512506545 514361560 516616344 519059002 521071136 522594094 524186075 526171803
3475.4 526171803 528492749 530848563 532899916 534875810 537110806 539384067 541549087 543845832
3491.7 543845832 546347976 548908889 551361442 553750038 556141198 558397889 560561717 562874079
3508 562874079 565503120 568428874 571260333 573775232 576321185 579109967 582061768 584909320 587512612
3526.4 587512612 590172946 593102872 596225262 599463046 602665842 605746388 608964026 612345815
3542.7 612345815 615580380 618583083 621606529 624787092 628134966 631598651 635092318 638716519
3559 638716519 642453074 645871758 648805797 652212799 656595588 660933018 664867342 668828726 672987640
$$ packed form
3438.7D97839481L62962P43151J084864J220524J286924J365066J440882J561821J777947
3457E08683622J957714J865209J855015K254784K442658K012134J522958J591981J985728
3475.4E26171803K320946K355814K051353J975894K234996K273261K165020K296745
3491.7E43845832K502144K560913K452553K388596K391160K256691K163828K312362
3508E62874079K629041K925754K831459K514899K545953K788782K951801K847552K603292
3526.4E87512612K660334K929926L122390L237784L202796L080546L217638L381789
3542.7F12345815L234565L002703L023446L180563L347874L463685L493667L624201
3559F38716519L736555L418684K934039L407002M382789M337430L934324L961384M158914
$$ plain form
3577.4 672987640 677347541 681882620 686232746 690068424 693925321 698504329 703093290 707344532
3593.7 707344532 711755276 716423213 721133828 725873768 730415404 734471202 738521814 742916286
3610 742916286 747301400 751651764 755741179 759621561 764114141 768831611 772836804 775789559 778570890
3628.4 778570890 782716691 787076354 790866256 794376969 797622681 800723672 803712666 806146324
3644.7 806146324 807724893 809453845 812614739 815819740 818124175 820513368 823232591 825353801
3661 825353801 826844275 828144193 829005241 829496324 830554366 831466198 831807494 833103180 835080206
3679.4 835080206 836825132 838241816 839129627 839387596 839572489 840558410 842110336 843514502 844457924
3697.7 844457924 844979167 845511377 846444666 847312987 847543001 847258389 847520828 848778248 849900544
$$ packed form
3577.4F72987640M359901M535079M350126L835678L856897M579008M588961M251242
3593.7G07344532M410744M667937M710615M739940M541636M055798M050612M394472
3610G42916286M385114M350364M089415L880382M492580M717470M005193K952755K781331
3628.4G78570890M145801M359663L789902L510713L245712L100991K988994K433658
3644.7H06146324J578569J728952L160894L205001K304435K389193K719223K121210
3661H25353801J490474J299918Q61048M91083J058042R11832L41296J295686J977026
3679.4H35080206J744926J416684Q87811K57969J84893R85921J551926J404166R43422
3697.7H44457924N21243N32210R33289Q68321K30014k84612K62439J257420J122296
$$ plain form
3716.1 849900544 850297809 850283921 850308657 850458860 850782216 851280570 851502299 851227880 850967646 851574898
3736.5 851574898 852806091 853394866 852743626 851969421 852270842 852273166 851906061 852723241 854024947 854591787
3756.9 854591787 854653299 855027139 855488896 855564117 855452597 855422020 855777204 856383979 856673837 856559515
3777.3 856559515 856472909 856657386 856802762 856918931 857207716 857484579 857576072 857389212 857070982 856859922
3797.7 856859922 856408298 856069446 856468976 856734157 856905043 857492566 857871950 857528448 856989861 856801331
3818 856801331 856444240 856458127 857079506 857494473 857701898 857696056 857558250 857536077 857205391 856593668 856519580
3840.5 856519580 856949866 857643604 858343303 858422339 857318878 855512798 855546057 857033432 857858241
3858.8 857858241 857790589 857338190 857199311 857201040 856894374 856799662 857093692 857562363 857830763 857487857
$$ packed form
3716.1H49900544L97265j3888K4736J50203L23356M98354K21729k74419k60234O07252
3736.5H51574898J231193N88775o51240p74205L01421K324l67105Q17180J301706N66840
3756.9H54591787O1512L73840M61757P5221j11520l0577L55184O06775K89858j14322
3777.3H56559515q6606J84477J45376J16169K88785K76863R1493j86860l18230k11060
3797.7H56859922m51624l38852L99530K65181J70886N87523L79384l43502n38587j88530
3818H56801331l57091J3887O21379M14967K07425n842j37806k2173l30686o11723p4088
3840.5H56519580M30286O93738O99699P9036j103461j806080L3259J487375Q24809
3858.8H57858241o7652m52399j38879J729l06666r4712K94030M68671K68400l42906
$$ plain form
3879.2 857487857 857308328 857577205 857724607 857848048 857737362 857535481 857860804 858214796 857945740 857312441
3899.6 857312441 856839955 856750131 857225776 857921243 858300745 858366907 858204186 857866764 857682526 857737839
3920 857737839 857784033 857803464 857934773 858038008 857942998 857891083 858083487 858268380 858239412 858035505 857856691
3942.5 857856691 857894361 858005106 858072221 858188927 858335674 858425558 858445883 858405530 858345926 858394623 858531177
3964.9 858531177 858565629 858474791 858410478 858422577 858481050 858606458 858758211 858879983 858961940 858945966 858834326
3987.3 858834326 858773828 858818591 858869314 858896434 858961225
3997.5 858961225
$$ packed form
3879.2H57487857j79529K68877J47402J23441j10686k01881L25323L53992k69056o33299
3899.6H57312441m72486q9824M75645O95467L79502O6162j62721l37422j84238N5313
3920H57737839M6194J9431J31309J03235r5010n1915J92404J84893k8968k03907j78814
3942.5H57856691L7670J10745O7115J16706J46747Q9884K0325m0353n9604M8697J36554
3964.9H58531177L4452r0838o4313J2099N8473J25408J51753J21772Q1957j5974j11640
3987.3H58834326o0498M4763N0723K7120O4791
3997.5H58961225
##END=$$ End of the data block
