##TITLE=$$ Begin of the data block
##JCAMP-DX=5.00 $$ ACD/SpecManager v 10.08
##SPECTROMETER/DATA SYSTEM=Alpha
##DATE=07 Apr 2014 11:14:18
##DATA TYPE=INFRARED SPECTRUM
##DATA CLASS=XYDATA
##ORIGIN=
##OWNER=
##NPOINTS=1765
##FIRSTX=399.75695801
##LASTX=3997.56933594
##MAXX=3997.56933594
##MINX=399.75695801
##MAXY=0.88560796
##MINY=0.49432871
##XFACTOR=1.0000000000
##YFACTOR=1.000000000000000e-9
##FIRSTY=0.77232754
##DELTAX=2.03957629
##XUNITS=1/CM
##YUNITS=ARBITRARY UNITS
##XYDATA=(X++(Y..Y))
399.8G72327542m251718Q77201J673639k861559k368033K177656R56237l023088j196325
$$ 772327542 768075824 768953025 770626664 767765105 765397072 767574728 768530965 765507877 764311552
418.1G64311552K560318j186312l786981L93450L105402r71376l244222P51078J830459
$$ 764311552 766871870 765685558 761898577 762292027 765397429 764426053 761181831 761932909 763763368
436.5G63763368k375603k265751K243221J667678k709925j582444K349019P34568k832293
$$ 763763368 761387765 759122014 761365235 763032913 760322988 758740544 761089563 761824131 758991838
454.8G58991838n76914K572954n84662l040195Q94J948238j085103k342999J033545
$$ 758991838 758414924 760987878 760403216 757363021 757363915 759312153 758227050 755884051 756917596
473.2G56917596J584053k106786k391815J328885J516700j819431j342893J722991
$$ 756917596 758501649 756394863 754003048 755331933 756848633 755029202 753686309 755409300
489.5G55409300P79748k129554q96395J588166j38164k729475p65860J714528k65182
$$ 755409300 756189048 754059494 753163099 754751265 754613101 751883626 751117766 752832294 752567112
507.9G52567112k299606k69294J142859j184106k267777J60455P91610j509727j858413
$$ 752567112 750267506 749998212 751141071 749956965 747689188 747849643 748641253 747131526 745273113
526.2G45273113L93629L28780j930237j592636P83622L84807j849472j243889Q15749
$$ 745273113 745666742 745995522 744065285 742472649 743256271 743641078 741791606 740547717 741363466
544.6G41363466n7578j905024p60615R59813l46183j964569n91279P34508r54628k271652
$$ 741363466 741305888 739400864 738640249 739600062 739253879 737289310 736698031 737432539 736477911 734206259
565G34206259n94914L98696j333058j988709l01957P0870j599431j705766P8797J16110
$$ 734206259 733611345 734010041 732676983 730688274 730386317 730457187 728857756 727151990 727230787 727346897
585.4G27346897j553058j356185L11613J00315j294852r51528J22189o88552k086759
$$ 727346897 725793839 724437654 724749267 724849582 723554730 722603202 722725391 722036839 719950080
603.7G19950080j436174q6606m73201j294851l53158R04441O87540O92367K123535
$$ 719950080 718513906 718427300 717954099 716659248 716306090 717210531 717898071 718590438 720713973
622.1G20713973L036082K152741J538098K427697K795815J711428J195074J981616
$$ 720713973 723750055 725902796 727440894 729868591 732664406 734375834 735570908 737552524
638.4G37552524K012133Q45850O17861J663805J885116R57489O32047J162648J455248
$$ 737552524 739564657 740410507 741028368 742692173 744577289 745534778 746166825 747329473 748784721
656.7G48784721J563311K140522K677202J974761M80712R63926K746344K278864J335561
$$ 748784721 750348032 752488554 755165756 757140517 757621229 758585155 761331499 763610363 764945924
675.1G64945924J364112J710475J323044Q91030J287281J634300J107693O04093Q17358
$$ 764945924 766310036 768020511 769343555 770234585 771521866 773156166 774263859 774867952 775685310
693.5G75685310J006306O66976N42998R69708J089215P04408P62343J265168J316607
$$ 775685310 776691616 777358592 777901590 778871298 779960513 780664921 781427264 782692432 784009039
711.8G84009039J022518J037777J172184J033307R76145J217961J354397J149892R51052
$$ 784009039 785031557 786069334 787241518 788274825 789250970 790468931 791823328 792973220 793924272
730.2G93924272J060724J119018P87616N96940Q83579R90749P08341P31767J213610
$$ 793924272 794984996 796104014 796891630 797488570 798372149 799362898 800071239 800803006 802016616
748.5H02016616J315117Q69274P72655J134097J107872P09057P12693R52661P41601
$$ 802016616 803331733 804201007 804973662 806107759 807215631 807924688 808637381 809590042 810331643
766.9H10331643L65257N45740Q15988L61383k10047p4864J77801j72079m88102J0312
$$ 810331643 810696900 811242640 812058628 812420011 812209964 812135100 812312901 812140822 811652720 811663032
787.3H11663032O15418N15699O55293J643718K283036K051890K083481K665996K626777
$$ 811663032 812278450 812794149 813449442 815093160 817376196 819428086 821511567 824177563 826804340
805.6H26804340J838803J534939J852334J544415N96345L78311P49886K54988q40187
$$ 826804340 828643143 830178082 832030416 833574831 834171176 834549487 835299373 835554361 834714174
824H34714174j055658o79850j114190j901686j570761q15809j125395j728833j270294
$$ 834714174 833658516 832978666 831864476 829962790 828392029 827576220 826450825 824721992 823451698
842.3H23451698n27680p24018q98719K29776J639247J984775K180100L320217M108191
$$ 823451698 822924018 822200000 821301281 821531057 823170304 825155079 827335179 830655396 834763587
860.7H34763587L402352K684712L148079L305316J975358R59813J561284J877010P38979
$$ 834763587 838165939 840850651 843998730 847304046 849279404 850239217 851800501 853677511 854416490
879.1H54416490l6240M92454N14090p07686j206756l06189J5676p77006o49333O95407
$$ 854416490 854380250 854872704 855386794 854679108 853472352 853166163 853181839 852404833 851755500 852450907
899.4H52450907J010657K6822l3975R67503P71522o47485r75013k69234p28905k009154
$$ 852450907 853461564 853488386 853454411 854421914 855193436 854545951 853570938 853301704 852572799 850563645
919.8H50563645j789868m69982l49641r97424k87056J039922P26462l79026m7624Q27312
$$ 850563645 848773777 848303795 847954154 846956730 846669674 847709596 848436058 848057032 848009408 848836720
940.2H48836720J63555r65714n03421K52187p58707k100945j726031j142502k371192
$$ 848836720 849000275 848034561 847531140 847783327 847024620 844923675 843197644 842055142 839683950
958.6H39683950l811777l505468l190935m749834o215513n678952m946470n527139
$$ 839683950 835872173 832366705 829175770 824425936 818210423 812531471 807585001 802057862
974.9H02057862n599200m006207k821565l309071l527880k313256j560509k219141
$$ 802057862 796458662 792452455 789630890 786321819 782793939 780480683 778920174 776701033
991.2G76701033k301633r77814l05951j098692j293839k53081j94967j680076k404511
$$ 776701033 774399400 773421586 773115635 772016943 770723104 770470023 770275056 768594980 766190469
1009.6G66190469j758098j865507l084838l216565k093493j977802k957940k867162
$$ 766190469 764432371 762566864 759482026 756265461 754171968 752194166 749236226 746369064
1025.9G46369064j730681j705467k634645k353847j110196j044452j916349j712620
$$ 746369064 744638383 742932916 740298271 737944424 736834228 735789776 733873427 732160807
1042.2G32160807q01981j138151k193808j951218q45909p61449j190782l55303R23097
$$ 732160807 731358826 730220675 728026867 726075649 725229740 724468291 723277509 722922206 723845303
1060.6G23845303O31452n69642p58707n13256j472473k683997k390147j589477k033949
$$ 723845303 724476755 723907113 723148406 722635150 721162677 718478680 716088533 714499056 712465107
1078.9G12465107k811849k337634j620412k253413l063560k347112j162648j086831
$$ 712465107 709653258 707315624 705695212 703441799 700378239 698031127 696868479 695781648
1095.2F95781648j268685m37557L72052j65820q99613m29690O7592o94275j483560
$$ 695781648 694512963 694075406 694447458 694281638 693382025 692952335 693019927 692325652 690842092
1113.6F90842092j116693j002729k247929l012360j846790o01649o62804q3983J601517
$$ 690842092 689725399 688722670 686474741 683462381 681615591 681013942 680351138 680267155 681868672
1132F81868672K033949J098812R09805J893878K317906J449108Q59081J387060J622200
$$ 681868672 683902621 685001433 685911238 687805116 690123022 691572130 692431211 693818271 695440471
1150.3F95440471R06944P07150J583517K014219J486957J633704K943814L699779L383637
$$ 695440471 696347415 697054565 698638082 700652301 702139258 703772962 706716776 710416555 713800192
1168.7G13800192L570735M569769M767657L887414L602565M240870M089058K874791
$$ 713800192 717370927 721940696 726708353 730595767 734198332 738439202 742528260 745403051
1185G45403051K329290K621293K054811O50585K31206Q29518P67767J74105O57618
$$ 745403051 747732341 750353634 752408445 753059030 753290236 754119754 754887521 755061626 755719244
1203.3G55719244J850486J902402J035273J018226J611233J223266K72155M11987J221955
$$ 755719244 757569730 759472132 760507405 761525631 763136864 764360130 764632285 765044272 766266227
1221.7G66266227J013160K77161O60539J529455J273811N87880J030624J811147J376510
$$ 766266227 767279387 767556548 768217087 769746542 771020353 771608233 772638857 774450004 775826514
1240.1G75826514N65588Q71361J390397P07865j61052K12729Q18193K97725k67803
$$ 775826514 776392102 777263463 778653860 779361725 779200673 779413402 780231595 780529320 780261517
1258.4G80261517M70221J389205J155675Q86619J733720K485335K000987J532853K183735
$$ 780261517 780731738 782120943 783276618 784163237 785896957 788382292 790383279 791916132 794099867
1276.8G94099867K679229K050579J637757K354562K833426K159953J709998K310454
$$ 794099867 796779096 798829675 800467432 802821994 805655420 807815373 809525371 811835825
1293.1H11835825K512396J585424J045525J551926J623511P14779L17753R20653R97543
$$ 811835825 814348221 815933645 816979170 818531096 820154607 820869386 821187139 822107792 823105335
1311.4H23105335J60456m5240O90401Q71598K13623J49429Q86441R20891M3571j65224
$$ 823105335 823265791 823220551 823910952 824782550 824996173 825145602 826032043 826952934 826996505 826831281
1331.8H26831281M47691L44276n85079o38366L16262M07577k94745k29239M21583K16961
$$ 826831281 827278972 827623248 827038169 826399803 826716065 827123642 826828897 826599658 827021241 827238202
1352.2H27238202n75423n13792J13249k40028j210630r75609k34485o43134j410961
$$ 827238202 826662779 826148987 826262236 826022208 824811578 823835969 823601484 822958350 821547389
1370.6H21547389j423955j138568j589179l143787n137682n478561k251983K569437
$$ 821547389 820123434 818984866 817395687 814251900 809114218 803635657 801383674 803953111
1386.9H03953111M596710L144265Q70287p16209p30753m54426r01520j494527j441658
$$ 803953111 808549821 811694086 812564373 811848164 811117411 810662985 809761465 808266938 806825280
1405.3H06825280r06825j120210j476764q89540l38376j008272j594782m64797K05458
$$ 806825280 805918455 804798245 803321481 802431941 802093565 801085293 799490511 799025714 799231172
1423.6G99231172j94192m66109j57117L37064J52588k96414M22477J173795P84278
$$ 799231172 799036980 798570871 798413754 798750818 798903406 798606992 799029469 800203264 800987542
1442H00987542N47945J009464J363099J258612J350999J751065J997828K439201K981961
$$ 800987542 801535487 802544951 803908050 805166662 806517661 808268726 810266554 812705755 815687716
1460.3H15687716L051102K857983K538920K453923K666295L006696K861679K601743
$$ 815687716 818738818 821596801 824135721 826589644 829255939 832262635 835124314 837726057
1476.6H37726057K530038J963139J064777N80430M56750l6418m72546j37865j68562
$$ 837726057 840256095 842219234 843284011 843864441 844321191 844284773 843812227 843674362 843505800
1495H43505800j003683j432836q58903n05686j809537l830075k043605o42240j203716
$$ 843505800 842502117 841069281 840210378 839704692 837895155 834065080 832021475 831379235 830175519
1513.4H30175519k022803j973927j364231j668692j571238r08851p06911p40826j374782
$$ 830175519 828152716 826178789 824814558 823145866 821574628 820665777 819958866 819218040 817843258
1531.7H17843258j622200n87105p73192k447665j618146K50637K69711p4387k1219
$$ 817843258 816221058 815633953 814860761 812413096 810794950 811045587 811315298 811240911 811219692
1550.1H11219692K73407R0003m56035j353562o53982N40375j16765o82473j339376
$$ 811219692 811493099 811583102 811127067 809773505 809119523 809659898 809543133 808860660 807521284
1568.4H07521284k124966j740038k051890l348172l015935k571225k947211l306687
$$ 807521284 805396318 803656280 801604390 798256218 795240283 792669058 789721847 786415160
1584.7G86415160l814519m144072m105151m224777m677832m738272m409372m441440
$$ 786415160 782600641 778456569 774351418 770126641 765448809 760710537 756301165 751859725
1601.1G51859725m771591m777074m585385m702508m747987m470110n015075n629063
$$ 751859725 747088134 742311060 737725675 733023167 728275180 723805070 718789995 713160932
1617.4G13160932l820419k939701l418923l035009k613723k114356j105844j028836
$$ 713160932 709340513 706400812 702981889 699946880 697333157 695218801 694112957 693084121
1633.7F93084121j436830J35005J694202K083182K060533K429485L824830L936589
$$ 693084121 691647291 691782296 693476498 695559680 697620213 700049698 703874528 707811117
1650G07811117L423393M846692N235195M415870M129887M439115M971743M506230M017234
$$ 707811117 711234510 716081202 721316397 725732267 729862154 734301269 739273012 743779242 747796476
1668.4G47796476M504025M678905M533470M675149M484773M117906L858209M683733
$$ 747796476 752300501 756979406 761512876 766188025 770672798 774790704 778648913 783332646
1684.7G83332646N177259M615963M458666L891647L627598M074693M272341M925311
$$ 783332646 788509905 793125868 797584534 801476181 805103779 809178472 813450813 818376124
1701H18376124M568815L816128L775060L360808K794802K393782J975775J893580K373934
$$ 818376124 822944939 826761067 830536127 833896935 836691737 839085519 841061294 842954874 845328808
1719.3H45328808K396405J955747J596570J357317J349986J177132Q44121J316786
$$ 845328808 847725213 849680960 851277530 852634847 853984833 855161965 856006086 857322872
1735.7H57322872J582682J308679J203597J311898J387954J207769R47297J214265
$$ 857322872 858905554 860214233 861417830 862729728 864117682 865325451 866272748 867487013
1752H67487013J392901J031161O66439N47052P30872R37164O38365L13580K65241K73347
$$ 867487013 868879914 869911075 870577514 871124566 871855438 872792602 873430967 873744547 874009788 874283135
1772.4H74283135N45680P59364P15255N28098L24368L52323N94258M31836j81258r1552
$$ 874283135 874828815 875588179 876303434 876831532 877155900 877508223 878102481 878534317 878353059 878261507
1792.8H78261507O67750O51241J36852J25229N23985M72724J04904O7294L63827L91125
$$ 878261507 878929257 879580498 879717350 879842579 880366564 880839288 880944192 881011486 881375313 881766438
1813.2H81766438J11640J24335L86000K40266j54912o2168K44439Q2731P9274L98398
$$ 881766438 881878078 882002413 882388413 882628679 882473767 882411599 882656038 882738769 882818043 883216441
1833.6H83216441L99053J23203n6029l2902K8074J31428J78993K84374L66092P1346
$$ 883216441 883615494 883738697 883682668 883649766 883677840 883809268 883988261 884272635 884638727 884710073
1854H84710073j88231O2168L37600J15812j40130j04905o2048l5822R6082K78414L10897
$$ 884710073 884521842 884584010 884921610 885037422 884897292 884792387 884730339 884694517 884790599 885069013 885379910
1876.4H85379910K0683j72198N5373J91629j14620l19898J07467L76106j9849j92105
$$ 885379910 885400593 885228395 885283768 885475397 885360777 885040879 885148346 885524452 885504603 885312498
1896.8H85312498J16288J79172j55687k37704R6739J85430j08123j43528P8737k1517
$$ 885312498 885428786 885607958 885452271 885214567 885311306 885496736 885388613 885245085 885323822 885302305
1917.2H85302305k94208j96398J66476K44737q7500j69039J00136N9366k80320k31147
$$ 885302305 885008097 884811699 884978175 885222912 885135412 884966373 885066509 885125875 884845555 884614408
1937.6H84614408R8526o616k97188j21832J57237j5378l51191k38001J04666M9233
$$ 884614408 884712934 884706318 884409130 884287298 884444535 884429157 884077966 883839965 883944631 883993864
1958H83993864k41756j82331M6909j25408l85583j53482J68503L2961k49863j62720
$$ 883993864 883752108 883569777 883616686 883491278 883105695 882952213 883120716 883153677 882903814 882741094
1978.4H82741094L4213j00255l06070j46508J05559o8545l00527q2790R1195j48952
$$ 882741094 882775307 882675052 882368982 882222474 882328033 882259488 881958961 881876171 881967366 881818414
1998.8H81818414l14057r0063Q5950j14858k99573j19507L7491j68204l13878q6606
$$ 881818414 881504357 881414294 881500244 881385386 881085813 880966306 881003797 880835593 880521715 880435109
2019.2H80435109P1049q1003j97887r3639j8776j34706j93894l7551L7313j22488j84715
$$ 880435109 880506158 880425155 880227268 880133629 880114853 879980147 879786253 879748702 879786015 879663527 879478812
2041.6H79478812j4961K9743j64449k19405k6405P6473l5524r4176j5020k2828j49131
$$ 879478812 879463851 879493594 879329145 879109740 879083335 879159808 879124284 879030108 879015088 878992260 878843129
2064H78843129j70946l756R9242m828r6917k9206L3855l1411o4254N0723J15991J4186
$$ 878843129 878672183 878668427 878767669 878762841 878665924 878636718 878670573 878639162 878574908 878625631 878741622 878755808
2088.5H78755808m3869K9981O2466j848k4617M7445J15693P4506k6047k2590M1246
$$ 878755808 878711939 878741920 878804386 878802538 878777921 878825366 878941059 879015565 878989518 878966928 879008174
2110.9H79008174J5914k4318M3332J14203O7591l814L2603Q7560L9458k2590L6776
$$ 879008174 879024088 878999770 879043102 879157305 879224896 879221082 879253685 879341245 879380703 879358113 879394889
2133.4H79394889J55032J20580j5438k3663P7605J01567L9577O7294J52826J06633
$$ 879394889 879549921 879670501 879655063 879631400 879709005 879810572 879850149 879917443 880070269 880176902
2153.8H80176902j0431O795J13726R7632k623M7088J76191J16170m4406p033J51515
$$ 880176902 880166471 880173266 880286992 880384624 880382001 880429089 880605280 880721450 880677044 880670011 880821526
2176.2H80821526J12295l3319L7134J95384J11043o4671j0848J34945O7592q6606J8597
$$ 880821526 880933821 880900502 880937636 881133020 881244063 881179392 881168544 881303489 881371081 881284475 881303072
2198.6H81303072K21252J09196r8765%J70291L7253j65642k6405J84715N2691j21832
$$ 881303072 881524324 881633520 881534755 881534755 881705046 881742299 881576657 881550252 881734967 881787658 881665826
2221.1H81665826P868J60932J5199j62720j5021J75357L6776j21176K4498J33693o4671
$$ 881665826 881673694 881834626 881849825 881687105 881672084 881847441 881884217 881763041 881787539 881921232 881856561
2243.5H81856561j86324L1709J69099m5121k00749l755J46330o7353j73092R3042J96100
$$ 881856561 881670237 881701946 881871045 881825924 881625175 881621420 881767750 881700397 881527305 881620347 881816447
2265.9H81816447m1604j36555N2631J31011n8114j11163J55330K43783p4327k57731
$$ 881816447 881774843 881638288 881690919 881821930 881763816 881652653 881807983 882051766 881977439 881719708
2286.3H81719708l9696N6326k12967l12925l1232M6253k83838m03463j86146k18153
$$ 881719708 881680012 881736338 881523371 881210446 881179214 881225467 880941629 880538166 880352020 880133867
2306.7H80133867n38707n52177j90496j33098n83767q89421p46846o11484o34849m79758
$$ 880133867 879595160 879042983 878852487 878719389 878135622 877246201 876499355 875887871 875253022 874773264
2327.1H74773264k46406k92062m65870m35353k25365k06291l52383J31249J382172
$$ 874773264 874526858 874234796 873768926 873333573 873108208 872901917 872549534 872680783 874062955
2345.5H74062955J724065M45366j130343j841009j743316j433313o54757K80857O51538
$$ 874062955 875787020 876232386 875102043 873261034 871517718 870084405 869429648 869710505 870362043
2363.8H70362043Q16346J288473J638830J500785J332760J500964J592458J267671
$$ 870362043 871178389 872466862 874105692 875606477 876939237 878440201 880032659 881300330
2380.2H81300330Q52287P01249O04629K55585n7995L8087K01642K4200j59979o0J51277
$$ 881300330 882152617 882853866 883458495 883714080 883656085 883694172 883895814 883920014 883760035 883759975 883911252
2402.6H83911252l1650j51932Q2731K06709l0637j76668L934J18017r2208k21312J4782
$$ 883911252 883879602 883727670 883810401 884017110 883986473 883809805 883813739 883931756 883839548 883618236 883633018
2425H83633018J94966J6094j29581L7968J20282q3088j42634Q7022J60575p0452j79112
$$ 883633018 883827984 883844078 883714497 883752465 883872747 883789659 883647025 883734047 883894622 883824170 883645058
2447.5H83645058R417R1911q3685j14143Q3148J06633j04845j46985K8670K5034j57833
$$ 883645058 883654475 883746386 883662701 883548558 883631706 883738339 883633494 883486509 883515179 883540213 883382380
2469.9H83382380j48296O2942J02163j03772j64926R894L8088j45913j50799O7949
$$ 883382380 883234084 883297026 883399189 883295417 883130491 883140385 883178473 883032560 882881761 882949710
2490.3H82949710P3790j56223j81377M053R477j45435r1315R2328L7134j49668j22428
$$ 882949710 883023500 882867277 882685900 882689953 882699430 882553995 882462680 882555008 882592142 882442474 882320046
2512.7H82320046L6061J4186j13249p2479O2704J5199j72019j72674j9491l9160j29283
$$ 882320046 882356107 882370293 882257044 882184565 882247269 882262468 882090449 881917775 881898284 881859124 881729841
2535.2H81729841k3603J02997L337j81913j66833R060K1040j16825p9095M7564l4153
$$ 881729841 881706238 881809235 881812572 881630659 881463826 881472886 881493926 881377101 881298006 881345570 881311417
2557.6H81311417j76549j24932k563l3021j38521r3579K5272m0471j74105j40489p0452
$$ 881311417 881134868 881009936 881007373 880974352 880835831 880742252 880767524 880727053 880552948 880412459 880342007
2580H80342007j32919j93894q6665J6928o9976j78397j55985j08004j44362j83642
$$ 880342007 880209088 880015194 879928529 879945457 879875481 879697084 879541099 879433095 879288733 879105091
2600.4H79105091j02162j9491j20938k55346k09272j05441j30534k09331j77205j04070
$$ 879105091 879002929 878983438 878862500 878607154 878397882 878292441 878161907 877952576 877775371 877671301
2620.8H77671301j63495k32399j39653o9321j56045k42710j70529m9829j38640k87235
$$ 877671301 877507806 877275407 877135754 877066433 876910388 876667678 876497149 876447320 876308680 876021445
2641.2H76021445k11358j06454j76191k41936j49071o9320j86026k78890j51694n2750
$$ 876021445 875810087 875703633 875527442 875285506 875136435 875067115 874881089 874602199 874450505 874397755
2661.6H74397755j69576k41279j08302m4703j71364k52545j47581m6432j41203k78533
$$ 874397755 874228179 873986900 873878598 873833895 873662531 873409986 873262405 873215973 873074770 872796237
2682H72796237k18153r3400j86026l16084k09629j07110k31742k99693j43110n7817
$$ 872796237 872578084 872484684 872298658 871982574 871772945 871665835 871434093 871134400 870991290 870933473
2702.4H70933473j89185k93911k07364j39177k37882k78354j61052j04486j92881k38240
$$ 870933473 870744288 870450377 870243013 870103836 869865954 869587600 869426548 869322062 869129181 868890941
2722.8H68890941j48058j67548l48628l34382j39177r3818k17855l00288k25127j29759
$$ 868890941 868742883 868575335 868226707 867892325 867753148 867659330 867441475 867141187 866916060 866786301
2743.2H66786301j40428j49966j19030j89483l44336l56198k10166j96099l36647k91169
$$ 866786301 866645873 866495907 866376877 866187394 865843058 865486860 865276694 865080595 864743948 864452779
2763.6H64452779q3029q5354k92420l31402j89006k48075m52697l93808j70231j77622
$$ 864452779 864369750 864284396 863991976 863660574 863471568 863223493 862770796 862376988 862206757 862029135
2784H62029135l25501l02493k44975l65913m60983l38316k29239l92079o08147n54204
$$ 862029135 861703634 861401141 861156166 860790253 860329270 859990954 859761715 859369636 858761489 858207285
2804.4H58207285l41117l10302m98473n56469m10617m12583n58794n43058m51505n28037
$$ 858207285 857866168 857555866 857057393 856500924 856090307 855677724 855118930 854575872 854124367 853596330
2824.8H53596330o49333n67019m34459n80728q28087q25763q89659j352489j754939
$$ 853596330 852946997 852379978 851945519 851364791 850536704 849710941 848821282 847468793 845713854
2843.1H45713854j758278j655221j584351j255273o34253k14339j94788l01659l80635
$$ 845713854 843955576 842300355 840716004 839460731 838826478 838612139 838417351 838115692 837735057
2861.5H37735057m80592o95229r04977q38399o25849o97196q93533p23362m80234n75066
$$ 837735057 837254465 836559236 835654259 834815860 834190011 833492815 832599282 831875920 831395686 830820620
2881.9H30820620o86467n97953n79119p60079q52704o78658o20902q82625j006007
$$ 830820620 830134153 829536200 828957081 828197002 827344298 826665640 826044738 825162113 824156106
2900.2H24156106q67486q92818j140178j248896j166820j280070j650333j777828j474023
$$ 824156106 823288620 822395802 821255624 820006728 818839908 817559838 815909505 814131677 812657654
2918.6H12657654j152575r41395n67854o8307J72258M2319Q046K78235N07116O39797
$$ 812657654 811505079 810563684 809995830 809927523 810099781 810142100 810150146 810428381 810935497 811575294
2939H11575294R25540J158298R30190M52458K30134K40207K2709l07679k10106J55389
$$ 811575294 812500834 813659132 814589322 815041780 815271914 815512121 815534830 815227151 815017045 815172434
2959.4H15172434K70188J41442J51813L18408L70740L93153N06043N01812L58641K29537
$$ 815172434 815442622 815584064 815735877 816054285 816425025 816818178 817324221 817826033 818184674 818414211
2979.8H18414211Q6248l7849p0393L1233K87473L08991r9779l58104l14713l77059
$$ 818414211 818500459 818462610 818392217 818423450 818710923 819019914 818920135 818562031 818247318 817870259
3000.2H17870259n03182n03719l78430k24113j90854l04878m92752p04944q76248q73565
$$ 817870259 817367077 816863358 816484928 816260815 816069961 815765083 815272331 814567387 813691139 812817574
3020.6H12817574o89209o45220q01504p64251n85377n96642q37744r87410p43747n50210
$$ 812817574 812128365 811483145 810681641 809917390 809332013 808735371 807897627 806910217 806166470 805616260
3041H05616260p79868j041650j051546r72807j000941j037121r60230j000762j147509
$$ 805616260 804836392 803794742 802743196 801770389 800769448 799732327 798772097 797771335 796623826
3059.3G96623826j051903q13067p76171r43959j049042j002848r23514p83921o78658
$$ 796623826 795571923 794758856 793982685 793038726 791989684 790986836 790063322 789279401 788600743
3077.7G88600743q45313j107335j169801j120389j051664j041234j189887j264334
$$ 788600743 787755430 786648095 785478294 784357905 783306241 782265007 781075120 779810786
3094G79810786j163184j080692j088619j150370j157641j092077j100600j199901j159548
$$ 779810786 778647602 777566910 776478291 775327921 774170280 773078203 771977603 770777702 769618154
3112.4G69618154j003206j020789j201988j491248j765013j711249j429916j292288
$$ 769618154 768614948 767594159 766392171 764900923 763135910 761424661 759994745 758702457
3128.7G58702457j428783j594901j478493j271665j348496j640320j794338j740932
$$ 758702457 757273674 755678773 754200280 752928615 751580119 749939799 748145461 746404529
3145G46404529j671374j514673j323879j530946j962959k020955j847804j814127j837432
$$ 746404529 744733155 743218482 741894603 740363657 738400698 736379743 734531939 732717812 730880380
3163.4G30880380j814485j799464j830280j860678j866520j910686k000094j994550
$$ 730880380 729065895 727266431 725436151 723575473 721708953 719798267 717798173 715803623
3179.7G15803623j931071j966059k021015j992822j966536k020001k101243k124130
$$ 715803623 713872552 711906493 709885478 707892656 705926120 703906119 701804876 699680746
3196F99680746k069056k024532k032757k008736j968801k009988k045095j988470j950860
$$ 699680746 697611690 695587158 693554401 691545665 689576864 687566876 685521781 683533311 681582451
3214.3F81582451j986921k025962j994431j927972j940190j989365j902282j695812
$$ 681582451 679595530 677569568 675575137 673647165 671706975 669717610 667815328 666119516
3230.7F66119516j644433j893520k096593j955390j747787j681924j625896j610815
$$ 666119516 664475083 662581563 660484970 658529580 656781793 655099869 653473973 651863158
3247F51863158j700402j696825j538157j449108j564443j655519j523733j386226j374304
$$ 651863158 650162756 648465931 646927774 645478666 643914223 642258704 640734971 639348745 637974441
3265.3F37974441j318693j206577j312315j581252j680851j636326j595855j590014
$$ 637974441 636655748 635449171 634136856 632555604 630874753 629238427 627642572 626052558
3281.6F26052558j580894j545250j516879j467228j489222j673042j857400j960814
$$ 626052558 624471664 622926414 621409535 619942307 618453085 616780043 614922643 612961829
3298F12961829j958609j760185j569807j756370k164007k383828k403557k324522k235114
$$ 612961829 611003220 609243035 607673228 605916858 603752851 601369023 598965466 596640944 594405830
3316.3E94405830k231598k278864k278209k260029k394438k562225k529621k444327
$$ 594405830 592174232 589895368 587617159 585357130 582962692 580400467 577870846 575426519
3332.6E75426519k422273k374828k453089k658725k727806k741754k681434k454341
$$ 575426519 573004246 570629418 568176329 565517604 562789798 560048044 557366610 554912269
3348.9E54912269k514720k922833l075719k831101k597094k622306k654970k420544
$$ 554912269 552397549 549474716 546398997 543567896 540970802 538348496 535693526 533272982
3365.3E33272982k249778k500236k848267k803982k475082k238811k096712j981735
$$ 533272982 531023204 528522968 525674701 522870719 520395637 518156826 516060114 514078379
3381.6E14078379j888395j729071j397967j017571j061737j470268j492262r44316
$$ 514078379 512189984 510460913 509062946 508045375 506983638 505513370 504021108 503076792
3397.9E03076792o05405j010537j447677j189977p38502o07043o31065p04526p16895
$$ 503076792 502471387 501460850 500013173 498823196 498084694 497477651 496846586 496142060 495425165
3416.3D95425165n20289l42012k34157K2233L39895N22674M76986N19454P56473O99848
$$ 495425165 494904876 494562864 494328707 494350940 494690835 495213509 495690495 496209949 496966422 497666270
3436.6D97666270L80069L57329P31439J128465J291990J259565J289308J423538J572013
$$ 497666270 498046339 498403668 499135107 500263572 501555562 502815127 504104435 505527973 507099986
3455E07099986J828611K037108J900375J838386K201855K405405K033591J548410J550078
$$ 507099986 508928597 510965705 512866080 514704466 516906321 519311726 521345317 522893727 524443805
3473.4E24443805J941562K354026K376258K012611J965582K259612K297223K214968
$$ 524443805 526385367 528739393 531115651 533128262 535093844 537353456 539650679 541865647
3489.7E41865647K350330K496720K527117K452433K386809K385199K301991K207815
$$ 541865647 544215977 546712697 549239814 551692247 554079056 556464255 558766246 560974061
3506E60974061K299905K587557K894938K836228K530336K524674K764284K993286K918482
$$ 560974061 563273966 565861523 568756461 571592689 574123025 576647699 579411983 582405269 585323751
3524.4E85323751K606869K611816K911389L123879L250599L252506L141761L267586
$$ 585323751 587930620 590542436 593453825 596577704 599828303 603080809 606222570 609490156
3540.7F09490156L414869L256917L016651L008604L148020L319263L474295L529549
$$ 609490156 612905025 616161942 619178593 622187197 625335217 628654480 632128775 635658324
3557F35658324L567755L619909L442943L092766L521383M392982M304528L895819L926575
$$ 635658324 639226079 642845988 646288931 649381697 652903080 657296062 661600590 665496409 669422984
3575.3F69422984M124701M291237M486978M438817L995836L907859M523874M586458
$$ 669422984 673547685 677838922 682325900 686764717 690760553 694668412 699192286 703778744
3591.7G03778744M303157M434049M652143M687488M760980M626990M158377M069746
$$ 703778744 708081901 712515950 717168093 721855581 726616561 731243551 735401928 739471674
3608G39471674M332006M367709M377723M114032L904461M487038M652143L922462K914786
$$ 739471674 743803680 748171389 752549112 756663144 760567605 765054643 769706786 773629248 776544034
3626.3G76544034K798677M196644M383623L717959L404737L208458L086567K974749
$$ 776544034 779342711 783539355 787922978 791640937 795045674 798254132 801340699 804315448
3642.6H04315448K516031J771152J850307L082097L102243K231598K256453K564966
$$ 804315448 806831479 808602631 810452938 813535035 816637278 818868876 821125329 823690295
3659H23690295K056539J526296J396060R88067N74588J021386Q69512L65794J291752
$$ 823690295 825746834 827273130 828669190 829657257 830231845 831253231 832122743 832488537 833780289
3677.3H33780289J878738J600504J356840R46224L03030J81317J001537J552045J404703
$$ 833780289 835659027 837259531 838616371 839562595 839865625 840046942 841048479 842600524 844005227
3695.7H44005227R72331N72264N77509Q96335P96437K48254k02477K60770J160741
$$ 844005227 844977558 845549822 846127331 847023666 847820103 848068357 847865880 848126650 849287391
3714H49287391J020968L72171M8518Q2731J68622K99752M64260K50876j85728k00152
$$ 849287391 850308359 850680530 850729048 850811779 850980401 851280153 851744413 851995289 851809561 851609409
3734.4H51609409N91934J195430N68986o07609o81997L06010j4841l52323P32243J177966
$$ 851609409 852201343 853396773 853965759 853358150 852676153 852982163 852967322 852614999 853347242 854525208
3754.8H54525208N31257O9737L33965M42445J35124p8201p2897L10540N81980K81751
$$ 854525208 855056465 855126202 855460167 855902612 856037736 855959535 855886638 856197178 856779158 857060909
3775.2H57060909q5652n1438J90794J61529J24573K40088K02119N7698j65105k94567
$$ 857060909 856975257 856923819 857114613 857276142 857400715 857640803 857842922 857900620 857735515 857440948
3795.6H57440948k08377l95060k22146M18365J46806N4002O08503M85480k53916n27858
$$ 857440948 857232571 856837511 856615365 857033730 857180536 857234538 857843041 858328521 858074605 857546747
3816H57546747k31445l89338n4597N74231M44173K26319j3709j35898n0307l41594
$$ 857546747 857315302 856925964 856871367 857445598 857889771 858116090 858102381 857966483 857916176 857574582
3836.4H57574582n86152j13666M38273P44939O70075Q5831r49204j660884r0718J295388
$$ 857574582 856988430 856874764 857313037 858057976 858728051 858813882 857864678 856203794 856113076 857408464
3856.8H57408464P74801p034m07099j50204M5121k56539j45971K46226M67480L24130
$$ 857408464 858183265 858176231 857769132 857618928 857664049 857407510 857261539 857507765 857975245 858299375
3877.2H58299375k13206j58608J39832M9770J25826o7175k47538K13027L37422j73152
$$ 858299375 858086169 857927561 858067393 858117163 858242989 858175814 857928276 858141303 858478725 858305573
3897.6H58305573n20408m58359j92106L76046O79135M30524J48773j04189l18527j82330
$$ 858305573 857785165 857326806 857134700 857510746 858189881 858620405 858769178 858664989 858346462 858164132
3918H58164132K8610l5346p0691J27495J42931o7055q702K07961J72197j7285j67906
$$ 858164132 858192742 858157396 858086705 858214200 858357131 858290076 858281374 858489335 858661532 858644247 858476341
3940.4H58476341j50740K9027N9426k146Q5473J31369N4300K6881n364p5996J7703
$$ 858476341 858325601 858354628 858414054 858411908 858497381 858628750 858683050 858709931 858704567 858628571 858646274
3962.9H58646274J47462P8499l0756p928K9028o56L1710J05679J61469J51575j6392
$$ 858646274 858793736 858872235 858841479 858833551 858862579 858861923 858893633 858999312 859160781 859312356 859295964
3985.3H59295964j71005r9719L3140N8532P4804Q4102
$$ 859295964 859124959 859025240 859058380 859116912 859191716 859275818
3997.5H59275818
$$ 859275818
##END=$$ End of the data block
