##TITLE=$$ Begin of the data block
##JCAMP-DX=5.00 $$ ACD/SpecManager v 10.08
##SPECTROMETER/DATA SYSTEM=Alpha
##DATE=07 Apr 2014 11:14:18
##DATA TYPE=INFRARED SPECTRUM
##DATA CLASS=XYDATA
##ORIGIN=
##OWNER=
##NPOINTS=1765
##FIRSTX=399.75695801
##LASTX=3997.56933594
##MAXX=3997.56933594
##MINX=399.75695801
##MAXY=0.88593644
##MINY=0.49517038
##XFACTOR=1.0000000000
##YFACTOR=1.000000000000000e-9
##FIRSTY=0.77600622
##DELTAX=2.03957629
##XUNITS=1/CM
##YUNITS=ARBITRARY UNITS
##XYDATA=(X++(Y..Y))
399.8G76006222m011572J120329J073063l859282k789795K353489J256406k636313
$$ 776006222 771994650 773114979 774188042 770328760 767538965 769892454 771148860 768512547
416.1G68512547o79851K509118j967848m339635M44710L081262j277745l360807P02202
$$ 768512547 767832696 770341814 768373966 764034331 764479041 767560303 766282558 762921751 763623953
434.4G63623953J736879k261340j997590K336442J456320k917409j603782K329052
$$ 763623953 765360832 763099492 761101902 763438344 764894664 761977255 760373473 762702525
450.7G62702525P12990k786457o94633K393484n96582l075540n7519K089441p80046
$$ 762702525 763415515 760629058 759934425 762327909 761731327 758655787 758598268 760687709 759907663
469.1G59907663k222061P70390J334727j936198k107799J276374J188636k045930j285731
$$ 759907663 757685602 758455992 759790719 757854521 755746722 757023096 758211732 756165802 754880071
487.5G54880071J921534R00567k156496r67264J434147l27647k767861q36372J424789
$$ 754880071 756801605 757702172 755545676 754578412 756012559 755684912 752917051 752080679 753505468
505.8G53505468l84450k059877j21355J120866j175761k292157J58131R01640j414538
$$ 753505468 753121018 751061141 750939786 752060652 750884891 748592734 748750865 749652505 748237967
524.2G48237967j830101M08531K63035k087772j729607P43806L53932j863479j078785
$$ 748237967 746407866 746816397 747079432 744991660 743262053 744005859 744359791 742496312 741417527
542.5G41417527J057625J02460j875639r05633P29025m97401j950383n21004O34134
$$ 741417527 742475152 742577612 740701973 739796340 740525365 740027964 738077581 737556577 738190711
560.9G38190711j098216k189994m64618M23968j357794k114952m10616K30372j351595
$$ 738190711 737092495 734902501 734437883 734861851 733504057 731389105 730978489 731208861 729857266
579.2G29857266j686454j2457J54733j358509j191616K59757q8215j481235j083374
$$ 729857266 728170812 728158355 728313088 726954579 725762963 726022720 725934505 724453270 723369896
597.6G23369896J18018o13153j991511j298129l7849n80788j400351m45188P73788
$$ 723369896 723487914 722874761 720883250 719585121 719547272 718966484 717566133 717120945 717894733
616G17894733O24478P41064K208650L082037K164007J532852K409995K812862J788080
$$ 717894733 718519211 719260275 721468925 724550962 726714969 728247821 730657816 733470678 735258758
634.3G35258758J247227J953960K064168R89735O13690J527309J840651R92119O48737
$$ 735258758 736505985 738459945 740524113 741513848 742127538 743654847 745495498 746487617 747136354
652.7G47136354J214445J534045J616597K175748K693534K027750O44088J036346K545655
$$ 747136354 748350799 749884844 751501441 753677189 756370723 758398473 759042561 760078907 762624562
671G62624562K036214J198768J377046J805962J406848R25660J235485J465440R61006
$$ 762624562 764660776 765859544 767236590 769042552 770449400 771375060 772610545 774075985 775036991
689.4G75036991O26325R46760J074732O32405N29349R94861J053095O60896P90239
$$ 775036991 775663316 776610076 777684808 778317213 778846562 779841423 780894518 781555414 782345653
707.7G82345653J264393J262903J011074J086652J239717J064599R81330J238883J340747
$$ 782345653 783610046 784872949 785884023 786970675 788210392 789274991 790256321 791495204 792835951
726.1G92835951J079142Q96394J039922J113654P82907N50329Q47102J045823Q05497
$$ 792835951 793915093 794811487 795851409 796965063 797747970 798298299 799145401 800191224 800996721
744.4H00996721P91490J183927J220047Q31485Q19385J185596J113415O75440P24137
$$ 800996721 801788211 802972138 804192185 805023670 805843055 807028651 808142066 808817506 809541643
762.8H09541643R97007P14182L19422N22315P33078K56657k04801j8776J57953k08974
$$ 809541643 810538650 811252832 811572254 812094569 812827647 813084304 812879503 812860727 813018680 812809706
783.2H12809706m80593O140N65350M60923O22332J649141K305567K037645K070188
$$ 812809706 812329113 812335253 812900603 813361526 813983858 815632999 817938566 819976211 822046399
801.6H22046399K672076K603352J827121J614750J928687J524627N94199M14133P27772
$$ 822046399 824718475 827321827 829148948 830763698 832692385 834217012 834811211 835225344 835953116
819.9H35953116K16186q58843j065314o45101j031220j820385j590192r21309j181603
$$ 835953116 836169302 835310459 834245145 833600044 832568824 830748439 829158247 828236938 827055335
838.3H27055335j727164j273334n29229p03931q55983K93851J661659J929283K132535
$$ 827055335 825328171 824054837 823525608 822821677 821965694 822259545 823921204 825850487 827983022
856.6H27983022L301978M029691L291249K672017L233314L363966J948834R31919J590430
$$ 827983022 831285000 835314691 838605940 841277957 844511271 847875237 849824071 850755990 852346420
875H52346420J914919P37905p5459M64976N03003p28190j201212k80500j549q36134
$$ 852346420 854261339 854999244 854923785 855388761 855891764 855163574 853962362 853681862 853680313 852844179
895.4H52844179o94454P13170J079559J01387J9431R37820O61433p34806r97782k50816
$$ 852844179 852149725 852862895 853942454 854043841 854063272 855001092 855662525 854927719 853929937 853679121
915.8H53679121p16508k010345j765490m28259l28422r95457k97010R94384O71923
$$ 853679121 852962613 850952268 849186778 848758519 848430097 847434640 847137630 848132014 848803937
934.1H48803937l96013l2484Q42213J45197r98199n07533K45452q12531k125204j705169
$$ 848803937 848407924 848375440 849217653 849362850 848364651 847857118 848102570 847290039 845164835 843459666
954.5H43459666j178503k408207l756642l439605l198445m772186o192267n640924
$$ 843459666 842281163 839872956 836116314 832676709 829478264 824706078 818513811 812872887
970.8H12872887m925847n517006n549968l921926k814471l407181l597498k305924
$$ 812872887 807947040 802430034 796880066 792958140 790143669 786736488 783138990 780833066
987.1G80833066j587809k288460k304256r24111l09348j161158j318812k51293k36631
$$ 780833066 779245257 776956797 774652541 773728430 773419082 772257924 770939112 770687819 770451188
1005.5G70451188j723647k387345j722395j859308l108143l249288k077818j909077
$$ 770451188 768727541 766340196 764617801 762758493 759650350 756401062 754323244 752414167
1021.8G52414167k910376k876162j747966j677454k594709k325714j068830j014352
$$ 752414167 749503791 746627629 744879663 743202209 740607500 738281786 737212956 736198604
1038.1G36198604j922011j736045q30591j170516k193034j896023q11816p68065j168728
$$ 736198604 734276593 732540548 731709957 730539441 728346407 726450384 725638568 724870503 723701775
1056.5G23701775l43323Q62599N71787n56528p23422n25951j495958k656638k337993
$$ 723701775 723358452 724221051 724792838 724236310 723512888 722986937 721490979 718834341 716496348
1074.8G16496348j570999k046824k789855k288222j619279k277375l056049k337873
$$ 716496348 714925349 712878525 710088670 707800448 706181169 703903794 700847745 698509872
1091.2F98509872j189947j115322j242936l79622L76701k01821q90732m05907M4107
$$ 698509872 697319925 696204603 694961667 694582045 694958746 694756925 693866193 693460286 693504393
1109.5F93504393p22170j439810j031279r64224k252758l035843j906813o98149p46310
$$ 693504393 692782223 691342413 690311134 689346910 687094152 684058309 682151496 681453347 680707037
1127.9F80707037r3221J636386K043366J108289R53734J920819K279163J386761Q39412
$$ 680707037 680613816 682250202 684293568 685401857 686355591 688276410 690555573 691942334 692781746
1146.2F92781746J395464J629651R17137P16567J570046J967728J461088J644910K942681
$$ 692781746 694177210 695806861 696723998 697440565 699010611 700978339 702439427 704084337 707027018
1164.6G07027018L671944L339112L540874M567563M739285L831505L580332M247189
$$ 707027018 710698962 714038074 717578948 722146511 726885796 730717301 734297633 738544822
1180.9G38544822M104852K901793K349019K623081K033591O14286K12848Q34346P67112
$$ 738544822 742649674 745551467 747900486 750523567 752557158 753171444 753384292 754218638 754985750
1199.3G54985750J73211O79374J864671J892865J044691J058638J631796J174033K16663
$$ 754985750 755158961 755838335 757703006 759595871 760640562 761699200 763330996 764505029 764721692
1217.6G64721692M54962J309335J037002K54929O56664J545012J267612N47826J002312
$$ 764721692 765176654 766485989 767522991 767777920 768434584 769979596 771247208 771795034 772797346
1236G72797346J813054J384378O07669R45866J431942P23302j35183K12610P78019
$$ 772797346 774610400 775994778 776602447 777548313 778980255 779703557 779568374 779780984 780559003
1254.3G80559003K68698k61843M89116J389801J122415Q42333J710951K459824J967490
$$ 780559003 780827701 780565858 781054974 782444775 783567190 784409523 786120474 788580298 790547788
1272.7G90547788J548171K236426K698720K029001J623452K351165K806306K131819
$$ 790547788 792095959 794332385 797031105 799060106 800683558 803034723 805841029 807972848
1289H07972848J722098K329171K500474J571894J057207J581967J645088P00176K92718
$$ 807972848 809694946 812024117 814524591 816096485 817153692 818735659 820380747 821080923 821373641
1307.4H21373641R39549J049101J73747o8187P12275R14931K00749J13904Q83401R41038
$$ 821373641 822313190 823362291 823536038 823467851 824180126 825095057 825295806 825409710 826293111 827234149
1327.8H27234149O9618j24335M78387L35753n96583o45161K92242M03106k92718k53916
$$ 827234149 827303767 827179432 827657819 827993572 827396989 826751828 827044070 827447176 827154458 826900542
1348.1H26900542M00960J99139n85734m76718J58011k17616j175523r51946k63452
$$ 826900542 827301502 827500641 826914907 826438189 826596200 826378584 825203061 824251115 823987663
1366.5H23987663o90282j400709j348436j108586j636744l182709n147219n496263
$$ 823987663 823297381 821896672 820548236 819439650 817802906 814620197 809472978 803976715
1382.8H03976715k282918K546430M571616L161133R94265n70178o87421n07176j002252
$$ 803976715 801693797 804240227 808811843 811972976 812967241 812397063 811709642 811202466 810200214
1401.2H10200214j525640j389444q97586j170278j529634r01639k78414q99017j545071
$$ 810200214 808674574 807285130 806387544 805217266 803687632 802785993 802507579 801608562 800063491
1419.5H00063491m88699J59443k95580n35011j28746L68953J75655k51711L88444J070678
$$ 800063491 799574792 799734235 799438655 798903644 798774898 799143851 799319506 799067795 799456239 800526917
1439.9H00526917P16150N45919J055062J378893J226962J347959J817584K128899K476514
$$ 800526917 801243067 801788986 802844048 804222941 805449903 806797862 808615446 810744345 813220859
1458.3H13220859K883017K993703K860963K533018K475977K778590L114164K815306
$$ 813220859 816103876 819097579 821958542 824491560 826967537 829746127 832860291 835675597
1474.6H35675597K494455K449631J915276J059711O35863N77628O9917m99368k09451
$$ 835675597 838170052 840619683 842534959 843594670 844230533 844808161 844878078 844378710 844169259
1493H44169259j64986r79960j481354r25600m80414j600504l614127k147615p97034
$$ 844169259 844004273 843024313 841542959 840617359 840136945 838536441 834922314 832774699 831977665
1511.3H31977665j240432j946211j877904j326263j695454j632988r23872p45535q15630
$$ 831977665 830737233 828791022 826913118 825586855 823891401 822258413 821334541 820589006 819773376
1529.7H19773376j350343j543105n53906o42776k211988j615644N2154P6950j51396
$$ 819773376 818423033 816879928 816326022 815683246 813471258 811855614 811907768 811984718 811833322
1548H11833322N961L23057J63376k98798j124084p45416K87116k23160p03335j323163
$$ 811833322 811839283 812162340 812325716 812026918 810902834 810157418 810444534 810221374 809518039 808194876
1568.4H08194876k118290j759350k016127l323734l101528k641141k950013l291011
$$ 808194876 806076586 804317236 802301109 798977375 795875847 793234706 790284693 786993682
1584.7G86993682l819644m165649m127622m245758m701555m749060m403233m453659
$$ 786993682 783174038 779008389 774880767 770635009 765933454 761184394 756781161 752327502
1601.1G52327502m786790m747748m548132m708708m763365m430592m921615n589306
$$ 752327502 747540712 742792964 738244832 733536124 728772759 724342167 719420552 713831246
1617.4G13831246l853619k946079l437161l089846k649366k153635j116992r40978
$$ 713831246 709977627 707031548 703594387 700504541 697855175 695701540 694584548 693643570
1633.7F93643570j366198K5451J574695K070546K165258K588392L854155L897488L487230
$$ 693643570 692277372 692302823 693877518 695948064 698113322 700701714 704555869 708453357 711940587
1652G11940587M831135N066395M337251M170477M520893N007685M537999M100204M557132
$$ 711940587 716771722 721838117 726175368 730345845 734866738 739874423 744412422 748512626 753069758
1670.4G53069758M652977M496098M643142M486799M210830M022479M681230M965901
$$ 753069758 757722735 762218833 766861975 771348774 775559604 779582083 784263313 789229214
1686.7G89229214M465699M377485L883600L745854M226506M316568M849970M488647
$$ 789229214 793694913 798072398 801955998 805701852 809928358 814244926 819094896 823583543
1703H23583543L776968L689527L266394K782166K472103K113402J959920K264023K271235
$$ 823583543 827360511 831050038 834316432 837098598 839570701 841684103 843644023 845908046 848179281
1721.4H48179281J891076J562894J395344J468718J309574R20952J247823J486540
$$ 848179281 850070357 851633251 853028595 854497313 855806887 856727839 857975662 859462202
1737.7H59462202J279890J209736J308739J384735J264990J013159J146734J286626
$$ 859462202 860742092 861951828 863260567 864645302 865910292 866923451 868070185 869356811
1754H69356811R99332O66379N73159P62701R11057O28412L70919L22461K50459M46379
$$ 869356811 870356143 871022522 871595681 872358382 873269439 873897851 874268770 874591231 874841690 875288069
1774.4H75288069O81639P07030N53429L51429L69847N79596M41849j02699n8055O03020
$$ 875288069 875969708 876676738 877230167 877581596 877951443 878531039 878972888 878870189 878812134 879415154
1794.8H79415154O01829J48892J53840M97162M10914Q9765J03116L60668L30388R1672
$$ 879415154 880016983 880165875 880319715 880816877 881227791 881317556 881420672 881781340 882111728 882203400
1815.2H82203400J56164M12107K54869j40607m9055K70844J12355O4492L67105L83854
$$ 882203400 882359564 882771671 883026540 882885933 882836878 883107722 883220077 883284569 883651674 884035528
1835.6H84035528Q0526j08898o855J14024J54734J47938K61963L38077L5823j95623
$$ 884035528 884116054 884007156 884000301 884114325 884269059 884416997 884678960 885017037 885052860 884857237
1856H84857237P0989L35455J19329j16944n0903Q583l5643K1934K28584L20137L7908
$$ 884857237 884928226 885263681 885383010 885266066 885215163 885223746 885188103 885210037 885438621 885758758 885796666
1878.4H85796666j84834K8253J63436j18435k83599J20402L47733l9637k00212J19388
$$ 885796666 885611832 885640085 885803521 885685086 885401487 885521889 885869622 885829985 885629773 885749161
1898.8H85749161J87278j42992k15113J07706J84178j11878j30653J18732K265l13580
$$ 885749161 885936439 885793447 885578334 885686040 885870218 885758340 885627687 885746419 885748684 885435104
1919.2H85435104k22027J43230K17974r4354j59621Q2552J7643k82109k01046J24991
$$ 885435104 885213077 885356307 885574281 885479927 885320306 885402858 885420501 885138392 884937346 885062337
1939.6H85062337K4915k91467j60396J22368m649l09408k11358R6679P868k80857j86861
$$ 885062337 885087252 884795785 884635389 884757757 884753108 884443700 884232342 884329021 884336889 884056032 883869171
1962.1H83869171P2479p2062l46839j67906J34766J6689k33054j26362O1274j02640
$$ 883869171 883941650 883869588 883522749 883354843 883489609 883506298 883273244 883146882 883208156 883105516
1982.5H83105516l38792j89603P5639n4062k65002j04785M2021j47044k82765p9095
$$ 883105516 882766724 882577121 882652760 882598698 882333696 882228911 882270932 882123888 881841123 881762028
2002.8H81762028O6161j35601k95400j13190N4181j35600l06190j05559O5148p3791
$$ 881762028 881828189 881692588 881397188 881283998 881338179 881202579 880896389 880790830 880855978 880782187
2023.2H80782187k07186j05440k2293j42872j91450k0146M8577j13070j87099n5670
$$ 880782187 880575001 880469561 880447268 880304396 880112946 880092800 880141377 880028307 879841208 879785538
2043.6H79785538m351j56284k00093j0073P3552o3181j07407k146l636j38581j44183
$$ 879785538 879781187 879624903 879424810 879414737 879488289 879425108 879317701 879315555 879311919 879173338 879029155
2066.1H79029155M4405R9421m7922j18733k8312M0352j9133m1246O4730J12236R954
$$ 879029155 879073560 879172981 879125059 879006326 878978014 879018366 878999233 878957987 879022717 879134953 879144907
2088.5H79144907n0068J7047N1379k0623m8578M2379J16408P4983j3113k5690J8418
$$ 879144907 879094839 879111886 879163265 879142642 879094064 879136443 879252851 879327834 879314721 879289031 879307449
2110.9H79307449J7524N483P2837J27971N6744l1889J3173R1434M7326o140P4745J68383
$$ 879307449 879324973 879330456 879403293 879531264 879588008 879556119 879569292 879660726 879708052 879701912 879776657 879945040
2135.4H79945040R5427k9505o020R7335Q9884P510M6849J56164J22547O855J3828R9003
$$ 879945040 880040467 880010962 880004942 880102277 880192161 880199671 880246520 880402684 880525231 880532086 880545914 880644917
2159.9H80644917R6143L0994P1466J60754P6830o5446L219J62840J13547k7120N3525
$$ 880644917 880741060 880772054 880843520 881004274 881081104 881015658 881018877 881181717 881295264 881268144 881321669
2182.3H81321669J98543R5665n5134K1934J32621M0233q7023K8014J97828P1585j17063
$$ 881321669 881520212 881615877 881560743 881582677 881715298 881755531 881668508 881696522 881894350 881965935 881848872
2204.8H81848872M947J79529L1173j53958J2278J98662M3512j15276K0624J46448k324
$$ 881848872 881853819 882033348 882064521 881910563 881922841 882121503 882165015 882049739 882070363 882216811 882214487
2227.2H82214487j39356J6332J75774K2471j39952J1742J35720m5300j29997P6472
$$ 882214487 882075131 882091463 882267237 882289708 882149756 882161498 882297218 882251918 882121921 882198393
2247.6H82198393J29342j05500j90198J2159J09494q7500j80065R1672K27987n2809
$$ 882198393 882327735 882222235 882032037 882044196 882153690 882066190 881886125 881977797 882205784 882152975
2268H82152975j80126O4850J54734q0705j14322K01464K61009p1287k24173k7061L5405
$$ 882152975 881972849 882037699 882192433 882111728 881997406 882198870 882459879 882388592 882164419 882137358 882172763
2290.4H82172763k16484k74420K5034Q1838k63334l70860j42574j81854n19931n28634
$$ 882172763 881956279 881681859 881706893 881788731 881525397 881154537 881011963 880830109 880310178 879781544
2310.8H79781544j61111q9348m87983p71165o36577n26786n92172m70102k67804l00824
$$ 879781544 879620433 879531085 879043102 878271937 877635360 877108574 876516402 876046300 875778496 875477672
2331.2H75477672m54486l92258j67727k49148m06384J73330J356006J601457M03106
$$ 875477672 875023186 874630928 874463201 874214053 873807669 873980999 875337005 876938462 877341568
2349.6H77341568j033663j683057j589059j264871n18441K70367N49555P28547J194835
$$ 877341568 876307905 874624848 873035789 871770918 871252477 871522844 872072399 872800946 873995781
2367.9H73995781J502573J329601J185060J362204J424373J117110P66516O53147N44727
$$ 873995781 875498354 876827955 878013015 879375219 880799592 881916702 882683218 883336365 883881092
2386.3H83881092K01047n9367P8738K26617J1563j79589J848J55807m2558j53005Q4996
$$ 883881092 884082139 884022772 884101510 884328127 884339690 884160101 884161949 884317756 884275198 884122193 884207189
2408.7H84207189J87874n3167j75715L0398J51277o9439k30074m6015J04487k7836
$$ 884207189 884395063 884341896 884166181 884196579 884347856 884278417 884048343 884002328 884106815 884078979
2429.1H84078979r4830Q4698J43826n9128j32442Q2314J68801o0201j74761K0385J00434
$$ 884078979 883984149 884068847 884212673 884153545 884021103 884103417 884272218 884212017 884037256 884057641 884158075
2451.5H84158075r4712j33395P5102J02997j02282j35243M2260L3021j74344j60277
$$ 884158075 884063363 883929968 884005070 884108067 884005785 883870542 883912802 883945823 883771479 883611202
2471.9H83611202Q4400J14203j38700k19643k2948K4974j46508j23799J23620J18256
$$ 883611202 883695602 883809805 883671105 883451462 883428514 883453488 883306980 883183181 883306801 883425057
2492.3H83425057j39892j69873Q463J8478j34707j25527M4823K6107j45972j27793
$$ 883425057 883285165 883115292 883123755 883142233 883007526 882881999 882926822 882952929 882806957 882679164
2512.7H82679164J2398k7001j33574m7326R1493K5571j52171j47462p748k7538j31905
$$ 882679164 882691562 882664561 882530987 882483661 882575154 882600725 882448554 882301092 882293344 882265806 882133901
2535.2H82133901n0723Q7678k682j79112j26243L2902j8299j47581n2213Q9407k7240
$$ 882133901 882083178 882170856 882168174 881989062 881862819 881895721 881877422 881729841 881677628 881767035 881739795
2557.6H81739795k04026j44363j0490n5373j58250q7679L9756j9133j48236j27793
$$ 881739795 881535769 881391406 881380916 881325543 881167293 881079614 881119370 881100237 880952001 880824208
2578H80824208p6651j61171k05994o1631K8074j02282k14100j57296q6308j38879k09689
$$ 880824208 880747557 880586386 880380392 880318761 880346835 880244553 880030453 879873157 879786849 879647970 879438281
2600.4H79438281j17123q464j17481k68221k20179j02163j11043j75834j43110p6116
$$ 879438281 879321158 879312694 879195213 878926992 878706813 878604650 878493607 878317773 878174663 878098547
2620.8H78098547j34289k20537j83463j32382j74761k14219j41382o4969j65165k92122
$$ 878098547 877964258 877743721 877560258 877427876 877253115 877038896 876897514 876832545 876667380 876375258
2641.2H76375258k05874q7023j59979k47002j63257p8142j79886k78354j56164l6598
$$ 876375258 876169384 876082361 875922382 875675380 875512123 875433981 875254095 874975741 874819577 874782979
2661.6H74782979j49428k45452j37985n3883j40369k21490j42277n6803j48952k74479
$$ 874782979 874633551 874388099 874250114 874196231 874055862 873834372 873692095 873635292 873486340 873211861
2682H73211861j96696r4413k29717l32832j81735j00016k47717k92659j21176m7386
$$ 873211861 873015165 872920752 872691035 872358203 872176468 872076452 871828735 871536076 871414900 871367514
2702.4H71367514j82628k75672k15888j88529k67208k69711j47522p9333j59920k37524
$$ 871367514 871184886 870909214 870693326 870504797 870237589 869967878 869820356 869741023 869581103 869343579
2722.8H69343579j61946j71244l59833l57509j54793p7069j87814k89977k27928j56283
$$ 869343579 869181633 869010389 868650556 868293047 868138254 868061185 867873371 867583394 867355466 867199183
2743.2H67199183j82689j77085j35899j82152k97904l19421k18630j99794l05474k63691
$$ 867199183 867016494 866839409 866703510 866521358 866223454 865904033 865685403 865485609 865180135 864916444
2763.6H64916444q6963j26064l33727l28719j57237k26915m46916m01735j99854k09809
$$ 864916444 864829481 864703417 864369690 864040971 863883734 863656819 863209903 862808168 862608314 862398505
2784H62398505l35991k73466j97590l74317n23925l54170j96517l78311n77628n00739
$$ 862398505 862062514 861789048 861591458 861217141 860693216 860339046 860142529 859764218 859186590 858685851
2804.4H58685851l43203l73185n46694n32389l35157l75926o12617o12914m45187m99130
$$ 858685851 858342648 857969463 857422769 856890380 856555223 856179297 855566680 854953766 854508579 854009449
2824.8H54009449o62326n82576m46797n93841q16822q12053q90732j322389j694381
$$ 854009449 853347123 852764547 852317750 851723909 850907087 850095034 849204302 847881913 846187532
2843.1H46187532j729667j649142j577317j271129o56664k14815k12253l36349l47673
$$ 846187532 844457865 842808723 841231406 839960277 839303613 839088798 838876545 838540196 838192523
2861.5H38192523m11749o98984r56953q61883o23166o96361q97229p30634m75526n59807
$$ 838192523 837780774 837081790 836124837 835262954 834639788 833943427 833046198 832315564 831840038 831280231
2881.9H31280231o94870o30320n98728p30515p83384o34670o46710r42707j039267
$$ 831280231 830585361 829955041 829356313 828625798 827842414 827207744 826561034 825618327 824579060
2900.2H24579060q65102q75473j134813j253366j141191j255393j656651j766503j471996
$$ 824579060 823713958 822838485 821703672 820450306 819309115 818053722 816397071 814630568 813158572
2918.6H13158572j201153r64284n44310o4969J46449K9683M9591L53456N36799O09279
$$ 813158572 811957419 810993135 810448825 810383856 810530305 810559988 810609579 810963035 811499834 812109113
2939H12109113Q99017J177370R65834M43399J74701K11179M8757k80440k08616J44362
$$ 812109113 813008130 814185500 815151334 815594733 815769434 815980613 816029370 815748930 815540314 815684676
2959.4H15684676K57790J55151J97411L42428L42846L73662N19216M95195L34561K25961
$$ 815684676 815942466 816097617 816295028 816637456 816980302 817353964 817873180 818368375 818702936 818928897
2979.8H18928897J07527j2278l9459P2718K92540K77102j11878l32237k81155l87788
$$ 818928897 819036424 819024146 818984687 819057405 819349945 819627047 819515169 819182932 818901777 818513989
3000.2H18513989n44905n25654l77059k06053j68502l03686n00262o97791q55684q43645
$$ 818513989 817969084 817443430 817066371 816860318 816691816 816388130 815887868 815190077 814334393 813490748
3020.6H13490748o69479o26922p79867p83860o09696n84245q32021r75669p37607n91040
$$ 813490748 812821269 812194347 811414480 810630620 810020924 809436679 808604658 807628989 806891382 806300342
3041H06300342p96974j013994j040697r80079r96113j010776r41932j015305j167655
$$ 806300342 805503368 804489374 803448677 802468598 801472485 800461709 799519777 798504472 797336817
3059.3G97336817j053512p92563p37012r25541j065015j009047r28283q12650o79552
$$ 797336817 796283305 795490742 794753730 793828189 792763174 791754127 790825844 790013194 789333642
3077.7G89333642q08597j094937j177311j113475j046061j046479j204789j291871
$$ 789333642 788525045 787430108 786252797 785139322 784093261 783046782 781841993 780550122
3094G80550122j158237j017273j032710j150846j181424j086652j066566j191377j212418
$$ 780550122 779391885 778374612 777341902 776191056 775009632 773922980 772856414 771665037 770452619
3112.4G70452619j069963j029909j170158j462341j746416j709223j417458j267433
$$ 770452619 769382656 768352747 767182589 765720248 763973832 762264609 760847151 759579718
3128.7G59579718j451731j625895j473904j295149j396656j657725j774251j714826
$$ 759579718 758127987 756502092 755028188 753733039 752336383 750678658 748904407 747189581
3145G47189581j648306j485110j320720j560270j978636k007425j818836j813590j878083
$$ 747189581 745541275 744056165 742735445 741175175 739196539 737189114 735370278 733556688 731678605
3163.4G31678605j823783j763403j817465j886308j899958j925588j971542j956702
$$ 731678605 729854822 728091419 726273954 724387646 722487688 720562100 718590558 716633856
3179.7G16633856j930713j976312k037406k026975j982391j997530k063572k115787
$$ 716633856 714703143 712726831 710689425 708662450 706680059 704682529 702618957 700503170
3196G00503170k070009k001465k025365k024889j986325k017379k059758k036810j978218
$$ 700503170 698433161 696431696 694406331 692381442 690395117 688377738 686317980 684281170 682302952
3214.3F82302952j951814j980245j983166j929342j925648j985132j942695j781940
$$ 682302952 680351138 678370893 676387727 674458385 672532737 670547605 668604910 666822970
3230.7F66822970j734793j892269j987457j885176j787364j730264j609742j556754
$$ 666822970 665088177 663195908 661208451 659323275 657535911 655805647 654195905 652639151
3247F52639151j668990j703918j567662j484513j565278j625359j516699j420618j437068
$$ 652639151 650970161 649266243 647698581 646214068 644648790 643023431 641506732 640086114 638649046
3265.3F38649046j346945j157761j257539j573741j697242j652420j585186j555800
$$ 638649046 637302101 636144340 634886801 633313060 631615818 629963398 628378212 626822412
3281.6F26822412j585484j598417j551211j465261Tj644910j859784j971125j924694
$$ 626822412 625236928 623638511 622087300 620622039 619156778 617511868 615652084 613680959 611756265
3300F11756265j729667j574338j717984k110362k412498k478004k380669k265453k200902
$$ 611756265 610026598 608452260 606734276 604623914 602211416 599733412 597352743 595087290 592886388
3318.4E92886388k222955k293110k279043k371013k575636k577365k474367k396107
$$ 592886388 590663433 588370323 586091280 583720267 581144631 578567266 576092899 573696792
3334.7E73696792k323627k443135k654851k693534k713978k698839k519726k596021
$$ 573696792 571373165 568930030 566275179 563581645 560867667 558168828 555649102 553053081
3351E53053081k981484l076851k799452k586722k635121k656579k366245k167165k476514
$$ 553053081 550071597 546994746 544195294 541608572 538973451 536316872 533950627 531783462 529306948
3369.3E29306948k914011k876103k461553k191663k098262k031207j929998j704574
$$ 529306948 526392937 523516834 521055281 518863618 516765356 514734149 512804151 511099577
3385.7E11099577j342714j010954j082242j453340j461029r44614o11842j015544j465797
$$ 511099577 509756863 508745909 507663667 506210327 504749298 503804684 503192842 502177298 500711501
3404E00711501j173348o81161n75960o42091p12782o94901m88848l25292k46733P15
$$ 500711501 499538153 498856992 498281032 497638941 496926159 496231258 495742410 495417118 495170385 495171100
3424.4D95171100L50624N46992M88460N29528P52806O51300L23832L81798Q18998J157224
$$ 495171100 495521724 496068716 496557176 497086704 497839510 498490810 498814642 499196440 500015438 501172662
3444.8E01172662J243651J254916J350284J479446J609981J803875J950384J833438
$$ 501172662 502416313 503671229 505021513 506500959 508110940 509914815 511865199 513698637
3461.1E13698637J814187K226591K462149K050996J529693J589239K016067K362252
$$ 513698637 515512824 517739415 520201564 522252560 523782253 525371492 527387559 529749811
3477.4E29749811K336859J969278J906038K208232K285362K210080K337516K513408
$$ 529749811 532086670 534055948 535961986 538170218 540455580 542665660 545003176 547516584
3493.8E47516584K569855K490103K418160K396942K272665K165794K288521K605617
$$ 547516584 550086439 552576542 554994702 557391644 559664309 561830103 564118624 566724241
3510.1E66724241K890587K809584K530753K548039K807856L024578K889097K592921
$$ 566724241 569614828 572424412 574955165 577503204 580311060 583335638 586224735 588817656
3526.4E88817656K657771K962887L166974L269196L237307L122985L280520L474951
$$ 588817656 591475427 594438314 597605288 600874484 604111791 607234776 610515296 613990247
3542.7F13990247L278971K963722K985298L129065L241063L408372L543079L643751
$$ 613990247 617269218 620232940 623218238 626347303 629588366 632996738 636539817 640183568
3559F40183568L685892L482103L158689L565490M326522M212499L858685L920198M126251
$$ 640183568 643869460 647351563 650510252 654075742 658402264 662614763 666473448 670393646 674519897
3577.4F74519897M345774M574061M468202M009247L932595M504323M607618M385889
$$ 674519897 678865671 683439732 687907934 691917181 695849776 700354099 704961717 709347606
3593.7G09347606M482269M650176M644393M657686M543245M190445M189789M432798
$$ 709347606 713829875 718480051 723124444 727782130 732325375 736515820 740705609 745138407
3610G45138407M395008M350662M070759L857434M408836M576922L920912L004253K920091
$$ 745138407 749533415 753884077 757954836 761812270 766221106 770798028 774718940 777723193 780643284
3628.4G80643284M160047M239678L645182L345668L143490L114938L042817K545476
$$ 780643284 784803331 789043009 792688191 796033859 799177349 802292287 805335104 807880580
3644.7H07880580J812160J915396L038883K960324K141535K262772K574443J989782
$$ 807880580 809692740 811608136 814647019 817607343 819748878 822011650 824586093 826575875
3661H26575875J424134J363933J049996O71327J116573R52304L59416J138985J760185
$$ 826575875 828000009 829363942 830413938 831085265 832201838 833154142 833513558 834652543 836412728
3679.4H36412728J606762J381636R46104L60847K46108R23872J396298J285851R53317
$$ 836412728 838019490 839401126 840347230 840708077 840954185 841878057 843274355 844560206 845513523
3697.7H45513523O09517N71608Q83580Q51392L09944j84297K66552J129865J001895
$$ 845513523 846123040 846694648 847578228 848429620 848739564 848555267 848821819 849951684 850953579
3716.1H50953579M15683P3313M7863J30117K90394M92573L05175j11758r6143O24478
$$ 850953579 851369262 851442575 851490438 851620555 851910949 852403522 852708697 852596939 852500796 853125274
3736.5H53125274J115918N03660o45936p40170L04997Q6665k55287O86407J080036
$$ 853125274 854241192 854744852 854098916 853358746 853663743 853750408 853495121 854181528 855261564
3754.8H55261564M96328N0545K58624L66033J26898l5465k2292L02195M94063K18273
$$ 855261564 855757892 855808437 856067061 856433094 856559992 856524527 856502235 856804430 857298493 857516766
3775.2H57516766o1751J2398K09689J30236P7248K16603K46167J04845j48237k57850
$$ 857516766 857455015 857467413 857677102 857807338 857884586 858101189 858347356 858452201 858303964 858046114
3795.6H58046114j53601l78608k83361L35693J11282N9903N84126M51028k07603m09782
$$ 858046114 857892513 857513905 857230544 857566237 857677519 857737422 858321548 858772576 858564973 858155191
3816H58155191j27137l10957n6625M39525K96950J96636P9870l6180p569l30151n92589
$$ 858155191 858028054 857717097 857660472 858099997 858396947 858593583 858673453 858637273 858629704 858299553 857706964
3838.4H57706964j23501M33922P39455O40869P4625q70168j526117j01447J162112
$$ 857706964 857583463 858017385 858756840 859397709 859472334 858602166 857076049 856974602 858136714
3856.8H58136714O85811j8001l45230p8261O9857k72155k03550J35541L45707L05474
$$ 858136714 858822525 858804524 858459294 858381033 858450890 858178735 857975185 858110726 858456433 858761907
3877.2H58761907r6500l0935J62244p868N2392q1539k15769K11418L18766j49727m50194
$$ 858761907 858665407 858634472 858796716 858788848 858841240 858759701 858543932 858755350 859074116 858924389 858474195
3899.6H58474195l85404j46627L24130N49972L38793P9691j62065k96056j07706Q0109
$$ 858474195 858088791 857942164 858266294 858816266 859155059 859234750 859072685 858776629 858668923 858749032
3920H58749032J2279m2260P7426Q2255r2864n4658J56939J84775P4446q4222j52349
$$ 858749032 858761311 858719051 858796477 858878732 858785868 858731210 858888149 859072924 859147370 859063148 858910799
3942.5H58910799j8716L6657J2040Q0466R9957L7730K206l8803q8394j6033J12712
$$ 858910799 858892083 858928740 858940780 859021246 859121203 859158933 859161139 859122336 859033942 859017909 859130621
3964.9H59130621J07050%q583P0572Q8870O7294N2512P1823Q8394K9445p1645q5891
$$ 859130621 859237671 859237671 859229088 859299660 859388530 859455824 859508336 859580159 859668553 859697998 859626353 859540462
3989.4H59540462j311M6551M4227M8637
$$ 859540462 859539151 859585702 859629929 859678566
3997.5H59678566
$$ 859678566
##END=$$ End of the data block
