##TITLE=$$ Begin of the data block
##JCAMP-DX=5.00 $$ ACD/SpecManager v 10.08
##SPECTROMETER/DATA SYSTEM=Alpha
##DATE=09 Apr 2014 11:14:46
##DATA TYPE=INFRARED SPECTRUM
##DATA CLASS=XYDATA
##ORIGIN=
##OWNER=
##NPOINTS=1765
##FIRSTX=399.75695801
##LASTX=3997.56933594
##MAXX=3997.56933594
##MINX=399.75695801
##MAXY=0.86488140
##MINY=0.43602887
##XFACTOR=1.0000000000
##YFACTOR=1.000000000000000e-9
##FIRSTY=0.71142918
##DELTAX=2.03957629
##XUNITS=1/CM
##YUNITS=ARBITRARY UNITS
##XYDATA=(X++(Y..Y))
399.8 711429179 711991489 711179972 709366441 708558440 708983243 708997071 707887292 707030177 707483947 707732677
420.2 707732677 706520855 705332935 705225229 705571651 705383956 704852223 704855978 705367982 705263078 704334676
440.5 704334676 703848362 704430342 704762042 703874409 702779412 702844501 703665137 703520894 702181697 701632679
460.9 701632679 702097952 701882541 700536013 699484348 699578106 699705660 698814154 697765172 697607219
479.3 697607219 698011816 697890699 697131395 696779966 697035491 696845651 695854127 695134342 695375860 695743561
499.7 695743561 695097446 693858385 693343103 693483889 693154573 692019522 691056669 691061258 691067338 689937234
520.1 689937234 688591242 688099384 687954724 687161505 685832918 685040414 685071886 684714913 683450103
538.4 683450103 682481766 682526767 682612479 681710303 680377722 679908454 680141330 679644287 678157747 676959693
558.8 676959693 676701367 676453233 675241530 673629284 672776997 672345817 671179652 669522166 668537378
577.2 668537378 668256283 667556047 666043460 664748013 664557159 664778650 664246440 663267136 662996829
595.6 662996829 663148463 662341177 660520256 659109473 658644259 658097863 656901479 655822396 655711114
613.9 655711114 656363249 657129705 658218443 660375178 663532019 666544616 668757319 670877755 673609972
632.3 673609972 676337659 678150237 679366767 680916309 682828307 684346557 685331762 686589301 688472390
650.6 688472390 690034866 690582275 691156924 693286002 696634054 699481070 700876892 701731265 704232574
669 704232574 707235992 709065259 710397363 712240338 714554369 716283739 717185318 718259215 720043242
687.3 720043242 721718907 722530067 723050773 724201143 725666046 726418912 726444244 726994932 728650928
705.7 728650928 730292678 731066644 731840968 733642042 735816121 737109780 737804234 739216805 741375327
724 741375327 743034840 743729055 744555831 746403992 748329818 749099970 749313235 750387430 752183139
742.4 752183139 753418505 753910661 754839718 756756246 758624792 759486556 760047495 761489451 763434708
760.8 763434708 764552832 764794171 765461802 766887367 767843604 767675757 767344236 767684937 768036246
779.1 768036246 767455518 766311169 765773475 766100466 766462445 766587436 767535865 770045519 773239732
797.5 773239732 776053905 778822541 782320917 786089778 788940489 790696681 792323172 794321775
813.8 794321775 795972466 796418965 796019256 795714021 795346379 793926418 791342199 788704515 786761880
832.1 786761880 784946918 782551289 780011654 778176904 776875675 775282085 773565650 772970676 774074495
850.5 774074495 776180446 778705835 782129049 786947489 792435527 797338665 801461101 805589080
866.8 805589080 809845030 813233614 815247715 816756427 818611205 820311785 820778549 820136070 819536448
885.2 819536448 819197655 818252861 816511512 815038502 814718723 815082133 815241337 815403163 816364288
903.5 816364288 817834914 818625689 818388641 817886889 817482352 816425502 814142108 811428547 809462011
921.9 809462011 808255672 807123005 806187332 806234121 807209849 808052242 808133841 807953060 808077753 808142126
942.3 808142126 807471812 806214452 805031240 803872824 801933050 798896968 795401275 791830361 787590921
960.6 787590921 782128215 775759280 769097030 762194753 754764616 747161567 740377128 734878480
977 734878480 730203450 725864589 721965849 718732595 716005266 713455379 711118817 709356248 708211422
995.3 708211422 707294762 706347704 705507159 704875052 704036355 702437758 700044632 697217464 694184363
1013.7 694184363 690915167 687487841 684230626 681355119 678706229 676034808 673363745 670907617
1030 670907617 668737471 666718304 664755106 662956417 661455214 660104632 658648193 657054305 655516922
1048.3 655516922 654213250 653152823 652426600 652333498 653039992 654208243 655252397 655838847 655846775
1066.7 655846775 655147552 653727710 651853085 649920344 648160160 646539688 644923031 643229306
1083 643229306 641458869 639579952 637582362 635640562 634072602 633096814 632636428 632442057 632398605
1101.4 632398605 632549345 632767022 632798254 632586062 632278979 631901443 631206214 629888952 627901375
1119.7 627901375 625668526 623812616 622500777 621771157 622318149 624029696 625596464 626736879 628110409
1138.1 628110409 629866660 631652594 633191347 634503007 635724306 636905968 638058722 639276385
1154.4 639276385 640728176 642505109 644583166 647072732 650187135 653975427 658261716 662813544
1170.7 662813544 667545915 672387302 677109361 681571662 685837209 689914405 693583965 696572840
1187 696572840 698826492 700438857 701464891 701929450 702027559 702171624 702681601 703564644 704638720
1205.4 704638720 705794096 706984282 707993507 708557904 708756268 708905458 709115267 709269166 709340215
1223.7 709340215 709531307 710003257 710629225 711261690 712026596 713058829 714186072 715185046 716096878
1242.1 716096878 717036068 717903852 718478799 718713284 718816340 718972147 719141781 719290972 719626009 720416009
1262.5 720416009 721660316 723153532 724833369 726835549 729165554 731611490 734049082 736563206
1278.8 736563206 739255130 742065012 744865060 747675896 750565290 753433943 756117821 758567393
1295.1 758567393 760858536 763027370 764992595 766690612 768162012 769490480 770679533 771672130
1311.4 771672130 772457778 773136854 773876429 774692833 775482416 776256323 777103066 778032362 778912008 779578567
1331.8 779578567 780008256 780320287 780577302 780718744 780790329 780975223 781356871 781829715 782185256 782346666
1352.2 782346666 782447755 782536268 782506704 782238305 781625926 780803323 780013800 779213786 778430700 777786076
1372.6 777786076 777109444 776225030 775070131 773520231 771875322 770764589 770156026 769504964 768810749
1391 768810749 768140197 767204046 765852749 764169216 762468934 760801256 758795798 756691039 754936039
1409.3 754936039 753493309 752221107 751097918 750038326 748955309 748067498 747263670 746494293 746073365
1427.7 746073365 745900810 745708227 745604098 745788813 746273160 746826828 747451723 748297095 749551952
1446 749551952 751168132 752823472 754512250 756630063 759932399 764022946 767025054 769777238 773374617
1464.4 773374617 777284682 780688822 784322202 789067209 793705106 797051191 799577653 801773190
1480.7 801773190 803787768 805405080 806504369 806911469 806666851 806292295 805752575 804522336 802795589
1499.1 802795589 801314235 800216258 798715472 795308769 791788101 789233983 786907673 784685791
1515.4 784685791 782632768 780959547 779155731 777162969 775384367 773668408 772315502 771156013
1531.7 771156013 769662619 768462360 767967999 767373502 766125679 765006542 764322996 764074504 764044642
1550.1 764044642 764159739 764540434 765172601 765477598 764671922 763861299 763196409 762398541 761036575
1568.4 761036575 758776903 756586790 754335999 750739038 746766210 743182480 739347458 735208511
1584.7 735208511 730768085 726049066 721185267 716259539 711096287 705747604 700493753 695356965
1601.1 695356965 690222383 685078025 679861844 674491227 669280648 664552391 659527719 653669178
1617.4 653669178 649192989 645777643 641848624 637973070 634639859 631847560 630093277 629228234
1633.7 629228234 628915191 629239142 630163431 631737649 634021640 637519121 641746819 644965649 648839831
1652 648839831 654859424 659129739 662435114 666340351 671105146 676022470 680290282 684973240 690354347
1670.4 690354347 694960773 699637175 704876423 709596276 714047074 719231009 725874901 731385648
1686.7 731385648 735790431 740504503 745038211 750193775 756119967 761947036 768475771 773876905
1703 773876905 778458178 783106029 787113607 790737212 794274032 797777772 801229417 803988755 806184709
1721.4 806184709 808368921 810559750 812649190 814854562 817049861 819173574 821009696 822555006
1737.7 822555006 824359953 826281786 828004599 829730630 831614077 833487630 835106134 836496949
1754 836496949 837962866 839488566 840818763 841956973 842935562 843922317 845021188 846082866 846897244
1772.4 846897244 847512364 848159254 848886549 849522233 850046992 850641429 851303220 851937890 852528512 853089631
1792.8 853089631 853579640 854060471 854537010 854941905 855320752 855725288 856115878 856492102 856880486 857259929
1813.2 857259929 857587874 857818246 858067691 858458936 858925581 859301686 859592736 859882295 860108733 860278666
1833.6 860278666 860423565 860596776 860892594 861278474 861561418 861709297 861876011 862056434 862180829 862259388
1854 862259388 862391293 862598836 862794518 862935960 863124371 863425732 863681078 863693655 863609374 863640666
1874.4 863640666 863803267 863977909 864057779 864102423 864210665 864366591 864450932 864431262 864455581 864559352
1894.7 864559352 864631653 864634216 864637494 864701867 864785016 864803255 864763618 864744842 864785910 864848733 864880085 864881396
1919.2 864881396 864880621 864853680 864779115 864680231 864602923 864592910 864594817 864534318 864482522 864520133 864558220 864453971
1943.7 864453971 864270747 864134848 864045024 863939166 863784432 863637507 863543212 863457978 863342524 863237977
1964.1 863237977 863149703 863013804 862839758 862692416 862602055 862533748 862438321 862315655 862183630 862069428
1984.5 862069428 861988008 861895561 861760259 861585140 861407995 861286700 861192465 861051857 860878348 860735953
2004.9 860735953 860618591 860489666 860349596 860226452 860110998 859965801 859790564 859606147 859452903 859328091
2025.3 859328091 859208047 859099269 859002173 858909428 858806908 858680427 858554006 858460903 858398736 858321905
2045.7 858321905 858188629 858066261 858015895 857986927 857908726 857788980 857715607 857713282 857690930 857610524 857550323
2068.1 857550323 857536972 857490838 857389092 857334554 857373416 857422769 857387066 857291996 857254803 857286990 857303083
2090.5 857303083 857269049 857251763 857297659 857348025 857340813 857309699 857324779 857379615 857418716 857416451 857433736 857535899
2115 857535899 857628644 857601464 857545614 857593238 857713878 857799232 857835174 857869208 857929230 858015239 858069181 858081281
2139.5 858081281 858124912 858223081 858327270 858385682 858415008 858485878 858603895 858699739 858757257 858847976 858982444
2161.9 858982444 859064460 859078407 859108090 859204233 859344304 859468162 859553993 859639049 859738410 859805524 859831512
2184.4 859831512 859874725 859973669 860086322 860134959 860144615 860231400 860387146 860461354 860420823 860394418 860451102
2206.8 860451102 860530853 860575140 860606432 860675097 860739946 860726595 860687554 860716283 860807002 860857427 860802174
2229.2 860802174 860731542 860768497 860868931 860878468 860811710 860809445 860857248 860857368 860816360 860810220 860856593 860882998
2253.7 860882998 860845625 860785902 860761285 860758662 860726118 860669553 860623598 860643923 860728562 860790849 860818863 860868812
2278.2 860868812 860952556 861009240 860995352 860931695 860885322 860867977 860803604 860694110 860589266 860483706 860392570
2300.6 860392570 860321820 860171974 859895229 859605610 859393656 859231174 859085798 858891845 858524144 858046293
2321 858046293 857701063 857541978 857362151 857068956 856797695 856597602 856407344 856217206 855974257 855803788
2341.4 855803788 856109858 857055962 858065724 858317673 857657194 856636822 855821609 855278492 855087340
2359.8 855087340 855347276 855751634 856094539 856743813 857823014 858928740 859809160 860545337 861292303
2378.1 861292303 862112343 862855911 863357842 863645196 863837719 864005446 864114404 864123106 864107013 864158094
2398.5 864158094 864217877 864179313 864123583 864195824 864310861 864311934 864219248 864185512 864279449 864357948 864295125
2421 864295125 864176512 864126265 864135861 864114404 864064157 864092827 864173114 864139080 863982558 863873243 863881648 863899291
2445.4 863899291 863837421 863771319 863809645 863862574 863789558 863650620 863574743 863559425 863499165 863358319 863227248
2467.9 863227248 863197982 863225162 863173723 863053858 862987459 862959027 862891495 862782717 862680852 862639308 862618744
2490.3 862618744 862545907 862434804 862340868 862256765 862138748 862013340 861954987 861960113 861931086 861828864 861732423
2512.7 861732423 861703515 861678243 861565232 861418128 861365557 861396194 861365736 861223757 861078322 861021698 861001968
2535.2 861001968 860928535 860809326 860718787 860690117 860667706 860586584 860459864 860343158 860248864 860135674 859984159
2557.6 859984159 859853446 859796643 859755099 859642327 859495044 859413207 859345496 859194219 859012604 858882010
2578 858882010 858775854 858639598 858462870 858270884 858119547 857998729 857808828 857534409 857290089 857119262
2598.4 857119262 856931269 856694221 856476545 856277585 856026113 855735958 855489433 855303586 855115175 854846656
2618.8 854846656 854507327 854237735 854082823 853886962 853581667 853273451 853033423 852814615 852550745 852268279
2639.2 852268279 852037311 851825953 851561308 851269007 851014078 850797653 850567579 850302160 850052953 849857330
2659.6 849857330 849663734 849407732 849114716 848880410 848706424 848492622 848210990 847964108 847816288 847633541
2680 847633541 847295761 846909821 846620202 846398592 846128643 845809698 845561028 845385671 845155060 844837546
2700.4 844837546 844507098 844235539 843990326 843678832 843354344 843111694 842885792 842559457 842165947 841860175
2720.8 841860175 841667295 841443658 841091454 840680778 840347052 840093076 839832008 839533865 839245677 839003623
2741.2 839003623 838741779 838419795 838114500 837855220 837554753 837175369 836815000 836542785 836261570 835873127
2761.6 835873127 835454047 835117638 834818244 834450424 834052861 833706141 833344102 832889378 832388937 831917107
2782 831917107 831516862 831174493 830813587 830380619 829882085 829373658 828897119 828367114 827730060 827109814
2802.3 827109814 826531470 825912178 825277925 824652493 824025333 823399067 822732508 822020769 821313262 820596933
2822.7 820596933 819827378 818992138 818097353 817177713 816236615 815226138 814127386 812830210 811147630
2841.1 811147630 809085011 806771517 804356158 802103579 800311804 799103439 798398376 798033774 797721326
2859.5 797721326 797134876 796219409 795137763 793953419 792702496 791567028 790552497 789523184 788597047
2877.8 788597047 787832141 787060916 786257207 785426974 784481287 783452272 782477081 781543672 780461967
2896.2 780461967 779193580 777938008 776809990 775683939 774381936 772914112 771386623 769690037
2912.5 769690037 767643631 765410542 763372302 761701047 760403752 759544849 759188414 759234607 759416223
2930.8 759416223 759647965 760119140 760948181 762051880 763327956 764696836 765957773 766865730 767363787
2949.2 767363787 767606556 767644107 767498732 767384887 767410874 767571151 767873406 768252611 768627107 769004345
2969.6 769004345 769492567 770062089 770525694 770945430 771493912 772038996 772403955 772672534 773006976 773472130
2990 773472130 773881495 773935318 773742557 773502946 773117125 772589386 772023499 771485329 771086752 770815730
3010.4 770815730 770460248 769857049 769078732 768248677 767371595 766527832 765749991 764892220 763999164 763185740
3030.8 763185740 762406588 761523843 760457754 759418309 758514762 757507205 756280363 755003154 753840864
3049.1 753840864 752742469 751585305 750381827 749142110 747846901 746599317 745515585 744547784
3065.5 744547784 743492305 742263317 741019487 739897430 738934100 738036215 736976147 735753775 734518826
3083.8 734518826 733230829 731918752 730701625 729455411 728073061 726711392 725515544 724381804
3100.1 724381804 723077774 721623003 720267832 719014764 717639983 716205835 714947701 713780761
3116.4 713780761 712458372 710838735 708958685 707091630 705434203 703899503 702288508 700520635
3132.8 700520635 698767066 697221041 695730388 693971813 692024231 690168679 688393116 686662436
3149.1 686662436 684997082 683230221 681241453 679158926 677125216 675161421 673214555 671236992
3165.4 671236992 669248283 667266488 665276706 663257778 661186397 659071147 656970620 654914021
3181.7 654914021 652872324 650817275 648757100 646694183 644609928 642494678 640352011 638220847
3198 638220847 636137009 634083748 632041335 630024374 628001928 625959396 623927116 621888697 619882762
3216.4 619882762 617925584 615910292 613839388 611838579 609892011 607955992 606120944 604393482
3232.7 604393482 602593303 600650430 598708808 596877813 595187604 593625128 592072308 590389609
3249 590389609 588661432 587103307 585690916 584216297 582670212 581174970 579692662 578176320 576730072
3267.4 576730072 575439155 574135065 572618425 570966065 569318771 567722797 566167831 564629257
3283.7 564629257 563080609 561511099 559994936 558523059 556945622 555209160 553356111 551484168
3300 551484168 549720645 548078299 546381712 544404209 542169511 539888144 537685692 535563529 533433378
3318.4 533433378 531250238 529105484 526988029 524684310 522154570 519617021 517174363 514856398
3334.7 514856398 512680054 510386467 507813215 505169928 502547324 499971062 497549891 495042920
3351 495042920 492229998 489380658 486736417 484238744 481737942 479235500 476907790 474697262 472278118
3369.3 472278118 469552010 466851026 464482129 462344706 460264355 458207458 456213713 454411149
3385.7 454411149 452951461 451819241 450623572 449036926 447406262 446250796 445427388 444299281
3402 444299281 442761302 441422522 440554678 439889282 439199984 438399047 437576979 436980426 436585575 436225057
3422.4 436225057 436028868 436166197 436572105 436963588 437313348 437844962 438370675 438609421 438817918 439413905
3442.8 439413905 440425217 441575736 442656010 443785965 445089549 446524084 448133349 449891001
3459.1 449891001 451545328 453223825 455324531 457639635 459535897 460895658 462327838 464214474
3475.4 464214474 466453284 468710601 470644504 472488314 474622577 476829886 478888035 481015086
3491.7 481015086 483372688 485889465 488321126 490644723 493044585 495337039 497359067 499463797
3508 499463797 501915872 504595041 507178903 509544432 511983991 514686882 517626107 520463586 522973895
3526.4 522973895 525526881 528350711 531314313 534402728 537527323 540514112 543617725 547046244
3542.7 547046244 550517976 553649664 556573272 559675336 563024998 566445053 569946527 573635697
3559 573635697 577335000 580791891 584283412 588534236 593008041 596883118 600629091 604693294 608961999
3577.4 608961999 613385737 617968321 622493804 626949728 631580710 636255324 640653729 645125270
3593.7 645125270 649930716 654835522 659699321 664517462 669162273 673635662 678358018 683314800
3610 683314800 688218772 693094373 697626233 702175438 707300484 711951017 715744913 719362438 723873377
3628.4 723873377 729065299 733264446 736996293 740789771 744516432 748213112 751748085 754973531
3644.7 754973531 758263707 762238681 766077816 768673718 770851731 773665607 776600659 778924286
3661 778924286 780910850 782865047 784748495 786714256 788830876 790470421 791979849 793739974 795203328
3679.4 795203328 796477795 797716081 798883498 800193787 801586568 802670836 803688824 804811060
3695.7 804811060 805878937 806860745 807887733 808894396 809717774 810448289 811206579 812058032 812852204
3714 812852204 813401759 813841999 814307094 814798117 815250635 815638542 815995932 816382349 816959143 817744970
3734.4 817744970 818529725 819064379 819194674 819025755 819184601 819758058 820028305 820254445 820708454 821116805
3754.8 821116805 821398258 821580470 821753085 821933329 822203636 822517455 822705626 822887421 823055208 823191464
3775.2 823191464 823487937 823902190 824118495 824100673 824150503 824336648 824510872 824667692 824812591 825011551
3795.6 825011551 825195611 825151503 825257838 825531602 825514555 825561643 825748622 825805247 825776637 825935483
3816 825935483 826257944 826349974 826399505 826446354 826435804 826473117 826473415 826573730 826858759 827022374 826945662
3838.4 826945662 826876283 826944470 827103019 827203095 827167690 826905966 826474488 826578379 826988399 827116311
3858.8 827116311 827058434 827052116 827203751 827224970 827071905 827109039 827206671 827289820 827349842 827340364 827506483
3881.3 827506483 827631831 827571392 827470899 827288866 827260852 827414632 827409208 827315092 827317595 827298105 827210903
3903.7 827210903 827192783 827180326 827122509 827093601 827119827 827183604 827253103 827282727 827246130 827202380 827229023
3926.1 827229023 827248216 827224970 827276468 827394724 827418804 827348232 827285767 827288091 827364624 827439368 827477813
3948.6 827477813 827497423 827492237 827482939 827499509 827506959 827501774 827540755 827572167 827577651 827674270 827816308 827856541
3973.1 827856541 827830613 827824831 827854753 827948630 828100741 828180492 828149378 828139246 828159034 828162372 828192294 828241110
3997.5 828241110
##END=$$ End of the data block
