##TITLE=$$ Begin of the data block
##JCAMP-DX=5.00 $$ ACD/SpecManager v 10.08
##SPECTROMETER/DATA SYSTEM=Alpha
##DATE=09 Apr 2014 11:14:46
##DATA TYPE=INFRARED SPECTRUM
##DATA CLASS=XYDATA
##ORIGIN=
##OWNER=
##NPOINTS=1765
##FIRSTX=399.75695801
##LASTX=3997.56933594
##MAXX=3997.56933594
##MINX=399.75695801
##MAXY=0.86510438
##MINY=0.43570024
##XFACTOR=1.0000000000
##YFACTOR=1.000000000000000e-9
##FIRSTY=0.71188551
##DELTAX=2.03957629
##XUNITS=1/CM
##YUNITS=ARBITRARY UNITS
##XYDATA=(X++(Y..Y))
399.8G11885512M21345q00013j743198q50499J44601j71661q07166k57969R57072J90019
$$ 711885512 712306857 711506844 709763646 708913147 709057748 708886087 708078921 707820952 708778024 708968043
420.2G08968043j658260j454890r6381K26319o46651j048922j75298P92742K83062
$$ 708968043 707309783 705854893 705758512 705984831 705338180 704289258 704113960 704906702 705189764
438.5G05189764p44462n35726M46021L89159o47902r26316J72198Q88943k56359j521468
$$ 705189764 704445302 703909576 704355597 704744756 704096854 703170538 703342736 704231679 703975320 702453852
458.9G02453852p71880J73330l57747j279414p94232L13759K9087r27746p52628K9206
$$ 702453852 701681972 701855302 701497555 700218141 699423909 699737668 699766755 698839009 698086381 698115587
479.3F98115587J22249m75645p72595k22921L91542k7835r39250r15527j38164O9857
$$ 698115587 698237836 697762191 696989596 696766675 697158217 697130382 696191132 695275605 695137441 695207298
499.7F95207298n65529q29339k10762J72138m59015j306355j061261k086K324j231968
$$ 695207298 694641769 693812430 693601668 693773806 693314791 692008436 690947175 690945089 690947413 689715445
520.1F89715445j512289m52757J07825p17998j380801p93934N544l34502j145303r11474
$$ 689715445 688203156 687750399 687858224 687140226 685759425 684965491 684971035 684636533 683491230 682579756
540.5F82579756l0816M7684p84814j176000n13971J0252o31511j505137j097500j46806
$$ 682579756 682548940 682596624 681811810 680635810 680121839 680132091 679500580 677995443 676897943 676751137
560.9F76751137l89993j404882j510739o09696m06981j351475j847864j093208k43247
$$ 676751137 676361144 674956262 673445523 672835827 672428846 671077371 669229507 668136299 667893052
579.2F67893052n28753j358330j217782j18673J91688p22944j118660k51413K43962
$$ 667893052 667364299 666005969 664788187 664669514 664861202 664138258 663019598 662768185 663012147
597.6F63012147p21991j717150j327336n18799o45101j188576r42350M2558O77764
$$ 663012147 662290156 660573006 659245670 658726871 658081770 656893194 655950844 655993402 656671166
616F56671166O99223J065254K174735L103733K894223K127349K046943K650499K698541
$$ 656671166 657370389 658435643 660610378 663714111 666608334 668735683 670782626 673433125 676131666
634.3F76131666J825392J302659J762450K050877J454711R64522J388550J888990J334310
$$ 676131666 677957058 679259717 681022167 683073044 684527755 685492277 686880827 688769817 690104127
652.7F90104127M01914O69539K257645L372312K804577J412988J013279K578676K848982
$$ 690104127 690506041 691175580 693433225 696805537 699610114 701023102 702036381 704615057 707464039
671G07464039J705289J309455J865029K333641J737952R37224J169324J887560J751780
$$ 707464039 709169328 710478783 712343812 714677453 716415405 717352629 718521953 720409513 722161293
689.4G22161293Q67784M64678R35912J264334P30097J47522O51776J657605J673639
$$ 722161293 723029077 723493755 724429667 725694001 726424098 726571620 727223396 728881001 730554640
707.7G30554640Q75175P89523J723588K121270J254499O28531J436173K343476J819492
$$ 730554640 731429815 732219338 733942926 736064196 737318695 737947226 739383399 741726875 743546367
726.1G43546367P00831P75635J812876J888692P03931J48654J063287J831949J282275
$$ 743546367 744247198 745022833 746835709 748724401 749428332 749576986 750640273 752472222 753754497
744.4G53754497N29587R49621J877189J758814P75933N75602J514912J955390J073598
$$ 753754497 754284084 755233705 757110894 758869708 759645641 760221243 761736155 763691545 764765143
762.8G64765143K52724P29263J471519R64582j86622l47972L88444L95179p00891j337946
$$ 764765143 765017867 765747130 767218649 768183231 767996609 767648637 768037081 768432260 767731369 766393423
783.2G66393423n77390M41551M40002J40726R85027K515494L155172K803922K787769
$$ 766393423 765816033 766257584 766697586 766838312 767823339 770338833 773494005 776297927 779085696
801.6G79085696L474772L690123K805651J826405J786530K084792J586854L63112m37618
$$ 779085696 782560468 786250591 789056242 790882647 792669177 794753969 796340823 796703935 796266317
819.9G96266317l20017l70204j438737k592743k583682j884044j858770k507091k570987
$$ 796266317 795946300 795576096 794137359 791544616 788960934 787076890 785218120 782711029 780140042
838.3G80140042j760006j254320j633703j782239o36458J115083K147377K537072L383100
$$ 780140042 778380036 777125716 775492013 773709774 773073316 774188399 776335776 778872848 782255948
856.6G82255948M763722N459428M918098M203856M239798M324973L395855J975596
$$ 782255948 787019670 792479098 797397196 801601052 805840850 810165823 813561678 815537274
872.9H15537274J447022J783967J626313M45366n88477n76914l64184r17554j698851
$$ 815537274 816984296 818768263 820394576 820839942 820251465 819674551 819310367 818392813 816693962
891.3H16693962j496613l59595L28898J05441J38283R83238J489878P83920k53320
$$ 816693962 815197349 814837754 815166652 815272093 815410376 816393614 817883492 818667412 818414092
909.6H18414092n04672l99650j062393k295196k709687j977861j228511j102090r02712
$$ 818414092 817909420 817509770 816447377 814152181 811442494 809464633 808236122 807134032 806231320
928H06231320M0293R73880Q26895L6776j92702J58906O9201o93619j228809j154661
$$ 806231320 806271613 807245493 808072388 808109164 807916462 808075368 808144569 807450950 806222141 805067480
948.4H05067480j215160j992584l022730l492832l602147m249513n431116o314039
$$ 805067480 803852320 801859736 798837006 795344174 791742027 787492514 782061398 775747359
964.7G75747359o601274o866396p442116p649899o838858n526722m647970m293442
$$ 775747359 769146085 762279689 754837573 747187674 740348816 734822094 730174124 725880682
981G25880682l891170l232955k701402k526164k349854j799226j157820r03189r42528
$$ 725880682 721989512 718756557 716055155 713528991 711179137 709379911 708222091 707318902 706376374
999.4G06376374q82149o93440q39472j550019k375186k851843l052712l261983l409505
$$ 706376374 705494225 704800785 703961313 702411294 700036108 697184265 694131553 690869570 687460065
1017.7F87460065l250539k870620k625227k653300k669335k436578k132058k003849
$$ 687460065 684209526 681338906 678713679 676060379 673391044 670954466 668822408 666818559
1034.1F66818559j977682j829624j542568j369477j458048j592100j532853j344979
$$ 666818559 664840877 663011253 661468685 660099208 658641160 657049060 655516207 654171228
1050.4F54171228j095295o57141J0491P28011J139819J040221N62191n9784p26998
$$ 654171228 653075933 652418792 652429283 653157294 654297113 655337334 655899525 655839741 655112743
1068.7F55112743j368045j828492j951575j759053j586437j624107j715601j760602
$$ 655112743 653744698 651916206 649964631 648205578 646619141 644995034 643279433 641518831
1085F41518831j836359j942337j913905j583576j019418m93169j62721K1577J58131
$$ 641518831 639682472 637740135 635826230 634242654 633223236 632730067 632567346 632588923 632747054
1103.4F32747054J72079J9371j64032l00705m59016p62462j298726j927495k210021
$$ 632747054 632919133 632938504 632774472 632473767 632014751 631252289 629953563 628026068 625816047
1121.8F25816047j865446j345039p95960N10931J734435J604736J166523J379430J733601
$$ 625816047 623950601 622605562 621809602 622320533 624054968 625659704 626826227 628205657 629939258
1140.1F29939258J766503J549780J333833J241267J178145J132548J217067J442313
$$ 629939258 631705761 633255541 634589374 635830641 637008786 638141334 639358401 640800714
1156.4F40800714J742006K072811K513528L117740L767788M263103M545808M722953
$$ 640800714 642542720 644615531 647129059 650246799 654014587 658277690 662823498 667546451
1172.7F67546451M802585M694640M454792M270196M117370L717124K997458K229214
$$ 667546451 672349036 677043676 681498468 685768664 689886034 693603158 696600616 698829830
1189.1F98829830J592278J005531M39822R8467J56641N22256Q90136J051068J126468
$$ 698829830 700422108 701427639 701867461 701965928 702122569 702644825 703534961 704586029 705712497
1207.4G05712497J192272J026094N84364K31087J89066K32518J29580K9028J87337
$$ 705712497 706904769 707930863 708515227 708746314 708935380 709167898 709297478 709326506 709513843
1225.8G09513843M97282O49750O38723P33137R99928J148224J039862R25780R44495
$$ 709513843 710011125 710660875 711299598 712032735 713032663 714180887 715220749 716146529 717091024
1244.1G17091024Q93891O03378K34067P8082J35601J69754J51694L29732P89047J250326
$$ 717091024 717984915 718588293 718822360 718900442 719036043 719205797 719357491 719687223 720476270 721726596
1264.5G21726596J503229J686037J985192K302766K446354K462923K532363K674639
$$ 721726596 723229825 724915862 726901054 729203820 731650174 734113097 736645460 739320099
1280.8G39320099K772451K798319K815544K847374K835572K703309K498447K329827
$$ 739320099 742092550 744890869 747706413 750553787 753389359 756092668 758591115 760920942
1297.2G60920942K170563J948475J691342J467109J311957J177609R93789P96318P05838
$$ 760920942 763091505 765039980 766731322 768198431 769510388 770687997 771681786 772478104 773183942
1315.5G73183942P53343Q02040P90358P91371Q63313R55403Q92043O35684L88086L33189
$$ 773183942 773937285 774739325 775529683 776321054 777184367 778139770 779031813 779667497 780055583 780388772
1335.9G80388772L33429J71602K8193J44183L78430M77195L60191J76430R4890N1081
$$ 780388772 780722201 780893803 780921996 781066179 781444609 781921804 782281995 782458425 782553315 782604396
1356.3G82604396l9994k42830n92112q09789p85351p99954p67708o19173o59763q92342
$$ 782604396 782564402 782321572 781729460 780919671 780134320 779334366 778566658 777947485 777287722 776395380
1376.7G76395380j181125j558423j629114j102686o27995o81400o79731n95749q64983
$$ 776395380 775214255 773655832 772026718 770924032 770296037 769614637 768934906 768339157 767474174
1395.1G67474174j350283j731932j742304j665473j988411k108395j754284j452148
$$ 767474174 766123891 764391959 762649655 760984182 758995771 756887376 755133092 753680944
1411.4G53680944j298844j103282r83417j052380r22859q04543p44462m21703j94013
$$ 753680944 752382100 751278818 750295401 749243021 748320162 747515619 746771157 746349454 746155441
1429.7G46155441k12014j24514J42217M52995N70416O42956Q44598J246869J585662
$$ 746155441 745943427 745818913 745961130 746414125 746984541 747627497 748472095 749718964 751304626
1448.1G51304626J612843J691699K184748L386200M071116K926469K725899L599406
$$ 751304626 752917469 754609168 756793916 760180116 764251232 767177701 769903600 773503006
1464.4G73503006L893136L391803L683805M833520M638314L286600K491593K187312
$$ 773503006 777396142 780787945 784471750 789305270 793943584 797230184 799721777 801909089
1480.7H01909089K013862J620651J127362M43280k42413l81052n48542j254558j726687
$$ 801909089 803922951 805543602 806670964 807114244 806871831 806490779 805942237 804687679 802960992
1499.1H02960992j453757j069487j452684l373980l556252k577782k338588k223372
$$ 802960992 801507235 800437748 798985064 795611084 792054832 789477050 787138462 784915090
1515.4G84915090k026201j643240j799286k009034j794398j740872j384557j171648
$$ 784915090 782888889 781245649 779446363 777437329 775642931 773902059 772517502 771345854
1531.7G71345854j473010j155138m40240n51700j240909j140476p19428k53498J609
$$ 771345854 769872844 768717706 768277466 767725766 766484857 765344381 764624953 764371455 764373064
1550.1G64373064J22249L57866O42598L38555q26896q33809o71089p97272j362204
$$ 764373064 764495313 764853179 765495777 765834332 765007436 764173627 763502538 762705266 761343062
1568.4G61343062k289772k226710k251745l579855l974378l593325l838540m141569
$$ 761343062 759053290 756826580 754574835 750994980 747020602 743427277 739588737 735447168
1584.7G35447168m456818m758119m920185m970431n170346n339860n268932n188048
$$ 735447168 730990350 726232231 721312046 716341615 711171269 705831409 700562477 695374429
1601.1F95374429n192339n162001n208373n354762n177081m722356n081714n930662
$$ 695374429 690182090 685020089 679811716 674456954 669279873 664557517 659475803 653545141
1617.4F53545141m489183l378868l891647l887296l357351k794027j754344q78036
$$ 653545141 649055958 645677090 641785443 637898147 634540796 631746769 629992425 629114389
1633.7F29114389l50594L02553R50754J596391K281368L524124M274369L245115L942966
$$ 629114389 628763795 629066348 630017102 631613493 633894861 637418985 641693354 644938469 648881435
1652F48881435O052316M212081L317952L980875M819751M937112M270375M673898N422771
$$ 648881435 654933751 659145832 662463784 666444659 671264410 676201522 680471897 685145795 690568566
1670.4F90568566M694045M708111N178750M658997M449010N204975O657482N527079
$$ 690568566 695262611 699970722 705149472 709808469 714257479 719462454 726119936 731647015
1686.7G31647015M386961M678845M537046N188644N964816N850077O517648N411685
$$ 731647015 736033976 740712821 745249867 750438511 756403327 762253404 768771052 774182737
1703G74182737M612565M627824L949165L600299L569186L578901L523291K737879K120555
$$ 774182737 778795302 783423126 787372291 790972590 794541776 798120677 801643968 804381847 806502402
1721.4H06502402K135634K188206K111554K228260K221286K154530J833915J506925
$$ 806502402 808638036 810826242 812937796 815166056 817387342 819541872 821375787 822882712
1737.7H22882712J753330J901031J747250J750827J901507J891971J605213J349509
$$ 822882712 824636042 826537073 828284323 830035150 831936657 833828628 835433841 836783350
1754H36783350J448214J550912J344443J102447R39727R94504J135587J079858Q11934
$$ 836783350 838231564 839782476 841126919 842229366 843169093 844163597 845299184 846379042 847190976
1772.4H47190976O20961O30141O57975N73337N26846O15537O89507O99520O39796N35428
$$ 847190976 847811937 848442078 849100053 849673390 850200236 850815773 851505280 852204800 852844596 853380024
1792.8H53380024M62890M88460M82619M10020L90053M17650L94225L66390L74198L51846
$$ 853380024 853842914 854331374 854813993 855224013 855614066 856031716 856425941 856792331 857166529 857518375
1813.2H57518375K82168K08915K74658M19974M74453L78311K99752K93850K06113J43826
$$ 857518375 857800543 858009458 858284116 858704090 859178543 859556854 859856606 860150456 860356569 860500395
1833.6H60500395J53840K14934L24071L88741K78652J34170J45972J76370J33216O7711
$$ 860500395 860654235 860869169 861193240 861581981 861860633 861994803 862140775 862317145 862450361 862518072
1854H62518072J10865K10583K17855J54078J96993L29078K63691k7776j17123K8550
$$ 862518072 862628937 862839520 863057375 863211453 863408446 863737524 864001215 863973439 863856316 863884866
1874.4H63884866J61529J54376O4313M8340J07228J50979J04010J4663K8550P8261
$$ 863884866 864046395 864200771 864265084 864313424 864420652 864571631 864675641 864690304 864718854 864797115
1894.7H64797115M6254M76K1875P8261J04785N5611k9146n1320P331M7386M530j8716
$$ 864797115 864843369 864843845 864865720 864943981 865048766 865104377 865075231 865023911 865031242 865078628 865083158 865064442
1919.2H65064442L5167J669j01388j06811l9756J2099r358n9127k6227M9830K0385
$$ 865064442 865099609 865101278 864999890 864893079 864853323 864865422 864856064 864796937 864770710 864820540 864840925
1941.7H64840925j28448k06828j65403r7394r4354j48893j38938q3447q3565j27972
$$ 864840925 864712477 864505649 864340246 864242852 864148498 863999605 863860667 863777220 863693655 863565683
1962.1H63565683j26242r5427j14680j58250j46329q2136p0750j09852j27136j26958
$$ 863565683 863439441 863344014 863229334 863071084 862924755 862842619 862771869 862662017 862534881 862407923
1982.5H62407923j12355q2552o4731q2553j46031j91629j62601j31607j45376j59204
$$ 862407923 862295568 862213016 862148285 862065732 861919701 861728072 861565471 861433864 861288488 861129284
2002.8H61129284j38223j15276j33097j58548j39713j24932j47283j63376j50621j19567
$$ 861129284 860991061 860875785 860742688 860584140 860444427 860319495 860172212 860008836 859858215 859738648
2023.2H59738648j18554j39177j41680j24573j00971q5473r7632j13905r1195o6936
$$ 859738648 859620094 859480917 859339237 859214664 859113693 859028220 858930588 858816683 858725488 858658552
2043.6H58658552j05262j70052j36554k2113K7537m5538j12235p3255j9967n4359j10865
$$ 858658552 858553290 858383238 858246684 858224571 858252108 858206570 858094335 858021080 858001113 857946754 857835889
2066.1H57835889p8976l2783l3438m1008k8908L278J8775k7835p0274k324P9035M1545
$$ 857835889 857756913 857724130 857690692 857649684 857620776 857624054 857642829 857614994 857544720 857542396 857621431 857662976
2090.5H57662976m5300l9756J7583J6511k8312k7895M5836Q6307L9339k2888k0921
$$ 857662976 857617676 857577920 857595503 857612014 857583702 857555807 857601643 857687950 857727289 857704401 857683480
2113H57683480M9889R7751M8817q583L0458Q9347O8605L5584O2287J04606J08540L9816
$$ 857683480 857733369 857831120 857879937 857871354 857901812 857991159 858059764 858095348 858157635 858262241 858370781 858410597
2137.5H58410597k1517L7550J31429J22428N6505N4657J06812J09851N1260K4855P7129
$$ 858410597 858389080 858426630 858558059 858680487 858736992 858791649 858898461 859008312 859059572 859084427 859161556
2159.9H59161556J31786R3162J4245K0921J19448J74046R7334K0743P3134J44661R9361
$$ 859161556 859293342 859386504 859400749 859421670 859541118 859715164 859812498 859833241 859906375 860051036 860150397
2182.3H60150397L0696N6684J17183J00553L0100K4975R5606J20878L0339n7698m172
$$ 860150397 860181093 860237777 860354960 860455513 860485613 860510588 860606194 860727072 860757411 860699713 860695541
2204.8H60695541R5189Q3804J2517N304P2599R4652j192n7220L2842J22428P2836l9875
$$ 860695541 860790730 860874534 860887051 860892355 860964954 861059606 861058414 861001194 861034036 861156464 861229300 861189425
2229.2H61189425o4254N007M7505n543m4763J0907M3869P868k0623p451L5525K7716
$$ 861189425 861125171 861130178 861177683 861172140 861127377 861138284 861182153 861190021 861169398 861161947 861197472 861225188
2253.7H61225188n2631q1301j2100K7836j9491m2856k2351J6331N7757L0279l397N1081
$$ 861225188 861172557 861091256 861079156 861106992 861087501 861044645 861022294 861038625 861096382 861126661 861123264 861174345
2278.2H61174345J01566O9797q34p2420o9141l2365o0142o7055n4955r9898r6261m5061
$$ 861174345 861275911 861345708 861344874 861272454 861203313 861170948 861110806 861043751 860988796 860888898 860792637 860747576
2302.7H60747576j17600k38300k50220k00152j79768j70231k01761l48509m27067l08633
$$ 860747576 860629976 860391676 860141456 859941304 859761536 859591305 859389544 859041035 858613968 858305335
2323.1H58305335j90914k04384k40803k70545l02315k60174k00689j61827l1948L46363
$$ 858305335 858114421 857910037 857669234 857398689 857096374 856836200 856635511 856473684 856441736 856788099
2343.5H56788099R14275R64642K15709o72519j058340q72791n34892j71423K50459
$$ 856788099 857702374 858667016 858882725 858210206 857151866 856279075 855744183 855572760 855823219
2361.8H55823219N58019O03437O78599Q90374R68516Q62598P54535P73013Q29816P07984
$$ 855823219 856381238 856984675 857663274 858553648 859522164 860384762 861139297 861912310 862742126 863450110
2382.2H63450110M28736K03550J45853J55329P0453l8147j3888P4268Q5711K1994M17
$$ 863450110 863878846 864082396 864228249 864383578 864454031 864415884 864401996 864476264 864561975 864583969 864584386
2404.6H64584386O2049Q0287r358p5698n36Q8990M7326n7042r3698m0472Q047k4498
$$ 864584386 864646435 864726722 864717364 864641666 864641130 864730120 864777446 864720404 864626706 864586234 864594281 864569783
2429.1H64569783p8141l0756K1159o9856j46986o4551K9087P093n8592o9856M768N1141
$$ 864569783 864491642 864460886 864482045 864412189 864265203 864200652 864229739 864236832 864178240 864108384 864113152 864164293
2453.6H64164293m9114j47462p6771K3425j8418j21415j20223r596J4901r8407j45316
$$ 864164293 864115179 863967717 863890946 863914371 863895953 863774538 863654315 863644719 863659620 863561213 863415897
2476H63415897n8949L1710J1503j13308j54019p1525n6148q6546p6711p5340q7023
$$ 863415897 863356948 863388658 863400161 863286853 863132834 863061309 863005161 862918615 862841904 862766564 862679541
2498.5H62679541r7632j13905p5876J7464P748j04308j20342k1875k682j09553j76251
$$ 862679541 862581909 862468004 862392128 862409592 862417340 862313032 862192690 862170815 862168133 862058580 861882329
2520.9H61882329j13368L040R179j10269j57058p7784k2292n8055j01924q1599n4538
$$ 861882329 861768961 861772001 861781180 861670911 861513853 861436069 861413777 861355722 861253798 861172199 861117661
2543.3H61117661o9261j08301j32084r3639n5075j01924j53780r4235o437m1962j62661
$$ 861117661 861048400 860940099 860808015 860714376 860659301 860557377 860403597 860309362 860302925 860260963 860098302
2565.8H60098302j85251q1479n6029j41859j84297j54972j31011j23144j23202j71960
$$ 860098302 859913051 859831572 859775543 859633684 859449387 859294415 859163404 859040260 858917058 858745098
2586.2H58745098k04384j86861k03967k38240k12788j42455j46687k44558k67506k16007
$$ 858745098 858540714 858353853 858149886 857911646 857698858 857556403 857409716 857165158 856897652 856681645
2606.6H56681645k29657k66850k53618j97768j63257k47300l51488k87771j78218k35498
$$ 856681645 856451988 856185138 855931520 855733752 855570495 855323195 854971707 854683936 854505718 854270220
2626.9H54270220l33131k85863k07901k13266k49565k63392k26915k11418k75373l35873
$$ 854270220 853937089 853651226 853443325 853230059 852980494 852717102 852490187 852278769 852003396 851667523
2647.3H51667523l02612k17975j90794k24352k23577j77801j92701k84076l24309k33710
$$ 851667523 851364911 851146936 850956142 850731790 850508213 850330412 850137711 849853635 849529326 849295616
2667.7H49295616j35064j77383k72870k58148j82688k19524l54767l79622k60949k06709
$$ 849295616 849160552 848983169 848710299 848452151 848269463 848049939 847695172 847315550 847054601 846847892
2688.1H46847892k62141k86997k19524j72317k58445l56257l36111k53081k17319k70247
$$ 846847892 846585751 846298754 846079230 845906913 845648468 845292211 844956100 844703019 844485700 844215453
2708.5H44215453l32475l11852k62081k94388l45408k97010k20657k41458l38137l84569
$$ 844215453 843882978 843571126 843309045 843014657 842669249 842372239 842151582 841910124 841571987 841187418
2728.9H41187418l26634k83599l02374k99931k75433k67804k84791k98321k76088k48552
$$ 841187418 840860784 840577185 840274811 839974880 839699447 839431643 839146852 838848531 838572443 838323891
2749.3H38323891k89023l72827l74675l10719l07262l68714l84688l15070k83301l52264
$$ 838323891 838034868 837662041 837287366 836976647 836669385 836300671 835915983 835600913 835317612 834965348
2769.7H34965348l88324l60489l98517m79579m82261m36783m03225l69549l80337m53949
$$ 834965348 834577024 834216535 833818018 833338439 832856178 832419395 832016170 831646621 831266284 830812335
2790.1H30812335n03957m90010m56631n04792o27935o49989n90205n85377n93603o20067
$$ 830812335 830308378 829818368 829361737 828856945 828229010 827579021 826988816 826403439 825809836 825189769
2810.5H25189769o72579o72519o70254p05719p13468p21395p76708q39829q64387q52227
$$ 825189769 824517190 823844671 823174417 822468698 821755230 821033835 820257127 819417298 818552911 817700684
2830.9H17700684q82983r73165j075983j331747j757204k108574k315343k380252k219200
$$ 817700684 816817701 815844536 814768553 813436806 811679602 809571028 807255685 804875433 802656233
2849.3H02656233j791596j217127p25150m01199l45409n92649q81851j051902j182974
$$ 802656233 800864637 799647510 798922360 798521161 798175752 797583103 796701252 795649350 794466376
2867.6G94466376j262009j168966j035571j015902r24468p62582p44998q01623q32021
$$ 794466376 793204367 792035401 790999830 789983928 789059460 788296878 787551880 786750257 785918236
2886G85918236q98004r77397r76503r51409j057625j230597j258791j162946j158774
$$ 785918236 785020232 784042835 783066332 782114923 781057298 779826701 778567910 777404964 776246190
2904.3G76246190j321793j477003j546919j723707k042889k213717k039611j669943
$$ 776246190 774924397 773447394 771900475 770176768 768133879 765920162 763880551 762210608
2920.6G62210608j284898q68976l66509O3777J81437K06887M81069Q80421J143515
$$ 762210608 760925710 760056734 759690225 759754002 759935439 760142326 760623395 761503816 762647331
2939G62647331J273095J370788J302600R13799M34458J65582J1444j04904p4923M6491
$$ 762647331 763920426 765291214 766593814 767507613 767942071 768107653 768119097 768014193 767939270 767985761
2959.4G67985761J85847K88189L15785L30508L85344N01931N68509M94659M87506N97239
$$ 767985761 768171608 768459797 768775582 769106090 769491434 769993365 770561874 771056533 771544039 772141278
2979.8G72141278N49912L63410K82764L31164M37378L88444M3154k05696k50757l84152
$$ 772141278 772691190 773054600 773337364 773668528 774105906 774494350 774537504 774331808 774081051 773696899
3000.2G73696899n06103n31494n20945m05133k74002l57866o04809p62462p94590q33452
$$ 773696899 773190796 772659302 772138357 771733224 771459222 771101356 770496547 769734085 768939495 768106043
3020.6G68106043q51452q47757r07242q85010p75814p45118q83579j090884j040697
$$ 768106043 767254591 766406834 765499592 764614582 763838768 763093650 762210071 761119187 760078490
3038.9G60078490q85785r82582j181841j248598j175106j126587j170457j187503j226187
$$ 760078490 759192705 758210123 757028282 755779684 754604578 753477991 752307534 751120031 749893844
3057.3G49893844j314282j263142j074970r54985j052440j265883j313806j149535
$$ 749893844 748579562 747316420 746241450 745286465 744234025 742968142 741654336 740504801
3073.6G40504801r34958q74937j049936j203477j224935j286030j298427j223505j269758
$$ 740504801 739569843 738694906 737644970 736441493 735216558 733930528 732632101 731408596 730138838
3092G30138838j358568j321733j211822j180709j318633j431942j345516j258611j365781
$$ 730138838 728780270 727458537 726246715 725066006 723747373 722315431 720969915 719711304 718345523
3110.3G18345523j423121j276731j221657j351178j591861j852870j861393j654625
$$ 718345523 716922402 715645671 714424014 713072836 711480975 709628105 707766712 706112087
3126.6G06112087j534462j600146j726807j717329j543462j489460j780868k022386
$$ 706112087 704577625 702977479 701250672 699533343 697989881 696500421 694719553 692697167
3143F92697167j917779j786709j713812j624525j733184k004742k111495k044618j991868
$$ 692697167 690779388 688992679 687278867 685654342 683921158 681916416 679804921 677760303 675768435
3161.3F75768435j974881j962840j979471k007961k002001j991033k020955k080381
$$ 675768435 673793554 671830714 669851243 667843282 665841281 663850248 661829293 659748912
3177.6F59748912k094209k064646k062440k087831k087772k064109k088666k165317
$$ 659748912 657654703 655590057 653527617 651439786 649352014 647287905 645199239 643033922
3193.9F43033922k190054k111733k039075k038836k054393k048552k067864k084852
$$ 643033922 640843868 638732135 636693060 634654224 632599831 630551279 628483415 626398563
3210.3F26398563k049684k031386k007365j975537k015829k069711k024770j940906
$$ 626398563 624348879 622317493 620310128 618334591 616318762 614249051 612224281 610283375
3226.6F10283375j904011j814425j712024j822174j987219j960098j850665j728952
$$ 610283375 608379364 606564939 604852915 603030741 601043522 599083424 597232759 595503807
3242.9E95503807j574695j530469j671671j706481j531124j446367j538813j588583
$$ 595503807 593929112 592398643 590726972 589020491 587489367 586043000 584504187 582915604
3259.2E82915604j502931j450121j483202j441598j283765j276255j482427j656294
$$ 582915604 581412673 579962552 578479350 577037752 575753987 574477732 572995305 571339011
3275.5E71339011j703441j619995j525819j538575j575410j561046j501798j490414
$$ 571339011 569635570 568015575 566489756 564951181 563375771 561814725 560312927 558822513
3291.8E58822513j594782j737714j868129j918077j778066j622081j722873k020478
$$ 558822513 557227731 555490017 553621888 551703811 549925745 548303664 546580791 544560313
3308.2E44560313k247929k286017k198816k126932k147436k177000k142787k155900
$$ 544560313 542312384 540026367 537827551 535700619 533553183 531376183 529233396 527077496
3324.5E27077496k345085k514124k480865k412021k345621k245009k322197k554715
$$ 527077496 524732411 522218287 519737422 517325401 514979780 512734771 510412574 507857859
3340.8E07857859k666354k663374k579987k425790k518177k816439k873629k693504
$$ 507857859 505191505 502528131 499948144 497522354 495004177 492187738 489314109 486620605
3357.1D86620605k530068k516717k539039k376228k248734k419532k691447k677799
$$ 486620605 484090537 481573820 479034781 476658553 474409819 471990287 469298840 466621041
3373.4D66621041k376586k183944k145439k087266j951515j741648j476467j199245
$$ 466621041 464244455 462060511 459915072 457827806 455876291 454134643 452658176 451458931
3389.7D51458931j207531j553028j623839j157284q21293j136690j529872j312793
$$ 451458931 450251400 448698372 447074533 445917249 445095956 443959266 442429394 441116601
3406.1D41116601q72344p02649p10279q06331q47698o18666l63976l15428j78992J52558
$$ 441116601 440244257 439541608 438831329 438024998 437177300 436558634 436194658 435879230 435700238 435852796
3426.5D35852796M07636L50535K90602N08488N42610K49953K31891O15597R82791J155615
$$ 435852796 436260432 436610967 436901569 437410057 437952667 438202620 438434511 439050108 440032899 441188514
3446.8D41188514J142264J161754J289636J413136J605422J797110J715451J668662
$$ 441188514 442330778 443492532 444782168 446195304 447800726 449597836 451313287 452981949
3463.2D52981949K014965K267122J932353J404822J451462J881093K199024K247691
$$ 452981949 454996914 457264036 459196389 460601211 462052673 463933766 466132790 468380481
3479.5D68380481J968443J867205K187223K261757K020806K090097K379119K520323
$$ 468380481 470348924 472216129 474403352 476665109 478685915 480776012 483155131 485675454
3495.8D85675454K432227K358139K423853K275705J989782K102852K515643K750457
$$ 485675454 488107681 490465820 492889673 495165378 497155160 499258012 501773655 504524112
3512.1E04524112K601444K356649K416372K674818K953649K889931K551734K553165
$$ 504524112 507125556 509482205 511898577 514573395 517527044 520416975 522968709 525521874
3528.4E25521874K772332K916693L111363L158450K998412L166735L485024L453731
$$ 525521874 528294206 531210899 534322262 537480712 540479124 543645859 547130883 550584614
3544.7E50584614L151357L013909L166497L337383L360153L448128L680527L737867
$$ 550584614 553735971 556749880 559916377 563253760 566613913 570062041 573742568 577480435
3561.1E77480435L477514L452301M262209M604936L961980L737986M045308M284262
$$ 577480435 580957949 584410250 588672459 593277395 597239375 600977361 605022669 609306931
3577.4F09306931M462600M607201M530012M472316M663408M711389M441023M517078
$$ 609306931 613769531 618376732 622906744 627379060 632042468 636753857 641194880 645711958
3593.7F45711958M839123M907667M872561M829287M598558M435599M795134N103529
$$ 645711958 650551081 655458748 660331309 665160596 669759154 674194753 678989887 684093416
3610F84093416M983246M846036M523337M580498N085468M611552L839910L684700M486203
$$ 684093416 689076662 693922698 698446035 703026533 708112001 712723553 716563463 720248163 724734366
3628.4G24734366N131900M256428L816187L808558L702342L672779L522098L236055
$$ 724734366 729866266 734122694 737938881 741747439 745449781 749122560 752644658 755880713
3644.7G55880713L307522L978967L867269K636015K204359K844572K958953K312482
$$ 755880713 759188235 763167202 767034471 769670486 771874845 774719417 777678370 779990852
3661G79990852J966298J945912J861453J927972K129078J685918J448690J664699J476526
$$ 779990852 781957150 783903062 785764515 787692487 789821565 791507483 792956173 794620872 796097398
3679.4G96097398J302719J257718J225471J370490J376569J037598J002371J106024
$$ 796097398 797400117 798657835 799883306 801253796 802630365 803667963 804670334 805776358
3695.7H05776358J063823J018346J049101J000404Q25346O99460P07627Q42213P83801
$$ 805776358 806840181 807858527 808907628 809908032 810733378 811432838 812140465 812982678 813766479
3714H13766479N36442M57526M85420N07593M79996M01914L85940M57406O60360Q52525
$$ 813766479 814302921 814760447 815245867 815753460 816233456 816635370 817021310 817478716 818139076 818991601
3734.4H18991601P94888M78387O7055k27392Q4401N51819L04819K98142N46992L87251
$$ 818991601 819786489 820264876 820331931 820104539 820188940 820740759 821045578 821343720 821890712 822277963
3754.8H22277963J91868J67727J74105J46628K33352K69651J84536J89245J70350J91092
$$ 822277963 822469831 822637558 822811663 822958291 823191643 823461294 823645830 823835075 824005425 824196517
3775.2H24196517L54827L89635J52886l9100J4782J31309J89483K12669J63138K13385
$$ 824196517 824551344 824940979 825093865 825054765 825069547 825200856 825390339 825603008 825766146 825979531
3795.6H25979531K61724J8060N3465K21789J0789N5849J44243M6254N960J43826K77996
$$ 825979531 826241255 826259315 826312780 826534569 826545358 826601207 826745450 826791704 826797664 826941490 827219486
3818H27219486J22726J13130N9604p7664m6313K384J52171K99811J73509l8981n1976
$$ 827219486 827342212 827455342 827514946 827437282 827390969 827393353 827545524 827845335 828018844 827979863 827927887
3840.5H27927887M6730J07110O2406m9174k59757l86715J43588M08769J11103o8963
$$ 827927887 827974617 828081727 828144133 828094959 827835202 827448487 827592075 828000844 828111947 828042984
3860.9H28042984j1742J08600J9192r0897N0426P5936M7207K563k1458K32756J95384
$$ 828042984 828031242 828139842 828159034 828068137 828118563 828194499 828241706 828244269 828222811 828455567 828650951
3883.3H28650951q3625j45972j36435K98J11521O55n8591l1889n3703R536Q5533l0577
$$ 828650951 828567326 828421354 828284919 828285217 828396738 828397393 828338802 828306913 828253210 828262746 828348279 828317702
3907.8H28317702j06812j2874N4598J6450k741R775k1875k1219M7147R477m5717O7532
$$ 828317702 828210890 828198016 828252614 828269064 828266323 828276098 828254223 828233004 828280151 828289628 828243911 828311443
3932.3H28311443J02699n8591j05798k0981N066K9147P3611Q6129O3539j5378n6088
$$ 828311443 828414142 828355551 828249753 828228772 828233838 828262985 828336596 828422725 828486264 828470886 828414798
3954.7H28414798L1590J13249O4969k6882o6280j013J12772Q9824q464L0935P7963
$$ 828414798 828446388 828559637 828624606 828597724 828531444 828530431 828643203 828733027 828724563 828755498 828833461
3977.1H28833461n424J4901J61231J27434k920L516K3783j7763j5795O5863
$$ 828833461 828828037 828842938 829004169 829131603 829128683 829132199 829155982 829138219 829122424 829188287
3997.5H29188287
$$ 829188287
##END=$$ End of the data block
