##TITLE=$$ Begin of the data block
##JCAMP-DX=5.00 $$ ACD/SpecManager v 10.08
##SPECTROMETER/DATA SYSTEM=Alpha
##DATE=09 Apr 2014 11:14:46
##DATA TYPE=INFRARED SPECTRUM
##DATA CLASS=XYDATA
##ORIGIN=
##OWNER=
##NPOINTS=1765
##FIRSTX=399.75695801
##LASTX=3997.56933594
##MAXX=3997.56933594
##MINX=399.75695801
##MAXY=0.86557984
##MINY=0.43542805
##XFACTOR=1.0000000000
##YFACTOR=1.000000000000000e-9
##FIRSTY=0.71347100
##DELTAX=2.03957629
##XUNITS=1/CM
##YUNITS=ARBITRARY UNITS
##XYDATA=(X++(Y..Y))
399.8G13470995k17259j102685j966715o71387N12421k29895j034319k76268Q48591
418.1G09333479j09672j849532j620949o9797O12855k94387r19640m4227O73771k06351
438.5G05505550j037777l71754O61075L06189p98225q71956J51634O38366l52562j488626
458.9G02341914p63416K46107k83479j120925o25730L91364J10865j028419j071929
477.3F98196352j23740L27707l22760q76307k23637M59910j07825j025260q85426j252
497.7F95417762J51574p88569j085877r9361L55601n34535j432657j010775R3519J2339
518.1F91079021j160026j380146m95970l3319p22527j426697j007676j44840k76267
536.4F84431553j116097j051009k4676K65658p06732j301289n21422J74344n36740
$$ plain form
399.8 713470995 713253736 712151051 710184336 709512949 710025370 709795475 708761156 708484888 709333479
418.1 709333479 709223807 707374275 705753326 705683529 706296384 706001997 705082357 705038130 705711901 705505550
438.5 705505550 704467773 704096019 704757094 705063283 704265058 703393102 703544736 704183102 703830540 702341914
458.9 702341914 701578498 701824605 701541126 700420201 699794471 700185835 700296700 699268281 698196352
477.3 698196352 698072612 698400319 698077559 697201252 696977615 697437525 697329700 696304440 695419014 695417762
497.7 695417762 695569336 694780767 693694890 693595529 693951130 693416595 691983938 690973163 691066682 691079021
518.1 691079021 689918995 688538849 688042879 688009560 687287033 685860336 684852660 684707820 684431553
536.4 684431553 683315456 682264447 682239771 682505429 681798697 680497408 679975986 680150330 679613590
554.8F79613590j537740j187861j55330k30491j273036j620710q28802l90590j127541
573.1F71261489j775562j206041l35216o11186j382053j101732o8903J20580p62046
591.5F64139330j153409l10481K24173o53267j620352j312256n45799o43254j182198
609.8F56942487r62794O378O65068P44701J099050K155840L124416K942681K165377
628.2F68883204K100170K637446K636373J864135J354516J647174J842618J308799
644.5F84274435R30905J492381K133012J595676M99130O16729K225756L372014K762735
662.9F99902773J393855J041352K594233K878249J745700J326979J882612K402306
679.2G15168059J792669R00686J127779J862467J656949P39932M41552J046598J367926
$$ plain form
554.8 679613590 678075850 676887989 676732659 676502168 675229132 673608422 672779620 672389030 671261489
573.1 671261489 669485927 668279886 667944670 667333484 665951431 664849699 664780796 664901376 664139330
591.5 664139330 662985921 662675440 662899613 662246346 660625994 659313738 658767939 658124685 656942487
609.8 656942487 655979693 655986071 656651139 657395840 658494890 660650730 663775146 666717827 668883204
628.2 668883204 670983374 673620820 676257193 678121328 679475844 681123018 682965636 684274435
644.5 684274435 685205340 686697721 688830733 690426409 690925539 691542268 693768024 697140038 699902773
662.9 699902773 701296628 702337980 704932213 707810462 709556162 710883141 712765753 715168059
679.2 715168059 716960728 717861414 718989193 720851660 722508609 723248541 723690093 724736691 726104617
697.5G26104617P22408J00315O23763J636624J687765R35972Q14438J643419K058983
715.9G36328304J313507O98269J391947K230644J735628O49571Q03829J894533J909793
734.2G48956025P20143K12729J133323J867711J249910M60803R18567J897991J775265
752.6G59192467P79450N84304J493216J937389J075745K21312O76155J431286R55224
771G68346548j82271l44634L93391M15563o28590j221836n10037L90232L67939J22845
791.4G67149150R58801K496898L204584K817690K708555L471195L802419K890825J813531
809.7G91313648J713515K049386J599371L68357m38809l28064l76702j422047k558231
828.1G91920424k591849j951277j905978k520263k572537j743793j198828j545251
$$ plain form
697.5 726104617 726827025 726927340 727551103 729187727 730875492 731811464 732625902 734269321 736328304
715.9 736328304 737641811 738340080 739732027 741962671 743698299 744347870 745151699 747046232 748956025
734.2 748956025 749676168 749888897 751022220 752889931 754139841 754600644 755519211 757417202 759192467
752.6 759192467 759971917 760556221 762049437 763986826 765062571 765283883 765960038 767391324 768346548
771 768346548 768164277 767819643 768213034 768628597 768000007 766778171 766268134 766658366 767026305 767149150
791.4 767149150 768107951 770604849 773809433 776627123 779335678 782806873 786609292 789500117 791313648
809.7 791313648 793027163 795076549 796675920 797044277 796605468 796277404 795900702 794478655 791920424
828.1 791920424 789328575 787377298 785471320 782951057 780378520 778634727 777435899 775890648
844.4G75890648j723051o26683J070559K052784K452254L386855M834652N492390M891753
862.7G97722161M118800M128039M292548L480553K090633J486123J767158J638949
879.1H20724964M95851n71430n95390l89636j011670j786351j458287l20435K83063
897.4H15370679Q3983J66058R92179J479626P83026k38776m87149m20868j119018k308964
917.8H14300776k666235j922489j213312j149058r58800J4483R89318Q60095K0028
936.2H08274806k41340J52529R6559o82890j242221j150667j202345k020896l039121
954.5G98944414l451169l563821m249811n454779o353915o640255o890774p425129
970.8G54914761p583738o786585n515456m665375m333257l913760l220261k713799
$$ plain form
844.4 775890648 774167597 773540914 774611473 776664257 779116511 782503366 787338018 792830408 797722161
862.7 797722161 801840961 805969000 810261548 813742101 815832734 817318857 819086015 820724964
879.1 820724964 821220815 820649385 820053995 819664359 818652689 816866338 815408051 815087616 815370679
897.4 815370679 815454662 815620720 816612899 818092525 818875551 818636775 818149626 817728758 816609740 814300776
917.8 814300776 811634541 809712052 808498740 807349682 806390882 806405365 807394683 808254778 808274806
936.2 808274806 808033466 808185995 808282554 807599664 806357443 805206776 804004431 801983535 798944414
954.5 798944414 795493245 791929424 787679613 782224834 775870919 769230664 762339890 754914761
970.8 754914761 747331023 740544438 735028982 730363607 726030350 722116590 718896329 716182530
987.1G16182530k572000k342522j746595j141548r41813r86755q72314o55830q49783
1005.5G04073370j612247k411365k817154l000855l226459l358424l195882k872765
1021.8F81578219k687037k693594k640128k386450k103925k010465k001583j805604
1038.1F63249433j494944j371503j468658j588047j535714j297831j034677o86884
1054.5F52771175n0783P18534J156032J028001N12064j16051p50541j356006j808822
1072.8F52103603j923800j730322j575768j635969j704812j685798j789928j983046
1089.1F38074160j957715j578867r98795m94302j83224K7179J95384K08974L0756k07186
1109.5F33116364l41892m24742p02501j285553j948833k234221j900255j411796q73923
$$ plain form
987.1 716182530 713610530 711268008 709521413 708379865 707438052 706451297 705578983 704923153 704073370
1005.5 704073370 702461123 700049758 697232604 694231749 691005290 687646866 684450984 681578219
1021.8 681578219 678891182 676197588 673557460 671171010 669067085 667056620 665055037 663249433
1038.1 663249433 661754489 660382986 658914328 657326281 655790567 654492736 653458059 652771175
1054.5 652771175 652720392 653438926 654594958 655622959 656135023 656018972 655268431 653912425 652103603
1072.8 652103603 650179803 648449481 646873713 645237744 643532932 641847134 640057206 638074160
1089.1 638074160 636116445 634537578 633538783 633044481 632861257 632888436 633083820 633292794 633323550 633116364
1109.5 633116364 632774472 632349730 631647229 630361676 628412843 626178622 624278367 622866571 621992648
1127.9F21992648M84347J775265J672446J214564J388192J718224J751720J544238
1144.2F33541644J335322J226485J124323J090467J219928J437187J723349K075851
1160.5F44774556K514899L102243L752053M250288M540503M717290M795432M685104
1176.8F77132368M445970M272998M105567L679812K970279K231419J613080J037658
1193.1G01489151M59790R6142J59800N31197Q93533J070380J177728J235485J008869
1211.5G08122075N33759K06590J82390K18809J27613M5717K07305N15223O49571O15120
1231.9G11424172P20739J016200J180827J064241R32455R51767R04084O11961K32935
1250.3G19039381P1525J44839J83344J59800L40879P85172J230836J477361J658857
$$ plain form
1127.9 621992648 622476995 624252260 625924706 627139270 628527462 630245686 631997406 633541644
1144.2 633541644 634876966 636103451 637227774 638318241 639538169 640975356 642698705 644774556
1160.5 644774556 647289455 650391698 654143751 658394039 662934542 667651832 672447264 677132368
1176.8 677132368 681578338 685851336 689956903 693636715 696606994 698838413 700451493 701489151
1193.1 701489151 701948941 702045083 702204883 702736080 703629613 704699993 705877721 707113206 708122075
1211.5 708122075 708655834 708862424 709044814 709263623 709391236 709436953 709644258 710159481 710809052 711424172
1231.9 711424172 712144911 713161111 714341938 715406179 716338634 717290401 718194485 718806446 719039381
1250.3 719039381 719110906 719255745 719439089 719598889 719939768 720724940 721955776 723433137 725091994
1268.6G25091994J982152K307654K451837K473354K512515K650022K767861K771020
1284.9G45008409K787828K870441K879739K713561K461850K294302K185703K000093
1301.2G65201926J726032J454412J292110J199365J032352Q07941O83188P29561P99597
1319.6G74926484P81536P97331R10044R89556Q80122O32465M28200L50833K97606J41442
1340G81135619K9981J40726L62754M83275L76403J71542R1851O6817k3902k20418n79059
1362.4G82035589q34822q05915q07643p79688o28710o79970r08136j165092j538575
1380.8G73887038j624048j092493o12617o76572o78718n92291q62301j348257j742422
1399.1G64657319j759172j672685j998901k125740j768113j452863j283645j084269
$$ plain form
1268.6 725091994 727074146 729381800 731833637 734306991 736819506 739469528 742237389 745008409
1284.9 745008409 747796237 750666678 753546417 756259978 758721828 761016130 763201833 765201926
1301.2 765201926 766927958 768382370 769674480 770873845 771906197 772714138 773397326 774126887 774926484
1319.6 774926484 775708020 776505351 777415395 778404951 779285073 779917538 780345738 780696571 780994177 781135619
1340 781135619 781165600 781306326 781669080 782152355 782528758 782700300 782792151 782858968 782835066 782614648 782035589
1362.4 782035589 781200767 780394852 779587209 778807521 778178811 777498841 776590705 775425613 773887038
1380.8 773887038 772262990 771170497 770557880 769881308 769202590 768610299 767747998 766399741 764657319
1399.1 764657319 762898147 761225462 759226561 757100821 755332708 753879845 752596200 751511931
1415.5G51511931r61899j033962r21071q15570p69675m44591k02656k05040q5353J85847
1435.9G46257961M11689M85003N95331Q32737J261294J603424J608610J698554K238214
1454.2G56992817L461063M056990K863169K715647L630161L913820L402770L711819
1470.5G84748256M852116M601896L252924K503454K213955K042830J651824J129091
1486.8H06996346M18007k42710l63231n31137j237869j738608j483798j059115j356542
1505.2G99401343l282488l636240k680302k366543k195060j997292j619518j772404
1521.5G79851496k013206j812756j739741j351416j117110j467109j214444m45724
1537.8G68689990m80771j247287j180291p30395k66731q345J22965L91304P56204M92931
$$ plain form
1415.5 751511931 750550032 749516070 748594999 747779429 747009754 746565163 746362507 746157467 746072114 746257961
1435.9 746257961 746669650 747154653 747749984 748582721 749844015 751447439 753056049 754754603 756992817
1454.2 756992817 760453880 764510870 767374039 770089686 773719847 777633667 781036437 784748256
1470.5 784748256 789600372 794202268 797455192 799958646 802172601 804215431 805867255 806996346
1486.8 806996346 807414353 807171643 806808412 806277275 805039406 803300798 801817000 800757885 799401343
1505.2 799401343 796118855 792482615 789802313 787435770 785240710 783243418 781623900 779851496
1521.5 779851496 777838290 776025534 774285793 772934377 771817267 770350158 769135714 768689990
1537.8 768689990 768209219 766961932 765781641 765051246 764784515 764776170 764899135 765290439 766046643 766539574
1558.2G66539574r01342r88424p27653p87199j344263k302170k223849k228320l606498
1576.6G51429856m037142l618777l825247m121363m471421m806698m952133m974544
1592.9G16622531n186796n372524n283535n183279n191743n173028n234599n412757
1609.2F74584270n244613m741728n060733n940616m526794l401399l906250l883779
1625.5F37878358l356278k835035j777351q21113k76089K80142R09030J591325K323568
1643.9F33916557L617704M341602L268600L971695O037415M174768L313780M006505
1660.2F66648626M860878M972518M323363M744172N412996M631519M719973N244732
1676.5G05558777M702628M484295N254448O649971N444705M347503M696966M568875
$$ plain form
1558.2 766539574 765638232 764649808 763922155 763134956 761790693 759488523 757264674 755036354 751429856
1576.6 751429856 747392714 743773937 739948690 735827327 731355906 726549208 721597075 716622531
1592.9 716622531 711435735 706063211 700779676 695596397 690404654 685231626 679997027 674584270
1609.2 674584270 669339657 664597929 659537196 653596580 649069786 645668387 641762137 637878358
1625.5 637878358 634522080 631687045 629909694 629088581 628812492 629092634 630001664 631592989 633916557
1643.9 633916557 637534261 641875863 645144463 649116158 655153573 659328341 662642121 666648626
1660.2 666648626 671509504 676482022 680805385 685549557 690962553 695594072 700314045 705558777
1676.5 705558777 710261405 714745700 720000148 726650119 732094824 736442327 741139293 745708168
1692.8G45708168N208849N973816N860865O514490N379558M580378M610002L932536
1709.2G87768662L597140L595650L593624L483713K698123K135873K171517K200245
1725.5H11244547K114833K243459K239466K173483J824200J492679J759291J894832
1741.8H26986790J721680J731038J904011J903772J602531J354396J458645J525879
1758.1H40188742J304269J100897R67741J016200J155198J122713Q24511N70058O13451
1776.5H48863780P02739O19233N22494N71549O23167O51478O65725N90503M64916M76241
1796.9H54751825M98653M35471L69132L54528L61860L72768L69370L47614L15428K55167
1817.2H58431816K89381M17173M77969L63291K80618L08097K23696J37389J27077J73270
$$ plain form
1692.8 745708168 750917017 756890833 762751698 769266188 774645746 779226124 783836126 787768662
1709.2 787768662 791365802 794961452 798555076 802038789 804736912 806872785 809044302 811244547
1725.5 811244547 813359380 815602839 817842305 820015788 821839988 823332667 825091958 826986790
1741.8 826986790 828708470 830439508 832343519 834247291 835849822 837204218 838662863 840188742
1758.1 840188742 841493011 842593908 843561649 844577849 845733047 846855760 847680271 848250329 848863780
1776.5 848863780 849566519 850185752 850708246 851279795 851902962 852554440 853220165 853810668 854275584 854751825
1796.9 854751825 855250478 855685949 856055081 856409609 856771469 857144237 857513607 857861221 858176649 858431816
1817.2 858431816 858721197 859138370 859616339 859979630 860260248 860568345 860792041 860929430 861056507 861229777
1837.6H61229777L05117M29511L35753J21235J02222J59145J30951O8247J14263K17735
1858H63213956K26260J59263K11537L55959K73466m5895j39237J2696J51694J50680
1878.4H64570379O2824N4717J28924J70053R7394o140K4259Q8990L6597l5643L755
1900.9H65196109R4831J25646M3571o2346m1723N1856Q3327M8399J4544K5630k1220
1923.3H65558624j33931j43409n7221K206l278n1797o3181J3471L5584j12176k06947
1945.7H64837945j36555o3657r1315j53184j40130r0063q3387j05917j04964j03056
1966.1H63765717j37747j74403j64926j20223q7738p2121r2566j35243j23739p2062
1986.5H62584949o4373j11282j78874j87933j24812j04070j52886j72496j25706j05024
$$ plain form
1837.6 861229777 861534894 861964405 862300158 862421393 862523615 862682760 862813711 862881958 862996221 863213956
1858 863213956 863440216 863599479 863811016 864166975 864440441 864394546 864255309 864268005 864419699 864570379
1878.4 864570379 864633203 864687920 864816844 864986897 865084291 865078151 865102410 865191400 865227997 865192354 865196109
1900.9 865196109 865290940 865416586 865460157 865397811 865356088 865407944 865491271 865539670 865554214 865579844 865558624
1923.3 865558624 865424693 865281284 865224063 865226269 865222991 865171194 865108013 865121484 865157068 865044892 864837945
1945.7 864837945 864701390 864637733 864546418 864393234 864253104 864163041 864079654 863973737 863868773 863765717
1966.1 863765717 863627970 863453567 863288641 863168418 863080680 863008559 862915993 862780750 862657011 862584949
1986.5 862584949 862520576 862409294 862230420 862042487 861917675 861813605 861660719 861488223 861362517 861257493
2006.9H61257493j41501j63257j27316j03533j39594j70171j61827j12474q8811j22010
2027.3H59926999j48178j32262j04010j13666j40965j26601p9751n5849q7381j28030
2047.7H58810306r3401l7312l5286q5950j19925o4075L457l0696j02401o7651L517
2070.2H58180583k0028p3909n1856k027p808m5538m7147J1742N6564J7167n3943m2021
2094.6H57921779K1160L9637J1921r060L4094Q1777N3466p868j5378L8028M5657j4305
2119.1H58200908M232J08719J34527N8949M888L0875R9242J27494O2943O437P0214
2141.5H58909428J30892P6294K1160M4643J08123J31607Q2016M9353P8559J06633P9691
2164H59818399L0994L7671J13248J49608Q3983L5703R0122J53184J09017K8312N1856
$$ plain form
2006.9 861257493 861115992 860952735 860825419 860721886 860582292 860412121 860250294 860137820 860049009 859926999
2027.3 859926999 859778821 859646559 859542549 859428883 859287918 859161317 859081566 859025717 858938336 858810306
2047.7 858810306 858716905 858679593 858644307 858558357 858438432 858374357 858377814 858347118 858244717 858177066 858180583
2070.2 858180583 858160555 858086646 858034790 858032763 858024955 857979417 857932270 857944012 858000576 858017743 857963800 857921779
2094.6 857921779 857942939 857982576 857994497 857985437 858019531 858101308 858154774 858146906 858131528 858169556 858215213 858200908
2119.1 858200908 858205140 858313859 858448386 858507335 858512223 858543098 858642340 858769834 858832777 858839214 858909428
2141.5 858909428 859040320 859116614 859137774 859182417 859290540 859422147 859504163 859553516 859632075 859738708 859818399
2164 859818399 859849393 859887064 860000312 860149920 860233903 860269606 860359728 860512912 860621929 860650241 860702097
2186.4H60702097J20223J05679L3855O557N4955R4951O1929J3113K4795O4969N2691
2208.8H61335814M053k38N9783R7692L3617l9458J1563J11401Q7738l6657p7486J1504
2233.3H61599326P8738J8358m2081J4723N2332j0550n8531j7464N5670N9843j6689
2255.8H61733675p4387m8458n603j5914m5479l6359L9876R9182N2392l576K9981P6831
2280.2H61802161O7055K5868m3451q7262o2584m0710n3168p8559r1254o1989n7400
2302.7H61318707j50024k24293k17795k05398j77383j33693j81318l43620m29631k86281
2323.1H58969271j03175j18912j99914k14517k30670k31206j96576j81258r9957K66731
2343.5H57659817Q32796R08792K51829n47766r25064q30651o06179k64287K19703N42581
$$ plain form
2186.4 860702097 860822320 860927999 860961854 860968411 861023366 861118317 861180246 861193359 861218154 861283123 861335814
2208.8 861335814 861339867 861339629 861399412 861497104 861530721 861491263 861502826 861614227 861701965 861665308 861587822 861599326
2233.3 861599326 861678064 861696422 861654341 861669064 861721396 861710846 861652315 861634851 861690521 861750364 861733675
2255.8 861733675 861659288 861610830 861605227 861589313 861543834 861507475 861547351 861646533 861698925 861695349 861725330 861802161
2280.2 861802161 861869216 861895084 861851633 861764371 861701787 861661077 861607909 861529350 861438096 861376107 861318707
2302.7 861318707 861168683 860944390 860726595 860521197 860343814 860210121 860028803 859685183 859255552 858969271
2323.1 858969271 858866096 858747184 858547270 858332753 858102083 857870877 857674301 857493043 857393086 857659817
2343.5 857659817 858492613 859401405 859653234 859105468 858180404 857349753 856743574 856479287 856698990 857241571
2363.8H57241571N65350O43015Q57115R22858Q16822P40052P88271Q18134O45756L62695
2384.2H64401639J78039J46925J46091N4061k6047L0995R2506N4359J491Q225P5161
2406.7H65163445J02580J6034p9811k9921P2896K9445j17839j51634j7702N6743k6345
2429.1H65017891o6102K4677N7518n7876j39058p9393N066j2040p8916o0916J5080
2451.5H64625931K7120n6267j37806n8770O6400l58j45316j52409m1366J7047n0902
2474H64093304j37151j15573j4305N960r2744j40071o5744k7299q2612j25408r8229
2496.4H63200128m6432n4657j12772q5414J1087L695n8770o2704n8115r1135j21713
2518.9H62523198j08361n0724J1027k0087j33991j80363q9944p808p3612j71304j27732
$$ plain form
2363.8 857241571 857806921 858449936 859307051 860229909 861046731 861786783 862575054 863393188 864038944 864401639
2384.2 864401639 864579678 864726603 864872694 864926755 864900708 864931703 865024209 865078568 865080059 865088284 865163445
2406.7 865163445 865266025 865282059 865202248 865172327 865245223 865274668 865156829 865005195 864987493 865044236 865017891
2429.1 865017891 864951789 864976466 865033984 864976108 864837050 864757657 864762723 864750683 864671767 864610851 864625931
2451.5 864625931 864653051 864596784 864458978 864400208 864466608 864466250 864320934 864168525 864127159 864144206 864093304
2474 864093304 863956153 863840580 863826275 863832235 863739491 863599420 863533676 863506377 863423765 863298357 863200128
2496.4 863200128 863153696 863099039 862986267 862900853 862911940 862915635 862856865 862794161 862736046 862644911 862523198
2518.9 862523198 862414837 862364113 862375140 862355053 862221062 862040699 861950755 861942947 861869335 861698031 861570299
2541.3H61570299j1504m470r5725j36972q9943n3823j14441j63615q3446j8001p1168
2563.7H60727191j41084j42694q6605q9050j62065j63853r9480r6679j43230j90138
2584.1H59412313k10166j59085j27375j91868k57969k34604j63853j65462k27213k22027
2604.5H57452691k12312k66910k73883k30670j92404j69575k24054l22044k88367j92583
2624.9H55079889k37643l20614k92361k20894k11716k40564k45452k19882k08437k59757
2645.3H52622569l33071l19839k27153j99854k44856k36929j94251k19763k90215k82466
2665.7H50074172j75953j15216j81079k74956k58565j79052k13504l24130l43144k76446
2686.1H47732127k47777k90036l05653k21252j67370k66313l53754l12150k47538k50876
$$ plain form
2541.3 861570299 861558795 861554325 861458600 861321628 861231685 861177862 861063421 860899806 860816360 860798359 860727191
2563.7 860727191 860586107 860443413 860356808 860267758 860105693 859941840 859842360 859745681 859602451 859412313
2584.1 859412313 859202147 859043062 858915687 858723819 858465850 858231246 858067393 857901931 857674718 857452691
2604.5 857452691 857240379 856973469 856699586 856468916 856276512 856106937 855882883 855560839 855272472 855079889
2624.9 855079889 854842246 854521632 854229271 854008377 853796661 853556097 853310645 853090763 852882326 852622569
2645.3 852622569 852289498 851969659 851742506 851542652 851297796 851060867 850866616 850646853 850356638 850074172
2665.7 850074172 849898219 849783003 849601924 849326968 849068403 848889351 848675847 848351717 848008573 847732127
2686.1 847732127 847484350 847194314 846888661 846667409 846500039 846233726 845879972 845567822 845320284 845069408
2706.5H45069408k95043l00645k78950k93195l37959l41415k64764j86920k22802l42906
2726.9H42204809l97682l41594k81692k74002k91884k95759k71677k73288k79307k41816
2747.3H39256108k36988l26276m04954l48032k74241l25679m09603l92497l09944l03030
2767.7H35924864l75211l90828l40223l62099m58419m95791m66645m16875l57628l59475
2788.1H31901670m38810m89890m81844m50135m73857n86390o40869o12736o00219o09636
2808.5H26517284o45578o79910o71745o71446o84440o91175p45297q09491q46505q70466
2828.9H19201231q42452q68082j002133j118124j335978j746118k096713k287507k360403
2847.2H05543721k217531j781881j209796p27236l98934l39687n81443q67069j033842
$$ plain form
2706.5 845069408 844774365 844473720 844194770 843901575 843563616 843222201 842957437 842770517 842547715 842204809
2726.9 842204809 841807127 841465533 841183841 840909839 840617955 840322196 840050519 839777231 839497924 839256108
2747.3 839256108 839019120 838692844 838287890 837939858 837665617 837339938 836930335 836537838 836227894 835924864
2767.7 835924864 835549653 835158825 834818602 834456503 833998084 833502293 833035648 832618773 832261145 831901670
2788.1 831901670 831462860 830972970 830491126 830040991 829567134 828980744 828339875 827727139 827126920 826517284
2808.5 826517284 825871706 825191796 824520051 823848605 823164165 822472990 821727693 820918202 820071697 819201231
2828.9 819201231 818358779 817490697 816488564 815370440 814034462 812288344 810191631 807904124 805543721
2847.2 805543721 803326190 801544309 800334513 799607277 799208343 798868656 798287213 797420144 796386302
2865.6G96386302j189888j291633j169800j023531j004279r14156p87795p73788p90178
2883.9G87441254q29757r22203r82761r70542r67563j085519j245499j249194j134396
2902.3G78053820j147508j326979j457631j504422j703977k048016k206027k049685
2918.6G64609575j703322j281500q50379l76999O6518K22981K26438M52161Q27492
2937G62192965J094996J282752J416445J307666R08315M66526K07662L2604j22011
2955.3G68787920j19626L2246K12729L16143L47853L53098L77476N09560O00398M91857
2975.7G71909654M46379N61178N21600L52085K96771L50714M63367M23133Q4996j84476
2996.1G75225401k85924m19318m93944n20885n34594m22597k70665l28064n95212q04543
$$ plain form
2865.6 796386302 795196414 793904781 792734981 791711450 790707171 789793015 789005220 788231432 787441254
2883.9 787441254 786611497 785689294 784706533 783735991 782768428 781682909 780437410 779188216 778053820
2902.3 778053820 776906312 775579333 774121702 772617280 770913303 768865287 766659260 764609575
2918.6 764609575 762906253 761624753 760774374 760397375 760463893 760686874 760913312 761365473 762192965
2937 762192965 763287961 764570713 765987158 767294824 768203139 768669665 768877327 768909931 768787920
2955.3 768787920 768668294 768700540 768913269 769229412 769577265 769930363 770307839 770817399 771417797 771909654
2975.7 771909654 772356033 772917211 773438811 773790896 774087667 774438381 774901748 775324881 775409877 775225401
2996.1 775225401 774939477 774520159 774026215 773505330 772970736 772548139 772277474 771949410 771354198 770549655
3016.5G70549655q35836q20100q18014q23081q61347q35657p77185p86960r08434j079321
3036.9G62003720j041711r23276r90152j140296j229763j216531j175404j169801j160383
3055.3G51956403j210749j301765j242340j076877r67264j034558j252234j315773
3071.6G42554843j146733r41575q91089j043082j170277j207590j315236j348079j239299
3089.9G32251883j262069j370549j333237j181662j148999j323461j444042j358509
3106.2G21829355j267791j362562j424849j281619j203120j318097j576126j858830
3122.6G10536361j888156j675964j527071j589596j736581j726985j541913j513421
3138.9F97336674j800835j999736j897335j772940j704634j649558j751244j987875
$$ plain form
3016.5 770549655 769713819 768893719 768075705 767252624 766391277 765555620 764778435 763991475 763083041 762003720
3036.9 762003720 760962009 760038733 759048581 757908285 756678522 755461991 754286587 753116786 751956403
3055.3 751956403 750745654 749443889 748201549 747124672 746157408 745122850 743870616 742554843
3071.6 742554843 741408110 740466535 739575446 738532364 737362087 736154497 734839261 733491182 732251883
3089.9 732251883 730989814 729619265 728286028 727104366 725955367 724631906 723187864 721829355
3106.2 721829355 720561564 719199002 717774153 716492534 715289414 713971317 712395191 710536361
3122.6 710536361 708648205 706972241 705445170 703855574 702118993 700392008 698850095 697336674
3138.9 697336674 695535839 693536103 691638768 689865828 688161194 686511636 684760392 682772517
3155.2F82772517k123832k091408j982689j912773j939058k012372k047479j999140
3171.5F66663766j955271k011716k111674k124965k068817k051950k059042k074778
3187.8F50205553k123535k137184k130747k167523k171338k111673k070665k076447
3204.1F33216441k054513k013266k010763k059757k086401k007783j962244k019406
3220.5F17002308k057492k033055j990438j950562j869142j777887j836002j946270
3236.8F01541460j928509j847625j720488j567661j567960j725257j728177j528442
3253.1E87927341j431345j523793j594842j512110j430392j473189j496017j375794
3269.4E76089859j332104j469195j571953j605630j603246j564205j564800j595378
$$ plain form
3155.2 682772517 680648685 678557277 676574588 674661815 672722757 670710385 668662906 666663766
3171.5 666663766 664708495 662696779 660585105 658460140 656391323 654339373 652280331 650205553
3187.8 650205553 648082018 645944834 643814087 641646564 639475226 637363553 635292888 633216441
3204.1 633216441 631161928 629148662 627137899 625078142 622991741 620983958 619021714 617002308
3220.5 617002308 614944816 612911761 610921323 608970761 607101619 605323732 603487730 601541460
3236.8 601541460 599612951 597765326 596044838 594477177 592909217 591183960 589455783 587927341
3253.1 587927341 586495996 584972203 583377361 581865251 580434859 578961670 577465653 576089859
3269.4 576089859 574757755 573288560 571716607 570110977 568507731 566943526 565378726 563783348
3285.7E63783348j575172j496733j497030j632869j762331j836300j855552j789510
3302E50337851j689792j713216j964748k249658k326548k228558k135515k136767k192855
3320.4E31700194k199233k182364k313197k491712k507806k433837k354562k280593
3336.7E12936890k358377k549350k635956k657652k602458k433538k510309k834738
3353D92354512k925902k737612k551079k521723k514720k343685k246141k464354k763361
3371.4D69285935k731651k383619k120078k077073k113908k032638j793325j484990
3387.7D52548653j196534j258999j616746j596004j106321q28326j153439j541675
3404D42250609j339823q94039o97971o85722p98195q58843o13749l67553l46332k20329
$$ plain form
3285.7 563783348 562208176 560711443 559214413 557581544 555819213 553982913 552127361 550337851
3302 550337851 548648059 546934843 544970095 542720437 540393889 538165331 536029816 533893049 531700194
3320.4 531700194 529500961 527318597 525005400 522513688 520005882 517572045 515217483 512936890
3336.7 512936890 510578513 508029163 505393207 502735555 500133097 497699559 495189250 492354512
3353 492354512 489428610 486690998 484139919 481618196 479103476 476759791 474513650 472049296 469285935
3371.4 469285935 466554284 464170665 462050587 459973514 457859606 455826968 454033643 452548653
3387.7 452548653 451352119 450093120 448476374 446880370 445774049 444945723 443792284 442250609
3404 442250609 440910786 440016747 439318776 438633054 437834859 436976016 436362267 435994714 435648382 435428053
3424.4D35428053R9480L62069L63171L85552N81235N17368K50042L01123O61343R82612
3444.8D39932048J107037J071811J131117J292080J432002J635819J812786J708299
3461.1D51122999J670659K060741K318799J942099J404702J461357J906008K252161
3477.4D66139525K276242J950353J836866K113730K203554K071172K146721K384126
3493.8D83122289K544582K483994K390891K381087K181202J970917K135366K479762
3510.1E01690090K747476K719819K449334K433002K708018K987206K862334K497017
3526.4E23094296K574385K868175K970219L101826L169059L054500L164649L416300
3542.7E47413409L457308L197491K985835L121495L349483L404617L498495L740788
$$ plain form
3424.4 435428053 435527533 435889602 436252773 436638325 437219560 437736928 437986970 438288093 438949436 439932048
3444.8 439932048 441039085 442110896 443242013 444534093 445966095 447601914 449414700 451122999
3461.1 451122999 452793658 454854399 457173198 459115297 460519999 461981356 463887364 466139525
3477.4 466139525 468415767 470366120 472202986 474316716 476520270 478591442 480738163 483122289
3493.8 483122289 485666871 488150865 490541756 492922843 495104045 497074962 499210328 501690090
3510.1 501690090 504437566 507157385 509606719 512039721 514747739 517734945 520597279 523094296
3526.4 523094296 525668681 528536856 531507075 534608901 537777960 540832460 543997109 547413409
3542.7 547413409 550870717 554068208 557054043 560175538 563525021 566929638 570428133 574168921
3559E74168921L792285L521741L513932M283607M539251L920854L718018M010022M294514
3577.4F09763145M513503M663407M610777M575908M713655M663646M431188M577518
3593.7F46512747M842460M899740M912496M872203M666865M514038M849136N107224
3610F85176909M935563M808485M531264M600466N107343M658282L896177L764688M575491
3628.4G26054668N133212M204512L776788L769637L672778L696203L605187L335417
3644.7G57248402L360510L931283L756643K599060K246321K861976K919078K257288
3661G81180561J928269J977861J958728J967013K067566J672864J517832J680792J367688
3679.4G97319174J197398J268804J316130J480818J448154R72271Q98600J101315J092016
$$ plain form
3559 574168921 577961206 581482947 584996879 589280486 593819737 597740591 601458609 605468631 609763145
3577.4 609763145 614276648 618940055 623550832 628126740 632840395 637504041 641935229 646512747
3593.7 646512747 651355207 656254947 661167443 666039646 670706511 675220549 680069685 685176909
3610 685176909 690112472 694920957 699452221 704052687 709160030 713818312 717714489 721479177 726054668
3628.4 726054668 731187880 735392392 739169180 742938817 746611595 750307798 753912985 757248402
3644.7 757248402 760608912 764540195 768296838 770895898 773142219 776004195 778923273 781180561
3661 781180561 783108830 785086691 787045419 789012432 791079998 792752862 794270694 795951486 797319174
3679.4 797319174 798516572 799785376 801101506 802582324 804030478 805002749 805901349 807002664 808094680
3697.7H08094680J013160J053453J004278Q22246P37310P72714Q41439P42018N12183
3716.1H15593481M28915M67241N06043N07653M72546M16159M09305O02842Q11398P57754
3736.5H20973337N00679J16586j98006J24395O19054L82483K73287L86178K99871J82212
3756.9H23660076J36852J59025J96934K93076K97308J92821J69337J27494J71781L77297
3777.3H25782001L86119Q8692q6248K4974J72913K05755K05756J70588K06113K75791
3797.7H27432454J03771Q1241J64211m2081P987J51873N0724q285K23219L71694R6858
3820.1H28633666j8716k6822k3663N5194M1902J34408L07203K59042L1650j15156m4823
3842.5H29233885Q5115M3392r1314k52664k81453J72973K79188N0962k8313J8776J57893
$$ plain form
3697.7 808094680 809107840 810161293 811165571 811987817 812725127 813497841 814339280 815081298 815593481
3716.1 815593481 816022396 816489637 816995680 817503333 817975879 818392038 818801343 819404185 820215583 820973337
3736.5 820973337 821474016 821590602 821392596 821516991 822136045 822518528 822791815 823177993 823477864 823660076
3756.9 823660076 823796928 823955953 824152887 824445963 824743271 824936092 825105429 825232923 825404704 825782001
3777.3 825782001 826168120 826256812 826170564 826195538 826368451 826574206 826779962 826950550 827156663 827432454
3797.7 827432454 827536225 827617466 827781677 827739596 827747583 827899456 827950180 827941895 828165114 828536808 828633666
3820.1 828633666 828614950 828588128 828564465 828619659 828661561 828795969 829103172 829362214 829393864 829278708 829233885
3842.5 829233885 829319000 829362392 829271078 829018414 828736961 828909934 829189122 829240084 829211771 829230547 829388440
3865H29388440R3102n0425N6028K9981k086R835j4007J53780J19149m0114m9829j00136
3889.4H29593718k6107O7115m3809o4612L8505r895q1002j3054j4126n6267l993N7757
3913.9H29444230L6895J728J0372l6598p6174m471M3869M2737O9797N9068o5863j10805
3938.4H29414785j5438M1426O8008Q6725P1168J5378n4479m1186O7889J08362K9683
3960.8H29792321o438J1146L5108R3281Q5950o139k9982q94L4631J36494J81377K7359
3985.3H30354214q4520J6034Q9884L6835j8060J8537
3997.5H30412924
$$ plain form
3865 829388440 829481542 829431117 829487145 829517126 829515040 829524875 829510868 829664648 829783797 829743683 829693854 829593718
3889.4 829593718 829567611 829634726 829590917 829526305 829564810 829554915 829473913 829460859 829446733 829390466 829386473 829444230
3913.9 829444230 829481125 829482853 829493225 829456627 829380453 829375982 829419851 829462588 829532385 829591453 829525590 829414785
3938.4 829414785 829399347 829440773 829508781 829595506 829666674 829682052 829627573 829586387 829654276 829762638 829792321
3960.8 829792321 829785883 829797029 829832137 829925418 830011368 830005229 829975247 829974353 830008984 830145478 830326855 830354214
3985.3 830354214 830269694 830285728 830375612 830412447 830394387 830412924
3997.5 830412924
##END=$$ End of the data block
