##TITLE=$$ Begin of the data block
##JCAMP-DX=5.00 $$ ACD/SpecManager v 10.08
##SPECTROMETER/DATA SYSTEM=Alpha
##DATE=09 Apr 2014 11:14:46
##DATA TYPE=INFRARED SPECTRUM
##DATA CLASS=XYDATA
##ORIGIN=
##OWNER=
##NPOINTS=1765
##FIRSTX=399.75695801
##LASTX=3997.56933594
##MAXX=3997.56933594
##MINX=399.75695801
##MAXY=0.86580884
##MINY=0.43515742
##XFACTOR=1.0000000000
##YFACTOR=1.000000000000000e-9
##FIRSTY=0.71034688
##DELTAX=2.03957629
##XUNITS=1/CM
##YUNITS=ARBITRARY UNITS
##XYDATA=(X++(Y..Y))
399.8G10346878O48319o96957j831591j014888M37081L52025p92623o71089P64728
418.1G07541883M68492j528203j731336l23594O83070R4592p97391l04043N46574j74939
438.5G04475105j309812q17776O45578O69420n49198p76648K01523O24836l96192j354456
458.9G01412380n78761K84969j99258j202702r38356K90990J84357j048148j099050
477.3F97106421n3644M43578j86146q14438l19063L74913r3639r90629q10266L5644
497.7F94692731J63913o28412j126409n10990J46091l03388j131058q46803J70589
516F90626264l934j281560j434326l85165m6134r31502j477479p89106O2287l91722
536.4F83947623j298487r14634J50740K01047p52211j250386n95689J5855o20425j535177
$$ y = [710346878, 710995197, 710298240, 708466649, 707451761, 707888842, 708240867, 707448244, 706777155, 707541883, 708010375, 706482172, 704750836, 704427242, 705110312, 705204904, 704407513, 704103470, 704650044, 704475105, 703165293, 702347517, 702993095, 703662515, 703113317, 702336669, 702538192, 703163028, 702766836, 701412380, 700833619, 701118588, 700919330, 699716628, 698778272, 699069262, 699253619, 698205471, 697106421, 697052777, 697496355, 697310209, 696495771, 696176708, 696551621, 696457982, 695467353, 694657087, 694692731, 694856644, 694228232, 693101823, 692590833, 692736924, 692433536, 691302478, 690455675, 690626264, 690622330, 689340770, 687906444, 687521279, 687475145, 686543643, 685066164, 684277058, 684339345, 683947623, 682649136, 681734502, 681885242, 682086289, 681334078, 680083692, 679488003, 679503858, 678883433, 677348256]
556.8F77348256j186490k27749l84689j382172j523316o06060k58386j173138j834035
575.2F68772221j088918j27852m10854j253725j159310j99795J23024p16745j233876
593.5F62704170m03881K34663o45697j680911j325130m30167n25415j206994j068413
611.9F55652225o1870O35863P60913J203477K262533L121078K880096K144396K128363
630.2F70727074K703130K722919J880229J324594J678109J879037J333713R83238J506806
648.6F86738849K074957J505017M19497N69404K255737L482640K824485J339496R45806
666.9G02155888K572000K911568J781642J379431J914322K385139J793445R51409J118660
685.3G18963504J828432J706958P89106M49895J035095J363277P76291J50800O27756
$$ y = [677348256, 676161766, 675934017, 675549328, 674167156, 672643840, 672037780, 671779394, 670606256, 668772221, 667683303, 667555451, 667144597, 665890872, 664731562, 664531767, 664654791, 663938046, 662704170, 662300289, 662534952, 661889255, 660208344, 658883214, 658453047, 657927632, 656720638, 655652225, 655590355, 656226218, 656987131, 658190608, 660453141, 663574219, 666454315, 668598711, 670727074, 673430204, 676153123, 678033352, 679357946, 681036055, 682915092, 684248805, 685232043, 686738849, 688813806, 690318823, 690738320, 691307724, 693563461, 697046101, 699870586, 701210082, 702155888, 704727888, 707639456, 709421098, 710800529, 712714851, 715099990, 716893435, 717844844, 718963504, 720791936, 722498894, 723288000, 723737895, 724772990, 726136267, 726912558, 727063358, 727691114]
703.7G27691114J617968J647711Q96156Q32617J741528K073527J167595O39975J536429
722G39844620K367258J759112O64890P86901J795232J852751P06672J83285J148819
740.4G51109540J905442J256466M83095R37879J896978J803160P92861N52117J445711
758.7G62183249J885891J076102K75433O89924J414001R67383j39236l04282L28660
777.1G68377125K54214p04288j189471m59134M72963M65750J81079R36568K410412
795.4G70745218L148496K843022K739072L412783L708601K823651J770854J723766
811.7G92915463K123237J677215M06504l97563l00050m19497j483620k561509k564550
830.1G89395630j998841j989305k486825k461374j686335j215339j570105j702249
$$ y = [727691114, 729309082, 730956793, 731852949, 732685566, 734427094, 736500621, 737668216, 738308191, 739844620, 742211878, 743970990, 744635880, 745422781, 747218013, 749070764, 749777436, 749960721, 751109540, 753014982, 754271448, 754754543, 755692422, 757589400, 759392560, 760185421, 760737538, 762183249, 764069140, 765145242, 765420675, 766110599, 767524600, 768491983, 768352747, 768048465, 768377125, 768631339, 767927051, 766737580, 766278446, 766751409, 767217159, 767398238, 768334806, 770745218, 773893714, 776736736, 779475808, 782888591, 786597192, 789420843, 791191697, 792915463, 795038700, 796715915, 797122419, 796724856, 796424806, 796005309, 794521689, 791960180, 789395630, 787396789, 785407484, 782920659, 780459285, 778772950, 777557611, 775987506, 774285257]
846.4G74285257o11901J070439K100289K525330L388166M743815N414247M866123M148663
864.8H01930428M198074M280925L364384J998365J480639J784861J608789M30822n79119
883.1H20498168n29825l27468r67980j770913j465678l00169L13758P5698J36912R91524
903.5H16654027J474857P10010l05473m64201l75152j097620k310514k694368j943648
921.9H09647918j207710j145005r43482O4314R81390P79092r298k14279J53065P7367
942.3H08183372o93858j252949j143873j179754k019406l063976l466726l553927m255175
960.6G87553728n487860o341993o584228o887733p462442p572711o735563n486846
977G34994352m668057m334390l875315l183008k725422k577424k361119j820445j192152
$$ y = [774285257, 773673356, 774743795, 776844084, 779369414, 782757580, 787501395, 792915642, 797781765, 801930428, 806128502, 810409427, 813773811, 815772176, 817252815, 819037676, 820646465, 821077287, 820498168, 819968343, 819640875, 818672895, 816901982, 815436304, 815136135, 815449893, 815525591, 815662503, 816654027, 818128884, 818838894, 818533421, 818069220, 817694068, 816596448, 814285934, 811591566, 809647918, 808440208, 807295203, 806351721, 806416035, 807397425, 808176517, 808167219, 807952940, 808106005, 808183372, 807489514, 806236565, 805092692, 803912938, 801893532, 798829556, 795362830, 791808903, 787553728, 782065868, 775723875, 769139647, 762251914, 754789472, 747216761, 740481198, 734994352, 730326295, 725991905, 722116590, 718933582, 716208160, 713630736, 711269617, 709449172, 708257020]
995.3G08257020r14336r37164q67545o93739q96513j631618k393901k784073k982796
1013.7F94155335l258586l410041l196359k835810k656936k675653k629697k387464
1030F71104789k144158k035439j955986j780450j518429j365125j427054j556397j531482
1048.3F55790269j324832j055360o65665l6954P12275J158655J026809N19097p3493
1066.7F56050801p06732j365721j832962j912296j744390j626432j617014j636445
1083F43608809j663745j768470j956641j996279j634956r85562m38035j54018J7404
1101.4F33028507J58549J87218N2571j76310l29197m52697p73430j355887j982688
1119.7F28356636k225936j886666j408100q42273N48959J819551J658797J182377J387120
$$ y = [708257020, 707342684, 706405520, 705537975, 704844236, 703947723, 702316105, 699922204, 697138131, 694155335, 690896749, 687486708, 684290349, 681454539, 678797603, 676121950, 673492253, 671104789, 668960631, 666925192, 664969206, 663188756, 661670327, 660305202, 658878148, 657321751, 655790269, 654465437, 653410077, 652744412, 652707458, 653419733, 654578388, 655605197, 656124294, 656050801, 655344069, 653978348, 652145386, 650233090, 648488700, 646862268, 645245254, 643608809, 641945064, 640176594, 638219953, 636223674, 634588718, 633603156, 633165121, 633011103, 633028507, 633187056, 633374274, 633426845, 633250535, 632921338, 632468641, 631695211, 630339324, 628356636, 626130700, 624244034, 622835934, 621993661, 622542620, 624362171, 626020968, 627203345, 628590465]
1138.1F28590465J743376J750827J510203J319110J243710J152516J060784J147389
1154.4F39518380J446963J803159K106786K475262L055095L732741M243076M529059
1170.7F62910521M710436M793882M683197M447281M254818M065871L656805K959728
1187F96482539K231717J633466J033604M38928J21236K12729N42820Q60989J047671
1205.4G04605699J168429J216591J004636N53429K25425J96636K19881J23143O7473
1223.7G09381342K25007M86374O11604O34312P83742J044273J157343J053453R44376
1242.1G16321826R50813R16302O45638K65479R1672J47879J89960J57356L05951P52211
1262.5G20745087J236736J508713J669884J963258K288103K416789K429307K499223
$$ y = [628590465, 630333841, 632084668, 633594871, 634913981, 636157691, 637310207, 638370991, 639518380, 640965343, 642768502, 644875288, 647350550, 650405645, 654138386, 658381462, 662910521, 667620957, 672414839, 677098036, 681545317, 685800135, 689866006, 693522811, 696482539, 698714256, 700347722, 701381326, 701820254, 701941490, 702154219, 702697039, 703558028, 704605699, 705774128, 706990719, 707995355, 708548784, 708774209, 708970845, 709190726, 709313869, 709381342, 709606349, 710092723, 710704327, 711338639, 712122381, 713166654, 714323997, 715377450, 716321826, 717272639, 718188941, 718834579, 719100058, 719191730, 719339609, 719529569, 719686925, 719992876, 720745087, 721981823, 723490536, 725160420, 727123678, 729411781, 731828570, 734257877, 736757100]
1278.8G36757100K646744K769172K787173K803683K886653K881944K693951K455175
1295.1G58681595K302945K178550J971602J710534J498819J349449J199663J015424
1311.4G71908581Q18014P05541P40885Q05676Q00371Q06392Q97050R71615Q63016O23762
1331.8G79940903M39406L70085L06666J37388K1041J40846L75688M89473L86834J93954
1352.2G82802284R8109O9797k1934k31028n79774q31843q21590q27790p84576o09219
1372.6G78262436o37829q89540j183152j548290j615107j078308n99324o76632o90282
1391G69343972o19590r01401j342595j677990j704395j665711k013564k133012j768470
1409.3G55517244j444101j263738j060068r52661j068712r72807q33452p33733l85642
$$ y = [736757100, 739403844, 742173016, 744960189, 747763872, 750650525, 753532469, 756226420, 758681595, 760984540, 763163090, 765134692, 766845226, 768344045, 769693494, 770893157, 771908581, 772726595, 773432136, 774173021, 774978697, 775779068, 776585460, 777482510, 778454125, 779317141, 779940903, 780380309, 780750394, 781057060, 781194448, 781215489, 781356335, 781732023, 782221496, 782608330, 782802284, 782900393, 782970190, 782948256, 782717228, 782137454, 781305611, 780484021, 779656231, 778871655, 778262436, 777624607, 776735067, 775551915, 774003625, 772388518, 771310210, 770710886, 770034254, 769343972, 768724382, 767822981, 766480386, 764802396, 763098001, 761432290, 759418726, 757285714, 755517244, 754073143, 752809405, 751749337, 750796676, 749727964, 748755157, 747921705, 747187972, 746802330]
1427.7G46802330j80304k55823j48535J93000M65214M98057N71131Q07166J252771
1446G50005007J603842J595795J675307K209366L429174M070282K886355K709925L639281
1464.4G73824334L960192L427804L687262M823029M616917L255486K473593K196491
1480.7H02265108K042055J654863J152039M51386k56598m01080n47290j240969j725077
1499.1H03394437j478434j090348j412391l293395l565192k624333k335072k171576
1515.4G85423696j991093j648426j830697k030850j797795j751721j361072j106083
1531.7G71905959j447380j184583m26888m44532j166999j168072p71105k95103n36
1550.1G65000761J63912M18485P22050M18246q87513r24170p08223q19802j373529
$$ y = [746802330, 746622026, 746366203, 746217668, 746410668, 746875882, 747373939, 747945070, 748752236, 750005007, 751608849, 753204644, 754879951, 757089317, 760518491, 764588773, 767475128, 770185053, 773824334, 777784526, 781212330, 784899592, 789722621, 794339538, 797595024, 800068617, 802265108, 804307163, 805962026, 807114065, 807565451, 807308853, 806907773, 806360483, 805119514, 803394437, 801916003, 800825655, 799413264, 796119869, 792554677, 789930344, 787595272, 785423696, 783432603, 781784177, 779953480, 777922630, 776124835, 774373114, 773012042, 771905959, 770458579, 769273996, 768847108, 768402576, 767235577, 766067505, 765296400, 765001297, 765000761, 765164673, 765583158, 766305208, 766723454, 765835941, 764911771, 764203548, 763383746, 762010217]
1568.4G62010217k276302k198875k235353l608226m029930l634989l865540m160226
1584.7G36000776m480958m789471m942954n002677n231858n393147n301058n215228
1601.1F95643425n213261n204558n279839n434573n253136m751801n051792n935550
1617.4F53518915m571736l464400l955722l901601l332257k791942j763939q47638
1633.7F28889680l11613K80201R30190J628816K363086L629208M352391L283262L980100
1652F49025321O104529M266858L358722M018187M885555M987478M301667M737794N453587
1670.4F91139698M682720M755854N262316M705608M474699N243480O654084N442023
1686.7G32360482M335880M683316M558146N200804N960226N869329O548166N386472
$$ y = [762010217, 759733915, 757535040, 755299687, 751691461, 747661531, 744026542, 740161002, 736000776, 731519818, 726730347, 721787393, 716784716, 711552858, 706159711, 700858653, 695643425, 690430164, 685225606, 679945767, 674511194, 669258058, 664506257, 659454465, 653518915, 648947179, 645482779, 641527057, 637625456, 634293199, 631501257, 629737318, 628889680, 628578067, 628858268, 629788458, 631417274, 633780360, 637409568, 641761959, 645045221, 649025321, 655129850, 659396708, 662755430, 666773617, 671659172, 676646650, 680948317, 685686111, 691139698, 695822418, 700578272, 705840588, 710546196, 715020895, 720264375, 726918459, 732360482, 736696362, 741379678, 745937824, 751138628, 757098854, 762968183, 769516349, 774902821]
1703G74902821M552781M577875L938437L617525L589749L576994L500939K742827K142608
1721.4H07142556K147376K193749K124310K253890K242505K148211J821101J529753
1737.7H23603451J781583J880765J704037J748204J934767J886189J552642J332402
1754H37424040J466334J551628J332164J101374R40502R88662J127422J110375Q55625
1772.4H47898126O00159O05821O89805O21617N34057O02961O69241O62982O42896N85795
1792.8H54113460M49478M19796M64856M39108L64482L66450L85344L70085L69251L72290
1813.2H58114600L34442K33888K54333M14014M95911L87073L14354L43204K26915J12414
1833.6H61231148J08063J73748L17752M12703K85506J08361J24276J77026J49727Q2850
$$ y = [774902821, 779455602, 784033477, 787971914, 791589439, 795179188, 798756182, 802257121, 804999948, 807142556, 809289932, 811483681, 813607991, 815861881, 818104386, 820252597, 822073698, 823603451, 825385034, 827265799, 828969836, 830718040, 832652807, 834538996, 836091638, 837424040, 838890374, 840442002, 841774166, 842875540, 843816042, 844804704, 845932126, 847042501, 847898126, 848498285, 849104106, 849793911, 850415528, 850949585, 851552546, 852221787, 852884769, 853527665, 854113460, 854562938, 854982734, 855447590, 855886698, 856251180, 856617630, 857002974, 857373059, 857742310, 858114600, 858449042, 858682930, 858937263, 859351277, 859847188, 860234261, 860548615, 860891819, 861118734, 861231148, 861339211, 861512959, 861830711, 862243414, 862528920, 862637281, 862761557, 862938583, 863088310, 863171160]
1854H63171160J13547K12550K26915J66774K08437L28720K52247l8386j19507L8922
1874.4H64561379J71184J39654L4034M9532J40130J63496Q5115o795L2843R7394N0008
1896.8H65517974r775K7358J01805J05679J8835o4671l7908N4836P7963J2815j6928
1919.2H65787983K0862k0147j18494j15454l4452K444l7849p1406k9445M6015K0623
1941.7H65450680j31547j93834j26601p9572j19805j62602j09851n6625q4698j35958
1962.1H64249587j30415j02579j27495j76906j66476r8348p0870q9943j10150j22308
1982.5H63054097j02401p0989q2314j16289j52409j72913j41680j02878j29998j81436
2002.8H61800790j63615j37925j53124j41979r9957r4413j34409j69933j77800j42038
$$ y = [863171160, 863284707, 863497257, 863724172, 863890946, 864099383, 864428103, 864680350, 864641964, 864522457, 864561379, 864732563, 864872217, 864906251, 864955783, 865095913, 865259409, 865344524, 865337729, 865370572, 865467966, 865517974, 865508199, 865535557, 865637362, 865743041, 865761876, 865697205, 865659297, 865714133, 865792096, 865804911, 865787983, 865808845, 865788698, 865670204, 865554750, 865520298, 865522742, 865484893, 865413487, 865384042, 865430057, 865450680, 865319133, 865125299, 864998698, 864919126, 864799321, 864636719, 864526868, 864470243, 864385545, 864249587, 864119172, 864016593, 863889098, 863712192, 863545716, 863447368, 863376498, 863286555, 863176405, 863054097, 862951696, 862880707, 862798393, 862682104, 862529695, 862356782, 862215102, 862112224, 861982226, 861800790, 861637175, 861499250, 861346126, 861204147, 861104190, 861009777, 860875368, 860705435, 860527635, 860385597]
2023.2H60385597j05024j01804j16945j21355j11758j13309j24931j28865j01924m9234
2043.6H59310448m5061j11699j29581p3492l3856m8279p6354p0214n0426p4625j13368
2066.1H58483493p8022k0147j0907l2962l5047M232K5689k4795o7473N067Q0705K8133
2090.5H58357966n3108l9458K4855L6299k0623l1650N2273R7394M1604k3186m709O7652
2115H58505309O4432j7702j0670R0659J18435M7385J6570P2956J19448J03533L7253
2137.5H59147608K146O3062J24633R4712M7088O8306J17362J11639M8876K5571R8943
2159.9H59949946J45972N3108l3975K2114J39474J83285J04248L0875Q1420J42336
2180.3H60818803J07527N8830P7426J20104J08957M2856P868O0379J05202N0307j4306
$$ y = [860385597, 860280573, 860178769, 860061824, 859940469, 859828711, 859715402, 859590471, 859461606, 859359682, 859310448, 859265387, 859153688, 859024107, 858950615, 858916759, 858868480, 858792126, 858721912, 858671486, 858596861, 858483493, 858405471, 858385324, 858374417, 858341455, 858306408, 858310640, 858336329, 858311534, 858244061, 858249128, 858329833, 858357966, 858304858, 858265400, 858290255, 858326554, 858305931, 858274281, 858326554, 858423948, 858465552, 858442366, 858437657, 858505309, 858569741, 858552039, 858541369, 858632028, 858750463, 858797848, 858814418, 858887374, 859006822, 859110355, 859147608, 859149754, 859212816, 859337449, 859432161, 859479249, 859547555, 859664917, 859776556, 859825432, 859851003, 859949946, 860095918, 860149026, 860115051, 860137165, 860276639, 860459924, 860564172, 860595047, 860676467, 860818803, 860926330, 860985160, 861062586, 861182690, 861291647, 861334503, 861342371, 861402750, 861507952, 861558259, 861543953]
2202.7H61543953J8418Q6069P7248R239r060O7413J08480L1412k2471K1457P8083N3525
2227.2H62063766m0889n7042L0100O3003j0074m7028K4736M8936j2815m4525k5868
2249.6H61992300M3928O9559k9624r5188j6034N2929l576o8128m7744L0279P1228K4438
2274.1H62024367k861N5909R2089N0843J1682j5735l5942m5836n7995m0829l3438o7890
2298.6H61934364p7725p3433j22964j94311k31564k27213j71483r2148j34290l35037
2319H60274196m62473l36349j30653j24633k48611k98918k60353k13384j71364j44899
2339.4H57882559n0425L37899Q84532Q66116J58011o09695r30965p83325n07831j54376
2359.8H57092500K01821M19140N61237P22230Q75652R27209Q57115P37250P10011P52747
$$ y = [861543953, 861562371, 861648440, 861725688, 861734927, 861725867, 861793280, 861901760, 861933172, 861910701, 861932158, 862010241, 862063766, 862022877, 861965835, 861995935, 862058938, 862048864, 862001836, 862026572, 862075508, 862062693, 862018168, 861992300, 862036228, 862105787, 862076163, 861980975, 861964941, 862017870, 862014294, 861946166, 861898422, 861928701, 861999929, 862024367, 862021506, 862077415, 862169504, 862220347, 862232029, 862216294, 862180352, 862134516, 862076521, 862035692, 862002254, 861934364, 861856639, 861783206, 861660242, 861465931, 861234367, 861007154, 860835671, 860743523, 860609233, 860274196, 859811723, 859475374, 859344721, 859220088, 858971477, 858672559, 858412206, 858198822, 858027458, 857882559, 857832134, 858170033, 859054565, 859920681, 860078692, 859468997, 858538032, 857754707, 857246876, 857092500, 857294321, 857713461, 858274698, 858996928, 859872580, 860799789, 861656904, 862394154, 863104165, 863856912]
2380.2H63856912O44385L88682J97411J55210J43171M2021m7147J6451J16765P8440
2400.6H65592301k8670j6630R4474J20520M053j11460m4644Q3625L3379j12295j19985
2423H65494668P153P7963J6689o2048l5644J2040m4226j12892q1956j5378k0206q1122
2447.5H65155041p7605K7418P1943m3750j35481n2214K4498o5625j72794j26004J6033
2469.9H64621460N1976n8532j41978j01328j1742m888r8228j23203m3929l1292q5712
2492.3H63972604j19209j16229p8380n7101q2136p4088k4259n4360j25944r5070j3590
2514.8H63132238j9312q6486j11341p7784k0564k1815j03474j33932o2763k2650p9751
2537.2H62392366j31667j05202o0439n9664q8215j17064j16825q0526q7797j25826
$$ y = [863856912, 864501297, 864889979, 865087390, 865242600, 865385771, 865427792, 865380645, 865397096, 865513861, 865592301, 865563631, 865547001, 865641475, 865761995, 865766048, 865654588, 865609944, 865693569, 865726948, 865614653, 865494668, 865501821, 865579784, 865596473, 865534425, 865498781, 865510821, 865466595, 865353703, 865271747, 865256369, 865236163, 865155041, 865077436, 865104854, 865176797, 865133047, 864997566, 864945352, 864969850, 864904225, 864731431, 864605427, 864621460, 864673436, 864614904, 864472926, 864371598, 864359856, 864354968, 864256740, 864133537, 864089608, 864058316, 863972604, 863853395, 863737166, 863658786, 863601685, 863519549, 863445461, 863421202, 863366842, 863240898, 863145828, 863132238, 863112926, 863026440, 862915099, 862837315, 862816751, 862794936, 862691462, 862557530, 862494767, 862472117, 862392366, 862260699, 862155497, 862095058, 862035394, 861947179, 861830115, 861713290, 861632764, 861544967, 861419141]
2557.6H61419141q9109m1246o2108j24395j46925q4758q1182j66714j85668j33574
2578H60303462j17839j08421r3162j53362j98246j75416j98543k48313k18391j51694
2598.4H58640075j66595k30849k35081k11835k39491k88606k82049k09510j63377k18033
2618.8H56394649l15071l11613k34425k50816l19004k81453j98782j98602k40863k33829
2639.2H53810191j72794j88410l03149l55125k82466j81079j68800k45393k90632k39551
2659.6H51382792k05696k66969k87175k03729j49190j98960k72394k41041j66774k41518
2680H49149346l94463l75688k12610j48535k29060k96176k56836k23577k92600l35872
2700.4H46383929k84433k24710k21848k72334l16143l11672k91586l20018l57151l08156
$$ y = [861419141, 861330032, 861288786, 861226678, 861102283, 860955358, 860870600, 860789418, 860622704, 860437036, 860303462, 860185623, 860077202, 859984040, 859830678, 859632432, 859457016, 859258473, 859010160, 858791769, 858640075, 858473480, 858242631, 858007550, 857795715, 857556224, 857267618, 856985569, 856776059, 856612682, 856394649, 856079578, 855767965, 855533540, 855282724, 854963720, 854682267, 854483485, 854284883, 854044020, 853810191, 853637397, 853448987, 853145838, 852790713, 852508247, 852327168, 852158368, 851912975, 851622343, 851382792, 851177096, 850910127, 850622952, 850419223, 850270033, 850071073, 849798679, 849557638, 849390864, 849149346, 848754883, 848379195, 848166585, 848018050, 847788990, 847492814, 847235978, 847012401, 846719801, 846383929, 846099496, 845874786, 845652938, 845380604, 845064461, 844752789, 844461203, 844141185, 843784034, 843475878]
2720.8H43475878k21908k20120l13639l70741l18468k65181k84970l25918l09825k66194
2741.2H40578914k84791k90454k31445k39968l44157m00901l34203k60353k96235l71814
2761.6H37524593l78847l36945l29852l52741l37958l21627l84688m78506m96447m46558
2782H33660424m00961l82542m04895m53293m80413m97342m94957n04732n78344o14583
2802.3H28848362n89490n90682o10709o32644o43492o41822o75738p05719p06435p56025
2822.7H22295606q19087q20696q13484q51810r24707j008451j100778j340211j763701
2841.1H12852681k116502k294838k337396k180636j768768j222193p49946m33028l72588
2859.5G99376786n80073q31186j023889j199126j278878j180648j052797j000941q97348
$$ y = [843475878, 843253970, 843033850, 842720211, 842349470, 842031002, 841765821, 841480851, 841154933, 840845108, 840578914, 840294123, 840003669, 839772224, 839532256, 839188099, 838787198, 838452995, 838192642, 837896407, 837524593, 837145746, 836808801, 836478949, 836126208, 835788250, 835466623, 835081935, 834603429, 834106982, 833660424, 833259463, 832876921, 832472026, 832018733, 831538320, 831040978, 830546021, 830041289, 829462945, 828848362, 828258872, 827668190, 827057481, 826424837, 825781345, 825139523, 824463785, 823758066, 823051631, 822295606, 821476519, 820655823, 819842339, 818990529, 818065822, 817057371, 815956593, 814616382, 812852681, 810736179, 808441341, 806103945, 803923309, 802154541, 800932348, 800182402, 799749374, 799376786, 798796713, 797965527, 796941638, 795742512, 794463634, 793282986, 792230189, 791229248, 790331900]
2877.8G90331900p76231p68960q10742q42571q88527r46641r57072r45568j061558
2896.2G82334030j239777j251399j147449j168907j339376j470685j539171j723349
2912.5G71453917k024710k184868k040625j706659j300276q42631l50475N6088J87397
2930.8G61247158K32756M92633Q63254J121997J280904J404167J313328Q98421M35710
2949.2G69290328K03431O0320r5070j22070j2756J99974L69787L73304L26693L50535
2969.6G70944476M93586N82755M88877M65512N81742N52177L76284L03090L55661M62770
2990G75606930M04120M0889j88172k12133l69787n13971n51999n54740m46082l07023
3010.4G72908032l54469n84364p62284p90596q05854q08895q02338q83162q68142p64668
$$ y = [790331900, 789555669, 788786709, 787975967, 787133396, 786244869, 785298228, 784341156, 783395588, 782334030, 781094253, 779842854, 778695405, 777526498, 776187122, 774716437, 773177266, 771453917, 769429207, 767244339, 765203714, 763497055, 762196779, 761354148, 761003673, 761059761, 761247158, 761479914, 761972547, 762835801, 763957798, 765238702, 766642869, 767956197, 768854618, 769290328, 769493759, 769554079, 769459009, 769336939, 769324183, 769524157, 769893944, 770267248, 770593941, 770944476, 771438062, 772020817, 772509694, 772975206, 773556948, 774109125, 774485409, 774788499, 775144160, 775606930, 776011050, 776051939, 775863767, 775651634, 775281847, 774767876, 774215877, 773661137, 773215055, 772908032, 772553563, 771969199, 771206915, 770416319, 769610465, 768801570, 767999232, 767116070, 766247928, 765483260]
3030.8G65483260p88748r42469j104474j028001q53002r33945j158119j258492j198530
3049.1G56217480j152516j171767j172424j221299j282215j222313j100659r98020
3065.5G46896267j040578j242280j299739j131654r28163q86560j059293j189471j209855
3083.8G36908674j296043j317084j210093j246870j369536j337767j220464j196325
3100.1G26714492j345635j454413j335561j222670j332760j426041j289070j205444
3116.4G16102898j344442j601875j844823j839996j632929j516759j616776j794517
3132.8G02910781j775861j546085j473725j755476j981854j897156j798451j744569
3149.1F88937604j656770j771570k053439k144694k056361j958549j897037j938104
$$ y = [765483260, 764694512, 763752043, 762647569, 761619568, 760766566, 759832621, 758674502, 757416010, 756217480, 755064964, 753893197, 752720773, 751499474, 750217259, 748994946, 747894287, 746896267, 745855689, 744613409, 743313670, 742182016, 741253853, 740367293, 739308000, 738118529, 736908674, 735612631, 734295547, 733085454, 731838584, 730469048, 729131281, 727910817, 726714492, 725368857, 723914444, 722578883, 721356213, 720023453, 718597412, 717308342, 716102898, 714758456, 713156581, 711311758, 709471762, 707838833, 706322074, 704705298, 702910781, 701134920, 699588835, 698115110, 696359634, 694377780, 692480624, 690682173, 688937604, 687280834, 685509264, 683455825, 681311131, 679254770, 677296221, 675399184, 673461080]
3165.4F73461080k034188k048492j995504k001286k065897k111911k104760k059161
3181.7F57039881k043426k067983k076269k097547k156079k188086k185702k146721
3198F40078068k068937k020001k020956k037763k099693k143502k085984k019584j978159
3216.4F21603489j967013k051115k121389k049506j963138j938701j869559j783908
3232.7F05859160j833975j940548j948893j872719j728892j585364j585722j708031
3249E91655016j711965j553654j451671j512051j598418j558244j470625j461089j440942
3267.4E77896357j321316j329482j533508j685798j681865j563549j479983j542628
3283.7E65758228j637399j626611j527190j475096j581907j779377j923204j902461
$$ y = [673461080, 671426892, 669378400, 667382896, 665381610, 663315713, 661203802, 659099042, 657039881, 654996455, 652928472, 650852203, 648754656, 646598577, 644410491, 642224789, 640078068, 638009131, 635989130, 633968174, 631930411, 629830718, 627687216, 625601232, 623581648, 621603489, 619636476, 617585361, 615463972, 613414466, 611451328, 609512627, 607643068, 605859160, 604025185, 602084637, 600135744, 598263025, 596534133, 594948769, 593363047, 591655016, 589943051, 588389397, 586937726, 585425675, 583827257, 582269013, 580798388, 579337299, 577896357, 576575041, 575245559, 573712051, 572026253, 570344388, 568780839, 567300856, 565758228, 564120829, 562494218, 560967028, 559491932, 557910025, 556130648, 554207444, 552304983]
3300E52304983j756668j662135j725912j965463k238870k341151k248824k129793k128780
3318.4E34107387k199411k202332k184391k343238k564370k589822k469957k340138
3334.7E15213728k246857k341032k575218k674163k687633k647519k489775k544165
3351D95007366k839774k898693k666086k477229k521127k621919k454907k244234k419472
3369.3D71863925k784580k797126k441496k164632k078831k060652j986235j792938
3385.7D53757435j516640j218826j205414j546025j636118j196802q56489j133293
3402D43447828j502931j304149q83460p04021p27504q26329q11696n88984m02718l55214
3422.4D35340822j83404J23352L44604L43621L65883N67138N15908K01375K30610O39647
$$ y = [552304983, 550548315, 548886180, 547160268, 545194805, 542955935, 540614784, 538365960, 536236167, 534107387, 531907976, 529705644, 527521253, 525178015, 522613645, 520023823, 517553866, 515213728, 512966871, 510625839, 508050621, 505376458, 502688825, 500041306, 497551531, 495007366, 492167592, 489268899, 486602813, 484125584, 481604457, 478982538, 476527631, 474283397, 471863925, 469079345, 466282219, 463840723, 461676091, 459597260, 457536608, 455550373, 453757435, 452240795, 451021969, 449816555, 448270530, 446634412, 445437610, 444581121, 443447828, 441944897, 440640748, 439757288, 439053267, 438325763, 437499434, 436687738, 436098754, 435696036, 435340822, 435157418, 435280770, 435625374, 435968995, 436334878, 436902016, 437417924, 437619299, 437849909, 438489556]
3442.8D38489556J005143J162857J130253J148105J293093J465082J679718J838357
3459.1D49212164J733333J670002J996369K239793J924575J438051J469791J875222
3475.4D63559300K241313K317459K007603J846522K090514K212077K119929K197027
3491.7D80591744K397418K501965K399593K330006K442181K341509K046436K095580
3508D99146432K464860K749920K664686K410292K463520K749264K990007K850235K529442
3526.4E23018658K630294K908825K981604L072977L126680L018141L203631L562152
3542.7E47522962L583491L209710K977729L167450L376782L386379L480255L721178
3559E74425936L788471L568888L552735M250824M516840L982604L822028M068911M293740
$$ y = [438489556, 439494699, 440657556, 441787809, 442935914, 444229007, 445694089, 447373807, 449212164, 450945497, 452615499, 454611868, 456851661, 458776236, 460214287, 461684078, 463559300, 465800613, 468118072, 470125675, 471972197, 474062711, 476274788, 478394717, 480591744, 482989162, 485491127, 487890720, 490220726, 492662907, 495004416, 497050852, 499146432, 501611292, 504361212, 507025898, 509436190, 511899710, 514648974, 517638981, 520489216, 523018658, 525648952, 528557777, 531539381, 534612358, 537739038, 540757179, 543960810, 547522962, 551106453, 554316163, 557293892, 560461342, 563838124, 567224503, 570704758, 574425936, 578214407, 581783295, 585336030, 589586854, 594103694, 598086298, 601908326, 605977237, 610270977]
3577.4F10270977M537404M723727M616916M505337M665792M706323M486084M601478
3593.7F47114038M885018M949749M960775M942954M708528M511655M828810N071283
3610F85972810M953563M936516M668355M676223N136788M640996L849328L692985M521370
3628.4G27048934N131661M185975L779531L841102L724575L659546L554881L365993
3644.7G58292198L457129L967881L683746K553642K266765K884686K915024K274037
3661G82295108J962960J996398J956224J969278K093077J673519J469851J623988J384914
3679.4G98425317J254499J255452J235664J388252J376391J013934J020908J155913
3695.7H08126330J051784R45687J031578J055240Q56221P08103P42674Q83520Q12352
$$ y = [610270977, 614808381, 619532108, 624149024, 628654361, 633320153, 638026476, 642512560, 647114038, 651999056, 656948805, 661909580, 666852534, 671561062, 676072717, 680901527, 685972810, 690926373, 695862889, 700531244, 705207467, 710344255, 714985251, 718834579, 722527564, 727048934, 732180595, 736366570, 740146101, 743987203, 747711778, 751371324, 754926205, 758292198, 761749327, 765717208, 769400954, 771954596, 774221361, 777106047, 780021071, 782295108, 784258068, 786254466, 788210690, 790179968, 792273045, 793946564, 795416415, 797040403, 798425317, 799679816, 800935268, 802170932, 803559184, 804935575, 805949509, 806970417, 808126330, 809178114, 810123801, 811155379, 812210619, 813066840, 813774943, 814517617, 815401137, 816213489]
3714H16213489N30004M07815M39048M67658M66108M82679M77016M32610N43237P44998
3734.4H21204662P74503N67913J80662j84059Q1896N65529L14236K52724M51863L74615
3754.8H24584544K47419J52587R7931J19567K69294L38494K13802J61827J69635K26140
3775.2H26581240L97205M10080J08778j28865p1287R5725K07901K59042K04325K05636
3795.6H28269780K48968J03236J76191K26736r5189o0081J21832O1631L4571K52544
3816H29340219L55542N6088j9312P987k5212K5272J430J12534L42905K66314j7047
3838.4H30446720j20282l7015P2480M4048l9220j65403k93017P3493K91765J01566
3858.8H30375135M947M3988J34886J8119j28507L8206Q6725L9816n782l5285J75893
$$ y = [816213489, 816743493, 817151308, 817590356, 818058014, 818524122, 819006801, 819483817, 819916427, 820459664, 821204662, 821979165, 822547078, 822727740, 822543681, 822625577, 823191106, 823505342, 823758066, 824209929, 824584544, 824831963, 824984550, 825082481, 825202048, 825471342, 825809836, 826023638, 826185465, 826355100, 826581240, 826978445, 827388525, 827497303, 827368438, 827297151, 827392876, 827600777, 827859819, 828064144, 828269780, 828518748, 828621984, 828798175, 829024911, 828929722, 828869641, 828991473, 829053104, 829087675, 829340219, 829695761, 829751849, 829732537, 829740524, 829715312, 829740584, 829742014, 829854548, 830197453, 830463767, 830446720, 830326438, 830289423, 830361903, 830405951, 830366731, 830201328, 829908311, 829981804, 830273569, 830375135, 830380082, 830424070, 830558956, 830577075, 830448568, 830486774, 830573499, 830613315, 830607533, 830572248, 830748141]
3881.3H30748141J48773k7895m9233j10507k4140R7573l2902j54376o0141P6830M9472
3903.7H30661595l2246r0063q3923L516L6121J3769M8995P5340K3663l3081J073M2260
3928.2H30667019m768J251O0737j5020j01805o8962j4603K4437N9247R0898R7036L9339
3952.7H30834806j5020J7762N2511M530j7881J9193N6267J11341J04189J8477j0788
3975.1H31175387K9623P9275J23322J30117K0027p7606l218R7811P1526l6538l1889
3997.5H31577837
$$ y = [830748141, 830896914, 830869019, 830819786, 830709279, 830685139, 830782712, 830749810, 830595434, 830535293, 830612123, 830661595, 830629349, 830539286, 830455363, 830458879, 830495000, 830508769, 830557764, 830633104, 830656767, 830623686, 830624759, 830667019, 830662251, 830663502, 830724239, 830709219, 830607414, 830538452, 830523849, 830548286, 830607533, 830698431, 830795467, 830834806, 830819786, 830837548, 830890059, 830894589, 830876708, 830895901, 830952168, 831063509, 831167698, 831186175, 831175387, 831205010, 831284285, 831407607, 831537724, 831557751, 831480145, 831476927, 831574738, 831646264, 831609726, 831577837]
##END=$$ End of the data block
