##TITLE=$$ Begin of the data block
##JCAMP-DX=5.00 $$ ACD/SpecManager v 10.08
##SPECTROMETER/DATA SYSTEM=Alpha
##DATE=09 Apr 2014 11:14:46
##DATA TYPE=INFRARED SPECTRUM
##DATA CLASS=XYDATA
##ORIGIN=
##OWNER=
##NPOINTS=1765
##FIRSTX=399.75695801
##LASTX=3997.56933594
##MAXX=3997.56933594
##MINX=399.75695801
##MAXY=0.86634260
##MINY=0.43482485
##XFACTOR=1.0000000000
##YFACTOR=1.000000000000000e-9
##FIRSTY=0.71180856
##DELTAX=2.03957629
##XUNITS=1/CM
##YUNITS=ARBITRARY UNITS
##XYDATA=(X++(Y..Y))
$$ plain form
399.8 711808562 711725354 711197972 709801435 708825231 708843052 708601892 707558453 707293212 708237112 707850099
420.2 707850099 706040800 705055058 705279350 705662072 705157638 704170227 704168499 704867482 704536498 703490913
440.5 703490913 703369677 704261422 704583645 703628600 702601790 702801883 703611195 703384459 702109694
458.9 702109694 701521814 701758742 701385021 699978292 698966742 699109852 699083328 698040307 697079539
477.3 697079539 697108984 697596788 697488666 696749091 696426630 696729720 696589708 695680439 694963813 695077956
497.7 695077956 695321918 694450080 692908943 692317128 692626894 692463279 691398263 690620124 690892696
516 690892696 690937161 689595997 688028514 687565625 687586367 686695397 685163617 684283257 684202015 683779359
536.4 683779359 682635784 681816220 681896746 682013571 681222975 679947197 679393649 679525137 679044604 677687049
$$ packed form
399.8G11808562q3208n27382j396537r76204J7821k41160j043439k65241R43900l87013
420.2G07850099j809299r85742K24292L82722n04434r87411j728O98983l30984j045585
440.5G03490913j21236Q91745L22223r55045j026810K00093Q09312k26736j274765
458.9G02109694n87880K36928l73721j406729j011550J43110k6524j043021r60768
477.3F97079539K9445M87804j08122p39575l22461L03090j40012r09269p16626J14143
497.7F95077956K43962q71838j541137n91815L09766j63615j065016p78139K72572
516F90892696M4465j341164j567483m62889K0742q90970j531780q80360q1242m22656
536.4F83779359j143575q19564Q0526J16825p90596j275778n53548J31488m80533j357555
$$ plain form
556.8 677687049 676588356 676255882 675780654 674385428 672828913 672246277 672025084 670845211 669071615
575.2 669071615 667994320 667699277 667052269 665584087 664387941 664361656 664604485 663929999 662834048
593.5 662834048 662580192 662892699 662277758 660562038 659139335 658609509 658057749 656893730 655926943
611.9 655926943 656000733 656688690 657405794 658560991 660771132 663839340 666725397 668897808 671043515
630.2 671043515 673799396 676566422 678481638 679892182 681606889 683431864 684769809 685850441
646.5 685850441 687404990 689436615 690867543 691226721 691804469 694015920 697386980 700270176 701818407
664.9 701818407 702954769 705500185 708259642 709997416 711394072 713319302 715691805 717416167
681.2 717416167 718294024 719469249 721367061 723013282 723762870 724217117 725248396 726650655 727450132
$$ packed form
556.8F77687049j098693l32474m75228j395226j556515n82636k21193j179873j773596
575.2F69071615j077295k95043o47008j468182j196146k6285K42829o74486j095951
593.5F62834048k53856L12507o14941j715720j422703n29826n51760j164019r66787
611.9F55926943P3790O87957P17104J155197K210141L068208K886057K172411K145707
630.2F71043515K755881K767026J915216J410544J714707J824975J337945J080632
646.5F85850441J554549K031625J430928L59178N77748K211451L371060K883196J548231
664.9G01818407J136362K545416K759457J737774J396656J925230K372503J724362
681.2G17416167Q77857J175225J897812J646221P49588M54247J031279J402259P99477
$$ plain form
699.6 727450132 727581561 728231788 729898453 731501102 732308626 733187675 735047758 737158597 738333762
717.9 738333762 738942981 740360141 742663026 744488955 745228827 746007860 747774482 749630749 750365913
736.3 750365913 750570476 751687467 753551900 754755676 755165160 756108165 758036792 759835720 760666013
754.6 760666013 761284173 762780666 764675140 765689373 765900850 766581357 767991364 768935740 768779218
773 768779218 768464625 768814087 769126356 768456459 767241836 766685128 767021060 767409027 767632484 768685639
793.4 768685639 771157563 774262488 777043164 779795527 783289850 787055254 789841235 791539907
809.7 791539907 793259740 795396090 797019541 797339916 796915352 796669245 796282649 794766843 792154908
828.1 792154908 789587915 787697494 785810769 783286989 780740142 779037178 777856171 776290596
$$ packed form
699.6G27450132J31429O50227J666665J602649Q07524Q79049J860083K110839J175165
717.9G38333762O09219J417160K302885J825929P39872P79033J766622J856267P35164
736.3G50365913K04563J116991J864433J203776M09484R43005J928627J798928Q30293
754.6G60666013O18160J496493J894474J014233K11477O80507J410007R44376j56522
773G68779218l14593L49462L12269o69897j214623n56708L35932L87967K23457J053155
793.4G68685639K471924L104925K780676K752363L494323L765404K785981J698672
809.7G91539907J719833K136350J623451L20375m24564k46107l86596j515806k611935
828.1G92154908k566993j890421j886725k523780k546847j702964j181007j565575
$$ plain form
844.4 776290596 774576664 773999512 775099397 777170479 779642045 783001542 787769318 793236434 798121214
862.7 798121214 802221715 806365073 810652792 814036548 816036701 817541599 819356143 820975304
879.1 820975304 821389139 820772767 820201814 819832683 818849742 817108452 815695465 815404296 815647066
897.4 815647066 815663099 815816700 816815317 818264842 819004834 818755329 818294823 817879736 816726208 814391434
917.8 814391434 811734796 809836745 808619142 807442367 806497335 806559503 807521880 808284223 808263242
936.2 808263242 808047473 808223248 808313847 807592332 806334913 805218697 804042816 802043736 799031258
954.5 799031258 795560181 791933417 787610412 782123387 775817990 769228339 762352109 754919529
970.8 754919529 747304142 740524411 735043526 730392396 726111650 722280204 719087839 716368496
$$ packed form
844.4G76290596j713932n77152J099885K071082K471566L359497M767776N467116M884780
862.7G98121214M100501M143358M287719L383756K000153J504898J814544J619161
879.1H20975304M13835o16372n70953l69131r82941j741290j412987k91169K42770
897.4H15647066J6033J53601R98617J449525P39992k49505m60506m15087j153528k334774
917.8H14391434k656638j898051j217603j176775r45032O2168R62377P62343k0981
936.2H08263242k15769J75775R0599p21515j257419j116216j175881j999080l012478
954.5G99031258l471077l626764m323005n487025o305397o589651o876230p432580
970.8G54919529p615387o779731n480885m651130m280746l831446l192365k719343
$$ plain form
987.1 716368496 713771343 711352170 709529877 708336234 707353175 706371784 705534518 704867601 703970075
1005.5 703970075 702352941 699983358 697201431 694196284 690945327 687594533 684438944 681616366
1021.8 681616366 678993940 676323533 673622727 671183348 669086456 667109251 665152669 663380325
1038.1 663380325 661897063 660521150 659036398 657460511 655975699 654709280 653699636 653065383
1054.5 653065383 653022707 653683245 654773831 655760407 656259120 656174541 655478895 654127598 652311802
1072.8 652311802 650419474 648694634 647098064 645474255 643786311 642093062 640311003 638336420
1089.1 638336420 636388600 634880960 633955002 633471906 633286834 633305967 633481205 633675098 633696556 633503497
1109.5 633503497 633189678 632773995 632042348 630680799 628664255 626414239 624490082 623027146 622136891
$$ packed form
987.1G16368496k597153k419173j822293j193643r83059r81391q37266o66917q97526
1005.5G03970075j617134k369583k781927l005147l250957l350794l155589k822578
1021.8F81616366k622426k670407k700806k439379k096892j977205j956582j772344
1038.1F63380325j483262j375913j484752j575887j484812j266419j009644o34253
1054.5F53065383m2676O60538J090586R86576M98713q4579o95646j351297j815796
1072.8F52311802j892328j724840j596570j623809j687944j693249j782059j974583
1089.1F38336420j947820j507640r25958m83096j85072J9133J75238J93893K1458j93059
1109.5F33503497l13819m15683p31647j361549k016544k250016j924157j462936q90255
$$ plain form
1127.9 622136891 622675538 624519646 626200080 627407014 628816605 630537808 632247746 633738339
1144.2 633738339 635041058 636273205 637440801 638553381 639750242 641168475 642904043 644995093
1160.5 644995093 647487700 650544882 654259562 658472836 662974715 667674541 672464132 677122235
1176.8 677122235 681534111 685776591 689832032 693468273 696431279 698662460 700268745 701305926
1193.1 701305926 701774359 701888144 702087224 702645898 703524232 704586804 705765307 706988454 708008409
1211.5 708008409 708563149 708753109 708920479 709175467 709354579 709427178 709633470 710144877 710817039 711467326
1231.9 711467326 712219119 713256180 714452863 715544462 716503799 717474103 718389273 718987823 719216168
1250.3 719216168 719322681 719497144 719685197 719844282 720181823 720961690 722163439 723588228 725216091
$$ packed form
1127.9F22136891N38647J844108J680434J206934J409591J721203J709938J490593
1144.2F33738339J302719J232147J167596J112580J196861J418233J735568K091050
1160.5F44995093K492607L057182L714680M213274M501879M699826M789591M658103
1176.8F77122235M411876M242480M055441L636241K963006K231181J606285J037181
1193.1G01305926M68433J13785J99080N58674Q78334J062572J178503J223147J019955
1211.5G08008409N54740J89960J67370K54988J79112P2599K06292N11407O72162O50287
1231.9G11467326P51793J037061J196683J091599R59337R70304R15170N98550K28345
1250.3G19216168J06513J74463J88053J59085L37541P79867J201749J424789J627863
$$ plain form
1268.6 725216091 727198720 729510546 731930435 734346449 736824870 739465594 742242336 745042264
1284.9 745042264 747863531 750755966 753641069 756349504 758811116 761128783 763345480 765336990
1301.2 765336990 767024398 768482387 769816339 771030605 772068202 772900999 773620248 774391830 775210738
1319.6 775210738 775985479 776771247 777667105 778645515 779526591 780163467 780587733 780938089 781256378 781422675
1340 781422675 781452954 781580627 781935334 782407463 782780349 782977819 783092320 783157527 783134758 782916009
1360.4 782916009 782337189 781521678 780721843 779884458 779094875 778509378 777876258 776965320 775759816
1378.7 775759816 774187803 772554100 771475554 770896852 770243347 769558430 768934846 768032730 766691327
1397.1 766691327 765007794 763283074 761596978 759601295 757527173 755807221 754359186 753065884
$$ packed form
1268.6G25216091J982629K311826K419889K416014K478421K640724K776742K799928
1284.9G45042264K821267K892435K885103K708435K461612K317667K216697J991510
1301.2G65336990J687408J457989J333952J214266J037597Q32797P19249P71582Q18908
1319.6G75210738P74741P85768Q95858R78410Q81076O36876M24266L50356L18289J66297
1340G81422675L0279J27673L54707M72129L72886J97470J14501O5207k2769k18749
1360.4G82916009n78820q15511p99835q37385p89583n85497o33120r10938j205504
1378.7G75759816j572013j633703j078546n78702o53505o84917o23584r02116j341403
1397.1G66691327j683533j724720j686096j995683k074122j719952j448035j293302
$$ plain form
1413.4 753065884 752003491 751070976 750024915 749061108 748213470 747467220 747083187 746905804 746670306
1431.8 746670306 746543705 746709466 747108638 747553706 748092353 748890460 750124633 751677334 753267884
1450.1 753267884 755002737 757249296 760641158 764660418 767586648 770373464 774043381 777946889
1466.4 777946889 781315684 785021126 789900303 794535518 797806263 800302446 802499294 804529130
1482.8 804529130 806169868 807298660 807734072 807462692 807038307 806487560 805269539 803563356 802084088
1501.1 802084088 800986290 799584985 796332777 792781830 790149808 787804782 785629928 783662856
1517.4 783662856 782070875 780307233 778281152 776441395 774689019 773353457 772250116 770817041
1533.7 770817041 769686043 769284606 768741786 767456830 766325831 765648007 765423954 765444458 765586436
$$ packed form
1413.4G53065884j062393r32515j046061r63807q47638p46250l84033j77383k35498
1431.8G46670306j26601J65761L99172M45068N38647P98107J234173J552701J590550
1450.1G53267884J734853K246559L391862M019260K926230K786816L669917L903508
1466.4G77946889L368795L705442M879177M635215L270745K496183K196848K029836
1482.8H04529130J640738J128792M35412k71380m24385n50747j218021j706183j479268
1501.1H02084088j097798j401305l252208l550947k632022k345026k174854j967072
1517.4G83662856j591981j763642k026081j839757j752376j335562j103341j433075
1533.7G70817041j130998m01437n42820j284956j130999o77824k24053K0504J41978
$$ plain form
1552.1 765586436 765986681 766720593 767161608 766263843 765323877 764614463 763805926 762448132 760169148
1570.5 760169148 757966042 755757809 752177715 748132408 744466245 740577698 736398041 731878519
1586.8 731878519 727040708 722064555 717045128 711792827 706362188 701023936 695774078 690511465
1603.1 690511465 685257852 679964066 674551606 669307232 664519668 659410954 653436482 648858249
1619.4 648858249 645399153 641446114 637543559 634207368 631405890 629641175 628807664 628506601 628764749
1637.8 628764749 629654109 631266713 633660913 637333751 641707718 645026803 649085045 655261815
1654.1 655261815 659526050 662887812 666929483 671824098 676848292 681227148 686017573 691479921
1670.4 691479921 696158826 700908601 706167638 710875511 715350449 720581353 727223396 732680500
$$ packed form
1552.1G65586436M00245P33912M41015q97765r39966p09414q08537j357794k278984
1570.5G60169148k203106k208233l580094m045307l666163l888547m179657m519522
1586.8G31878519m837811m976153n019427n252301n430639n338252n249858n262613
1603.1F90511465n253613n293786n412460n244374m787564n108714n974472m578233
1619.4F48858249l459096l953039l902555l336191k801478j764715q33511l01063K58148
1637.8F28764749Q89360J612604K394200L672838M373967L319085M058242O176770
1654.1F55261815M264235L361762M041671M894615N024194M378856M790425N462348
1670.4F91479921M678905M749775N259037M707873M474938N230904O642043N457104
$$ plain form
1686.7 732680500 737037539 741740406 746303856 751477659 757423460 763326108 769875944 775232375
1703 775232375 779777944 784361064 788298666 791914642 795502663 799069643 802561045 805315614 807480276
1721.4 807480276 809634447 811820686 813955545 816231191 818474114 820607364 822415888 823939145
1737.7 823939145 825720787 827611029 829333603 831095099 833029985 834906220 836458564 837807417
1754 837807417 839287281 840849757 842173040 843243957 844197571 845228374 846368551 847447515 848258138
1772.4 848258138 848854423 849484503 850178123 850763619 851258993 851855993 852548540 853255451 853916347 854462683
1792.8 854462683 854906976 855396509 855913341 856333256 856679022 857040465 857403457 857765734 858137608 858478725
1813.2 858478725 858766615 858998716 859293878 859734118 860237181 860626578 860917270 861218691 861437082 861580551
$$ packed form
1686.7G32680500M357039M702867M563450N173803N945801N902648O549836N356431
1703G75232375M545569M583120L937602L615976L588021L566980L491402K754569K164662
1721.4H07480276K154171K186239K134859K275646K242923K133250J808524J523257
1737.7H23939145J781642J890242J722574J761496J934886J876235J552344J348853
1754H37807417J479864J562476J323283J070917R53614J030803J140177J078964Q10623
1772.4H48258138N96285O30080O93620N85496M95374N97000O92547P06911O60896N46336
1792.8H54462683M44293M89533N16832M19915L45766L61443L62992L62277L71874L41117
1813.2H58478725K87890K32101K95162M40240N03063L89397K90692L01421K18391J43469
$$ plain form
1833.6 861580551 861714244 861885190 862187445 862597466 862888575 863003373 863142431 863325238 863457918 863525093
1854 863525093 863662064 863913238 864138007 864283562 864505231 864868641 865131021 865070879 864927649 864947796
1874.4 864947796 865108848 865259469 865322232 865391016 865529180 865691900 865778744 865760624 865790725 865893364
1894.7 865893364 865927458 865889013 865884840 865952373 866040528 866076469 866047502 866025329 866081476 866170943 866202295 866204619
1919.2 866204619 866243601 866220713 866076112 865936816 865889370 865897655 865870535 865791261 865757048 865801811 865803659
1941.7 865803659 865664065 865493715 865390182 865311027 865193665 865045428 864919662 864812791 864700258 864587307
1962.1 864587307 864492059 864390016 864253342 864095330 863939464 863829076 863756597 863675714 863579094 863471210
1982.5 863471210 863355398 863254726 863172293 863078952 862939358 862757564 862579763 862434626 862305462 862175107
$$ packed form
1833.6H61580551J33693J70946L02255M10021K91109J14798J39058J82807J32680O7175
1854H63525093J36971K51174K24769J45555K21669L63410K62380o0142j43230K0147
1874.4H64947796J61052J50621O2763O8784J38164J62720Q6844j8120L0101J02639
1894.7H65893364L4094l8445m173O7533Q8155L5941k8967k2173N6147Q9467L1352K324
1919.2H66204619L8982k2888j44601j39296m7446Q285k7120p9274l4213M4763J848
1941.7H65803659j39594j70350j03533p9155j17362j48237j25766j06871j12533j12951
1962.1H64587307r5248j02043j36674j58012j55866j10388p2479q0883r6620j07884
1982.5H63471210j15812j00672q2433r3341j39594j81794j77801j45137j29164j30355
$$ plain form
2002.8 862175107 862067342 861957490 861794710 861620426 861511111 861433566 861292362 861091375 860899866 860761285
2023.2 860761285 860664308 860566616 860448301 860337615 860238552 860122442 859996080 859884501 859800816 859735548
2043.6 859735548 859641790 859501958 859395206 859350085 859317780 859243572 859121561 859044075 859051764 859046578 858966708
2066.1 858966708 858901620 858893156 858864546 858768880 858676434 858686209 858745635 858733714 858680606 858694494 858769357 858811378
2090.5 858811378 858758330 858676672 858684540 858749270 858751118 858722150 858767569 858857691 858904660 858896196 858890593 858938217
2115 858938217 859004855 859019458 859023988 859096348 859206378 859274924 859293759 859324336 859396577 859490752 859555066 859593272
2139.5 859593272 859680951 859814823 859920979 859976292 860025048 860117614 860239506 860318422 860354304 860436082 860562563
2161.9 860562563 860634029 860653102 860710800 860840321 860989332 861078858 861122012 861204803 861329496 861412466 861452460
$$ packed form
2002.8H62175107j07765j09852j62780j74284j09315p7545j41204k00987j91509j38581
2023.2H60761285r6977r7692j18315j10686r9063j16110j26362j11579q3685o5268
2043.6H59735548r3758j39832j06752m5121l2305p4208j22011p7486P689n186p9870
2066.1H58966708o5088q464k8610r5666r2446R775N9426j1921n3108J3888P4863M2021
2090.5H58811378n3048q1658P868O4730J848k8968M5419R0122M6969q464n603M7624
2115H58938217O6638J4603M530P2360J10030O8546J8835L0577P2241R4175O4314L8206
2139.5H59593272Q7679J33872J06156N5313M8756R2566J21892P8916L5882Q1778J26481
2161.9H60562563P1466J9073N7698J29521J49011Q9526M3154Q2791J24693Q2970L9994
$$ plain form
2184.4 861452460 861528933 861655235 861764193 861802638 861810148 861877322 861998558 862055004 862026811 862036467 862119853
2206.8 862119853 862190187 862214267 862256169 862355113 862444043 862445295 862413287 862461567 862581670 862642407 862589777
2229.2 862589777 862527847 862537384 862572491 862559795 862535834 862574995 862628281 862619817 862574279 862570882 862633705 862685323
2253.7 862685323 862652421 862572432 862535000 862558842 862578869 862553596 862517297 862532198 862585902 862598956 862580180
2276.1 862580180 862612307 862697423 862766623 862776518 862728894 862678051 862650931 862626255 862609804 862584114 862520337 862456918
2300.6 862456918 862399817 862266064 862060487 861869335 861705005 861548603 861400962 861213863 860912025 860531867
2321 860531867 860239983 860133410 860034585 859789193 859529853 859361529 859184146 858965039 858783782 858728230
2341.4 858728230 859018624 859827220 860703290 860957265 860436082 859560907 858820796 858288467 858056426 858260214
$$ packed form
2184.4H61452460P6473J26302J08958L8445P510O7174J21236N6446k8193R656Q3386
2206.8H62119853P0334K4080M1902R8944Q8930J252l2008M8280J20103O0737n2630
2229.2H62589777o1930R537L5107j2696k3961L9161N3286q464m5538l397O2823N1618
2253.7H62685323l2902p9989l7432K3842K0027k5273l6299J4901N3704J3054j8776
2276.1H62580180L2127Q5116O9200R895m7624n0843k7120k4676j6451k5690o3777o3419
2300.6H62456918n7101j33753k05577j91152j64330j56402j47641j87099l01838l80158
2321H60531867k91884j06573r8825k45392k59340j68324j77383k19107j81257n5552
2341.4H58728230K90394Q08596Q76070K53975n21183q75175p40111n32329k32041K03788
$$ plain form
2361.8 858260214 858726323 859230995 859842718 860678136 861585379 862370729 863069177 863793075 864523351 865106702
2382.2 865106702 865468025 865682244 865846395 865977764 866014659 865977526 866004765 866117001 866172910 866130650
2402.6 866130650 866126120 866233528 866342604 866330087 866229832 866197467 866260588 866281390 866204023 866117716 866109490
2425 866109490 866140008 866119206 866069436 866075635 866105020 866052032 865931988 865870059 865886331 865854204 865738988 865654290
2449.5 865654290 865679681 865741432 865691960 865548253 865475178 865492404 865461826 865331769 865207791 865203202 865241230
2471.9 865241230 865173280 865038574 864941895 864891768 864844739 864754558 864663303 864640057 864618838 864528239 864419580
2494.4 864419580 864339888 864267945 864171565 864046931 863970578 864006639 864021361 863896132 863766551 863764524 863790095
2516.8 863790095 863701642 863545418 863442242 863414824 863393009 863292933 863147676 863072872 863056779 862997830 862905085
$$ packed form
2361.8H58260214M66109N04672O11723Q35418R07243P85350O98448P23898P30276N83351
2382.2H65106702L61323K14219J64151J31369L6895l7133K7239J12236N5909m2260
2402.6H66130650m530J07408J09076j2517j00255l2365O3121K0802p7367q6307q226
2425H66109490L0518k0802m9770O199K9385n2988j20044o1929J6272l2127j15216q4698
2449.5H65654290K5391O1751m9472j43707p3075J7226l0578j30057j23978m589L8028
2471.9H65241230o7950j34706r6679n0127m7029r0181r1255k3246k1219r0599j08659
2494.4H64419580p9692p1943r6380j24634p6353L6061J4722j25229j29581k027K5571
2516.8H63790095q8453j56224j03176k7418k1815j00076j45257p4804j6093n8949r2745
$$ plain form
2539.2 862905085 862845838 862801909 862718582 862574756 862420082 862344503 862323999 862225175 862048268 861936629 861910820
2561.7 861910820 861866236 861733496 861552358 861426711 861337602 861214221 861094832 860995114 860839367 860671997
2582.1 860671997 860578060 860453486 860259593 860093117 859916925 859665930 859416068 859237731 859064102 858835578
2602.5 858835578 858613789 858391583 858114481 857850432 857638001 857433736 857224226 856973946 856650889 856371343
2622.9 856371343 856187284 855949879 855629325 855370760 855194628 854979455 854696035 854428947 854223788 854014695
2643.3 854014695 853746951 853453636 853187203 852972150 852760255 852513850 852288187 852097809 851868451 851563811
2663.7 851563811 851239622 851008177 850883126 850726366 850477874 850248158 850102246 849915385 849575877 849191546
2684.1 849191546 848912299 848684192 848397672 848097384 847875595 847699225 847457290 847129643 846803784 846542954
$$ packed form
2539.2H62905085n9247m3929q3327j43826j54674p5579k0504r8824j76907j11639k5809
2561.7H61910820m4584j32740j81138j25647q9109j23381j19389r9718j55747j67370
2582.1H60671997r3937j24574j93893j66476j76192k50995k49862j78337j73629k28524
2602.5H58835578k21789k22206k77102k64049k12431k04265k09510k50280l23057k79546
2622.9H56371343j84059k37405l20554k58565j76132k15173k83420k67088k05159k09093
2643.3H54014695k67744k93315k66433k15053k11895k46405k25663j90378k29358l04640
2663.7H51563811l24189k31445j25051j56760k48492k29716j45912j86861l39508l84331
2684.1H49191546k79247k28107k86520l00288k21789j76370k41935l27647l25859k60830
$$ plain form
2704.5 846542954 846290171 845989466 845697105 845448852 845182478 844827235 844443262 844167829 843993127 843782842
2724.8 843782842 843442738 843032300 842695832 842419565 842110813 841805816 841544807 841273010 840961218 840671062
2745.2 840671062 840454578 840232909 839888275 839484513 839165986 838904917 838575304 838170171 837783933 837454736
2765.6 837454736 837154746 836830556 836478055 836138725 835756660 835272014 834765851 834322572 833925128 833551466
2786 833551466 833167374 832729161 832264781 831793487 831312418 830795467 830188870 829563320 828963757 828340948
2806.4 828340948 827728152 827119589 826475859 825820684 825147748 824463487 823784888 823053479 822241008 821405888
2826.8 821405888 820588529 819752693 818818033 817783535 816681743 815364957 813633084 811527550 809218764
2845.2 809218764 806846321 804622412 802845061 801669955 800970018 800544202 800164640 799578249 798734844
$$ packed form
2704.5H46542954k52783l00705k92361k48253k66374l55243l83973k75433j74702k10285
2724.8H43782842l40104m10438l36468k76267l08752l04997k61009k71797l11792k90156
2745.2H40671062k16484k21669l44634m03762l18527k61069l29613m05133l86238l29197
2765.6H37454736k99990l24190l52501l39330l82065m84646n06163m43279l97444l73662
2786H33551466l84092m38213m64380m71294m81069n16951o06597o25550n99563o22809
2806.4H28340948o12796o08563o43730o55175o72936o84261o78599p31409q12471q35120
2826.8H21405888q17359q35836r34660j034498j101792j316786j731873k105534k308786
2845.2H09218764k372443k223909j777351j175106o99937m25816l79562n86391q43405
$$ plain form
2863.5 798734844 797699451 796471298 795139432 793960571 792966545 791978955 791069567 790308654 789559186
2881.9 789559186 788760185 787920356 787023246 786064684 785083771 784094810 783018172 781810760 780586779
2900.2 780586779 779429615 778232157 776882708 775433600 773926675 772220433 770193338 768000543
2916.6 768000543 765950739 764229596 762914658 762078583 761749387 761816382 762004018 762210429 762670875
2934.9 762670875 763543963 764707088 766025603 767431200 768728793 769637585 770092905 770296574 770345926
2953.3 770345926 770244122 770144582 770182312 770385444 770709336 771048546 771363914 771737754 772261322 772842586
2973.7 772842586 773313642 773765385 774349868 774915397 775289118 775552273 775884092 776386857 776844323 776930928
2994.1 776930928 776757002 776485920 776048660 775518596 774999261 774515629 774126709 773831069 773465633 772873044
$$ packed form
2863.5G98734844j035393j228153j331866j178861r94026r87590r09388p60913p49468
2881.9G89559186p99001q39829q97110r58562r80913r88961j076638j207412j223981
2900.2G80586779j157164j197458j349449j449108j506925j706242k027095k192795
2916.6G68000543k049804j721143j314938q36075l29196O6995J87636K06411M60446
2934.9G62670875Q73088J163125J318515J405597J297593R08792M55320K03669M9352
2953.3G70345926j01804r9540L7730K03132L23892L39210L15368L73840N23568N81264
2973.7G72842586M71056M51743N84483N65529L73721K63155L31819N02765M57466Q6605
2994.1G76930928j73926k71082m37260n30064n19335m83632l88920k95640l65436n92589
$$ plain form
3014.5 772873044 772112489 771315217 770495236 769676507 768899322 768092334 767251372 766434729 765637457 764754832
3034.9 764754832 763683259 762617767 761707008 760755181 759609759 758362830 757171392 756017447 754824221
3053.2 754824221 753617406 752386332 751136482 749961138 748903275 747935414 746906161 745675623
3069.5 745675623 744383335 743231475 742272615 741383016 740340531 739145100 737927020 736631453 735286891
3087.9 735286891 734049916 732810497 731437683 730072737 728865445 727717519 726387143 724898338
3104.2 724898338 723539531 722327292 720994949 719595909 718349278 717135966 715779364 714167058
3120.5 714167058 712264836 710353315 708676398 707159460 705592752 703866243 702147484 700599074
3136.8 700599074 699049115 697239459 695255101 693353236 691563487 689863861 688256621 686522782
$$ packed form
3014.5G72873044p60555p97272q19981q18729p77185q06988q40962q16643p97272q82625
3034.9G64754832j071573j065492r10759r51827j145422j246929j191438j153945j193226
3053.2G54824221j206815j231074j249850j175344j057863r67861j029253j230538
3069.5G45675623j292288j151860r58860q89599j042485j195431j218080j295567j344562
3087.9G35286891j236975j239419j372814j364946j207292j147926j330376j488805
3104.2G24898338j358807j212239j332343j399040j246631j213312j356602j612306
3120.5G14167058j902222j911521j676917j516938j566708j726509j718759j548410
3136.8G00599074j549959j809656j984358j901865j789749j699626j607240j733839
$$ plain form
3153.2 686522782 684496224 682358444 680277169 678264320 676311553 674359381 672360420 670343459
3169.5 670343459 668328106 666284323 664206445 662095249 659979284 657903373 655841589 653766453
3185.8 653766453 651675940 649572551 647466540 645341218 643192291 641064882 638950944 636814952
3202.1 636814952 634702682 632639766 630557716 628435135 626320004 624248862 622240782 620262444
3218.4 620262444 618216813 616092801 614037275 612089992 610176921 608333468 606553972 604686439
3234.7 604686439 602708995 600745320 598865688 597132444 595535338 593922794 592183948 590436757
3251.1 590436757 588884294 587477148 585978150 584374845 582810938 581281066 579758048 578301966
3267.4 578301966 576979697 575682104 574213028 572581768 570914686 569302559 567724645 566107929
$$ packed form
3153.2F86522782k026558k137780k081275k012849j952767j952172j998961k016961
3169.5F70343459k015353k043783k077878k111196k115965k075911k061784k075136
3185.8F53766453k090513k103389k106011k125322k148927k127409k113938k135992
3202.1F36814952k112270k062916k082050k122581k115131k071142k008080j978338
3218.4F20262444k045631k124012k055526j947283j913071j843453j779496j867533
3234.7F04686439j977444j963675j879632j733244j597106j612544j738846j747191
3251.1E90436757j552463j407146j498998j603305j563907j529872j523018j456082
3267.4E78301966j322269j297593j469076j631260j667082j612127j577914j616716
$$ plain form
3283.7 566107929 564489782 562940538 561467946 559984982 558357000 556569993 554670811 552725554
3300 552725554 550889015 549229085 547546864 545571744 543298721 540934026 538648605 536470175 534302771
3318.4 534302771 532093167 529916048 527770758 525451481 522883177 520269156 517767608 515421689
3334.7 515421689 513183713 510819137 508204341 505494356 502786636 500158846 497695982 495148480
3351 495148480 492302060 489371359 486601323 483990073 481408149 478854477 476450950 474107593 471601069
3369.3 471601069 468878090 466162384 463726729 461546004 459442317 457310855 455252588 453455210
3385.7 453455210 451978445 450797379 449599117 448035955 446398705 445219070 444383055 443271458
3402 443271458 441763878 440437019 439558476 438843310 438055634 437165946 436323524 435740411 435355306 435014963
$$ packed form
3283.7E66107929j618147j549244j472592j482964j627982j787007j899182j945257
3300E52725554j836539j659930j682221j975120k273023k364695k285421k178430k167404
3318.4E34302771k209604k177119k145290k319277k568304k614021k501548k345919
3334.7E15421689k237976k364576k614796k709985k707720k627790k462864k547502
3351D95148480k846420k930701k770036k611250k581924k553672k403527k343357k506524
3369.3D71601069k722979k715706k435655k180725k103687k131462k058267j797378
3385.7D53455210j476765j181066j198262j563162j637250j179635q36015j111597
3402D43271458j507580j326859q78543p15166p87676q89688q42422n83113l85105l40343
$$ plain form
3422.4 435014963 434824854 434902728 435220808 435613006 436062634 436693370 437243521 437453270 437667638 438275069
3442.8 438275069 439248472 440384418 441492081 442640811 443968356 445446551 447103292 448951960
3459.1 448951960 450702339 452363193 454383999 456663877 458585083 460001886 461468041 463363111
3475.4 463363111 465629756 467947870 469960868 471857578 474004805 476202309 478250563 480397463
3491.7 480397463 482757866 485231310 487653881 490051836 492529601 494849265 496890098 499028236
3508 499028236 501561463 504358947 507044554 509465039 511899292 514603019 517614007 520542324 523113191
3526.4 523113191 525734901 528618693 531601310 534762383 538029611 541112065 544250011 547698855
3542.7 547698855 551229000 554456949 557448924 560618877 564073145 567579269 571089089 574800372
$$ packed form
3422.4D35014963j90109P7874L18080L92198M49628O30736N50151K09749K14368O07431
3442.8D38275069R73403J135946J107663J148730J327545J478195J656741J848668
3459.1D48951960J750379J660854K020806K279878J921206J416803J466155J895070
3475.4D63363111K266645K318114K012998J896710K147227K197504K048254K146900
3491.7D80397463K360403K473444K422571K397955K477765K319664K040833K138138
3508D99028236K533227K797484K685607K420485K434253K703727L010988K928317K570867
3526.4E23113191K621710K883792K982617L161073L267228L082454L137946L448844
3542.7E47698855L530145L227949K991975L169953L454268L506124L509820L711283
$$ plain form
3559 574800372 578643084 582273245 585845888 590103924 594628990 598608792 602428138 606534779 610882938
3577.4 610882938 615415037 620083928 624701023 629307270 634099185 638858855 643318713 647900045
3593.7 647900045 652829170 657851100 662861049 667800009 672507644 677052975 681920648 687036276
3610 687036276 691992998 696891427 701551497 706249356 711418927 716110110 719985902 723676503 728233159
3628.4 728233159 733441353 737678826 741462827 745290637 749034822 752733469 756288707 759609878
3644.7 759609878 763013303 766982675 770747066 773343146 775551260 778346241 781264067 783586442
3661 783586442 785562992 787548125 789485693 791431189 793477237 795082152 796496749 798148513 799567223
3679.4 799567223 800817370 802111089 803419113 804859102 806254625 807267189 808280468 809451282
$$ packed form
3559E74800372L842712L630161L572643M258036M525066L979802L819346M106641M348159
3577.4F10882938M532099M668891M617095M606247M791915M759670M459858M581332
3593.7F47900045M929125N021930N009949M938960M707635M545331M867673N115628
3610F87036276M956722M898429M660070M697859N169571M691183L875792L690601M556656
3628.4G28233159N208194M237473L784001L827810L744185L698647L555238L321171
3644.7G59609878L403425L969372L764391K596080K208114K794981K917826K322375
3661G83586442J976550J985133J937568J945496K046048J604915J414597J651764J418710
3679.4G99567223J250147J293719J308024J439989J395523J012564J013279J170814
$$ plain form
3695.7 809451282 810554504 811534286 812512517 813458741 814286172 815078974 815894008 816724956 817457378
3714 817457378 817979157 818439245 818955123 819486082 819941461 820326328 820742786 821226120 821843624 822572172
3734.4 822572172 823284447 823787808 823896110 823652446 823698282 824314892 824690163 824906766 825364172 825829566
3754.8 825829566 826127946 826243043 826294541 826442778 826748073 827059805 827213943 827301264 827404499 827609539
3775.2 827609539 827985466 828350723 828489482 828470528 828492522 828607917 828783393 829008341 829208732 829437077
3795.6 829437077 829709828 829819143 829955518 830150962 830064654 830028355 830201566 830305874 830317497 830478489
3816 830478489 830764353 830825806 830889046 830983996 830991864 831009686 830976427 831058085 831387281 831643820 831577003
3838.4 831577003 831393540 831383049 831527412 831599712 831538498 831325591 831019402 831181169 831542790 831631243
$$ packed form
3695.7H09451282J103222R79782R78231R46224Q27431P92802Q15034Q30948P32422
3714H17457378N21779M60088N15878N30959M55379L84867M16458M83334O17504P28548
3734.4H22572172P12275N03361J08302k43664M5836O16610L75271K16603M57406M65394
3754.8H25829566K98380J15097N1498J48237L05295L11732J54138Q7321J03235K05040
3775.2H27609539L75927L65257J38759j8954K1994J15395J75476K24948K00391K28345
3795.6H29437077K72751J09315J36375J95444q6308l6299J73211J04308J1623J60992
3816H30478489K85864O1453O3240R4950P868J7822l3259Q1658L29196K56539o6817
3838.4H31577003j83463j0491J44363P2300o1214k12907l06189J61767L61621Q8453
$$ plain form
3858.8 831631243 831606388 831636071 831720769 831686497 831551135 831603408 831718922 831771612 831750333 831708610 831920683
3881.3 831920683 832121909 832075357 831947923 831789255 831746817 831832051 831817687 831733167 831716776 831726432 831720054
3903.7 831720054 831738412 831713259 831618965 831568182 831607521 831659853 831699312 831746221 831767380 831758797 831794143 831850886
3928.2 831850886 831843078 831877947 831984341 831960261 831871033 831861377 831860304 831842363 831835926 831852973 831904650 831958890
3952.7 831958890 831991196 832033575 832106948 832157850 832136929 832073927 832055748 832129598 832228303 832251847 832205832
3975.1 832205832 832204282 832298040 832470715 832681596 832766950 832718313 832734823 832785666 832754314 832738876 832808316
3997.5 832808316
$$ packed form
3858.8H31631243k4855K9683Q4698l4272j35362N2273J15514N2690k1279m1723K12073
3881.3H31920683K01226m6552j27434j58668m2438Q5234j4364q4520j6391R656o378
3903.7H31720054J8358k5153r4294n0783L9339N2332L9459M6909K1159q583L5346N6743
3928.2H31850886p808L4869J06394k4080q9228r656j073j7941o437J7047N1677N4240
3952.7H31958890L2306M2379P3373N0902k0921o3002j8179P3850R8705K3544m6015
3975.1H32205832j550R3758J72675K10881Q5354m8637J6510N0843l1352j5438O9440
3997.5H32808316
##END=$$ End of the data block
