##TITLE=$$ Begin of the data block
##JCAMP-DX=5.00 $$ ACD/SpecManager v 10.08
##SPECTROMETER/DATA SYSTEM=Alpha
##DATE=09 Apr 2014 11:14:46
##DATA TYPE=INFRARED SPECTRUM
##DATA CLASS=XYDATA
##ORIGIN=
##OWNER=
##NPOINTS=1765
##FIRSTX=399.75695801
##LASTX=3997.56933594
##MAXX=3997.56933594
##MINX=399.75695801
##MAXY=0.87988555
##MINY=0.43997231
##XFACTOR=1.0000000000
##YFACTOR=1.000000000000000e-9
##FIRSTY=0.76227486
##DELTAX=2.03957629
##XUNITS=1/CM
##YUNITS=ARBITRARY UNITS
##XYDATA=(X++(Y..Y))
399.8 762274861 760074139 755847633 752093315 751475215 753251672 753703117 751225471 749054372 750533521
418.1 750533521 752946496 751844227 748594880 745728731 745215714 746338367 746430397 744299471 741961658
436.5 741961658 742129207 744351983 745390594 743358016 740565300 740143716 741845489 742627263 741214812
454.8 741214812 739267826 738877654 739943326 740042806 737989545 735580027 735314071 736946940 737388790
473.2 737388790 735036671 732211828 731676102 733405828 734669566 733413875 730929375 730055034 731353939
491.5 731353939 732205689 730542362 727753699 726683378 727899611 728722453 727150738 724539101 723527849
509.9 723527849 724568248 725295842 723848045 721224904 719917238 720510721 721021593 719517410 716853261
528.3 716853261 715502858 715934455 716377914 715275705 713177621 712007999 712484360 713079691 712084830
546.6 712084830 709993482 708770394 709098160 709610105 708776414 706781209 705272555 705148160 705261648
565 705261648 704120636 701904833 700001001 699172199 698699057 697419107 695299447 693324685 692422628
583.3 692422628 692252636 691598117 690082073 688459218 687643409 687522948 687038898 685491920 683432639
601.7 683432639 681937635 681239724 680591226 679406762 678093970 677522302 678040743 679295182 680792630
620 680792630 682583332 685134590 688372314 691491008 693816483 695526838 697479963 700134099 702676892
638.4 702676892 703982949 704148948 704515576 706114590 708363533 709780097 709845006 709728658 711072028
656.7 711072028 714089334 717250705 719479740 720919490 722116172 724452674 727327704 729293764
673.1 729293764 730834603 732752264 734887362 736520708 737593770 738732278 740276873 741920710
689.4 741920710 743091524 743629336 744157314 745211720 746476650 747367382 747911930 748654127 749937832
707.7 749937832 751522243 752885282 753895879 755007803 756551683 758282006 759814620 761060536
724 761060536 762325168 763869226 765508831 766843140 767765224 768626451 769691408 770822465 771828771
742.4 771828771 772761583 773814559 775127411 776572287 777893424 779002130 780050457 781285822 782614291
760.8 782614291 783701837 784504533 785238624 786066830 786922276 787464559 787534714 787381649 787241697 787087321
781.2 787087321 786754429 786247432 785901606 786157608 787108064 788525999 790315211 792609930 795534909
799.5 795534909 798894346 802081406 804635346 806757808 808950841 811232567 813013852 813887835 814084888
817.9 814084888 814163268 814331234 814048529 812718093 810565174 808376729 806588471 804904521 802797139
836.2 802797139 800347149 798298776 797053099 796137631 795057654 794147253 794363558 796346903 799724758
854.6 799724758 803599119 807542741 811804235 816624641 821543753 825657129 828605413 830966055
870.9 830966055 833423197 835802972 837374985 837907970 837911248 837913454 837827086 837127864 835648358 833967984
891.3 833967984 832859159 832570732 832746744 832974017 833348930 834260881 835648715 836902499 837452888
909.6 837452888 837226927 836550593 835644305 834403515 832685590 830671310 828909159 827935994 827812374
928 827812374 828120172 828397095 828536808 828807950 829349458 829799116 829725146 829160511 828519762 828029215
948.4 828029215 827333033 825851440 823391676 820333064 817166150 813757837 809357166 803497195 796603322
966.8 796603322 789451838 782311618 774893641 767157257 759888709 754077017 749781549 745989442
983.1 745989442 741801918 737522900 734157503 732060611 730515063 728613436 726446807 724983633
999.4 724983633 724611998 724467754 723346531 720998824 718254209 715763628 713081896 709387898 704878032
1017.7 704878032 700735509 697678924 695121109 692002773 688208461 684652746 682086468 680245221
1034.1 680245221 678248823 675767362 673458338 672000289 671121657 669848263 667694747 665322959
1050.4 665322959 663760006 663275599 663290560 663341224 663633347 664480090 665450811 665507019 664094508 661675990
1070.8 661675990 659158766 657001078 654931247 652492404 649741352 647139966 644825518 642385483
1087.1 642385483 639415264 636130095 633340359 631714284 631161392 631046295 630878448 630697787 630743504
1105.4 630743504 630970359 630990386 630473912 629488111 628253698 626546979 623834968 620359659 617499471
1123.8 617499471 616285801 616539121 618020296 620068192 621558607 622826040 624942362 627858520
1140.1 627858520 630726159 632950723 634621918 636231840 638004541 639675260 641011417 642283320
1156.4 642283320 644086778 646760166 650135338 653959632 658345163 663602948 669746220 676219940
1172.7 676219940 682294369 687778652 693082869 698485315 703613997 707791924 710734308 712758958
1189.1 712758958 714232862 715097010 715130806 714508951 713995099 714399755 715802670 717561185 719112575
1207.4 719112575 720461190 721809924 723080933 723962069 724294543 724367440 724700987 725468218 726316869
1225.8 726316869 726936758 727511048 728422999 729761660 731226623 732506156 733620346 734792531 736063600
1244.1 736063600 737164378 737824023 738052249 738117099 738333285 738813996 739435732 740138948 741170347
1262.5 741170347 742826164 745069683 747597992 750199139 752910435 755850554 758996725 762179494
1278.8 762179494 765227675 768153191 771173596 774415135 777695179 780709565 783323407 785688221
1295.1 785688221 788034916 790297449 792189956 793593049 794704795 795826495 796995878 797966003
1311.4 797966003 798571289 798987329 799546659 800342977 801170647 801842034 802453279 803231478 804133773 804838657
1331.8 804838657 805139363 805190265 805230319 805313349 805445015 805576980 805677652 805892766 806268334 806585014
1352.2 806585014 806579947 806260467 805981398 805829644 805319071 804300606 803253353 802390933 801878095 801524103
1372.6 801524103 800722659 799568653 798367500 796852887 795172572 794108331 793736458 793510854 793439567
1391 793439567 793339610 792684078 791486681 789950550 788501263 787212849 785504341 783623517 782037616
1409.3 782037616 780695736 779692471 779076695 778253019 776789367 775818288 775475860 775167584 774915040
1427.7 774915040 774639666 774622023 775181472 775730073 775973618 776587307 777648330 778926671 780309439
1446 780309439 781660259 783178270 785210490 787843943 791003823 794109106 796842515 799780726 803132176
1464.4 803132176 806569099 809949040 813601911 817660034 821349859 824315071 826726496 828585923
1480.7 828585923 830057979 831399381 832597136 833005607 832372427 831771910 831362069 830405176 828957260
1499.1 828957260 827691495 826902688 825791657 822583675 819349587 817162871 815132260 813206553
1515.4 813206553 811545789 810294688 808449149 806200325 804464817 802940667 801990211 801052094 799183905
1533.7 799183905 797916055 797849715 797057927 795077264 793549836 792668879 792584658 792889714 793194652
1552.1 793194652 793518722 794043243 793605208 791618228 790808260 790142894 788969755 787197948 784696281
1570.5 784696281 782706976 780316472 775646925 771240234 768080831 764510810 760223091 755479336
1586.8 755479336 750605285 745803356 740941048 735665143 730125546 724765122 719644725 714622259
1603.1 714622259 709625602 704441667 698945940 693814278 689555645 684732556 678333819 673662603
1619.4 673662603 670479536 666631937 662847340 659466505 656396091 654676676 653886557 652655303
1635.7 652655303 651866257 652501583 654173791 656750739 660187066 664148569 667920172 672014356 677158892
1654.1 677158892 681915641 686448216 691217363 696293890 701669931 707000077 712596357 718384624
1670.4 718384624 723577917 728974462 735015810 740843356 746360779 751926720 758197546 764161408
1686.7 764161408 769535959 774827838 779678583 784861624 790714443 796479881 802297831 807073832
1703 807073832 811152339 815292716 819138765 822554827 825522780 828158736 830669463 832985520 835020900
1721.4 835020900 836714983 838318110 840238631 842570841 844738007 846076965 847026587 848477066
1737.7 848477066 850345850 852226734 853836179 855252087 856759191 858319104 859690309 860804081
1754 860804081 861721396 862645745 863734126 864749968 865529418 866213262 866918683 867730379 868392169 868764222
1774.4 868764222 869070113 869456172 869986773 870615005 871111095 871454895 871918201 872428417 872792244 873123646
1794.8 873123646 873464227 873670638 873805344 874087512 874524117 874923170 875144660 875235975 875423968 875779510
1815.2 875779510 876069963 876197875 876346231 876648068 877021015 877340198 877367616 877181113 877253473 877552688
1835.6 877552688 877841055 878090084 878285706 878289402 878336370 878567457 878669977 878604054 878565848 878697693
1856 878697693 878954232 879135549 879131079 879153430 879380882 879588127 879564524 879460394 879374564 879369855 879521430
1878.4 879521430 879723907 879787207 879693270 879655004 879745662 879850507 879885554 879786134 879646838 879664123 879805505
1900.9 879805505 879866600 879794955 879708230 879691541 879744411 879828572 879865348 879764497 879646301 879678369 879712164
1923.3 879712164 879594147 879390717 879221857 879190505 879262209 879269779 879175901 879081964 879023492 878980637 878891826
1945.7 878891826 878681421 878412247 878252387 878261864 878298700 878172040 877890587 877675354 877676487 877737164 877586007
1968.2 877586007 877240956 876964748 876926541 877022862 876971543 876676381 876399815 876378953 876518011 876555920
1988.6 876555920 876313388 875897288 875653863 875692904 875737906 875537753 875198603 875003874 875039160 875084996
2009 875084996 874893129 874563098 874373019 874386847 874431014 874262512 873897552 873638153 873642623 873729348 873629987
2031.4 873629987 873324633 873056829 873021960 873144269 873136282 872867107 872586191 872565031 872736037 872765005
2051.8 872765005 872506440 872214556 872145236 872252107 872297585 872133255 871899903 871842742 871959388 872035861
2072.2 872035861 871930659 871741772 871673644 871775866 871909142 871909678 871782780 871696115 871736407 871833682 871861160
2094.6 871861160 871745706 871617317 871659160 871815622 871894717 871839702 871746540 871741474 871844590 871937633 871924400
2117.1 871924400 871832192 871809840 871933162 872082114 872134030 872101188 872073829 872142553 872305512 872411788 872371435
2139.5 872371435 872306049 872358322 872526228 872685134 872714460 872669935 872706354 872853398 873021185 873096883 873059571
2161.9 873059571 873037457 873145521 873318970 873428702 873443902 873433769 873506784 873675048 873804152 873817563
2182.3 873817563 873815298 873906493 874066412 874163985 874136746 874091387 874150813 874286652 874379635 874369204 874285221
2204.8 874285221 874236345 874302089 874393404 874402881 874367356 874370039 874441385 874528170 874538898 874457538 874376833 874401331
2229.2 874401331 874504805 874567330 874554873 874536455 874568999 874639213 874648452 874527812 874384105 874342263 874383330
2251.7 874383330 874420643 874385953 874270141 874149382 874115407 874125361 874093533 874061108 874067724 874059141 874016047 874013782
2276.1 874013782 874096334 874228716 874337673 874359667 874309301 874195218 873991191 873753428 873547912 873337686
2296.5 873337686 873089075 872826755 872529685 872142673 871657073 871082246 870478809 869976103 869519174 868854940
2316.9 868854940 867937803 866967797 866174579 865613699 865071774 864450693 863912702 863500059 863074720 862650752
2337.3 862650752 862315357 862143517 862494826 863956928 865878165 866518557 865156054 862619400 860297859
2355.7 860297859 858752549 858149946 858403444 859216571 860494733 862181067 864147902 866222262 868192196
2374 868192196 869968832 871641815 873298347 874780595 875838697 876404524 876628935 876744151 876852870
2392.4 876852870 876916826 876933515 876946688 876963496 877018631 877135038 877198100 877112687 877002358 877029896 877161384
2414.8 877161384 877233684 877154410 877002299 876935124 876997650 877071083 877038181 876933455 876871109 876895905 876941144
2437.3 876941144 876900613 876771212 876676679 876708925 876802325 876810968 876692653 876555383 876533687 876624942 876668274
2459.7 876668274 876541793 876339197 876255035 876321197 876370847 876264930 876066446 875964761 876039743 876127303
2480.1 876127303 876033425 875791788 875623047 875678301 875825644 875791550 875540435 875338674 875371337 875510037
2500.5 875510037 875511885 875319302 875110567 875059843 875137150 875150323 874971569 874724865 874658465 874790192 874870539
2522.9 874870539 874737442 874501288 874383628 874458849 874550939 874433219 874167204 874035299 874132633 874254346
2543.3 874254346 874171734 873912632 873720229 873741448 873830259 873777628 873580396 873403132 873397470 873503923 873478293
2565.8 873478293 873240054 873018980 872986376 873019695 872935951 872720242 872498810 872382998 872349203 872259080
2586.2 872259080 872027397 871760011 871629000 871617675 871552765 871337652 871040761 870815575 870727658 870670199
2606.6 870670199 870497048 870220125 869970083 869815528 869703710 869514525 869221687 868940175 868752420 868630230
2626.9 868630230 868475258 868208885 867893696 867661238 867527485 867398918 867215157 866982460 866724491 866488695
2647.3 866488695 866305470 866116226 865847111 865532815 865287542 865148008 865014136 864804804 864579678 864404619
2667.7 864404619 864254773 864088416 863886476 863669395 863493085 863361537 863160789 862828970 862471938 862206638
2688.1 862206638 862048864 861917734 861702263 861379445 861069262 860857904 860682368 860454142 860163331 859892130
2708.5 859892130 859687686 859501958 859287262 859008551 858675122 858390033 858224332 858093381 857842922 857449412
2728.9 857449412 857078493 856820822 856604576 856375396 856108606 855807483 855545938 855384767 855256855 855026960
2749.3 855026960 854686201 854351699 854079843 853820443 853513062 853160083 852805197 852480173 852208078 851973534
2769.7 851973534 851722062 851439476 851123810 850760758 850353599 849903822 849431038 849027276 848755300 848481059
2790.1 848481059 848035395 847478688 846982837 846571803 846127629 845582843 844971716 844383299 843891621 843437731
2810.5 843437731 842883170 842189550 841460705 840829313 840300977 839743137 839032710 838184357 837334335 836607933
2830.9 836607933 835935056 835120380 834090590 832807779 831233561 829391837 827246845 824906468 822792530
2849.3 822792530 821278214 820336521 819701254 819191337 818700850 818137109 817434490 816498399 815271556
2867.6 815271556 813979983 812948108 812081635 811113298 810108781 809254348 808567524 807937920 807206035
2886 807206035 806281447 805256426 804315686 803477585 802539647 801378429 800132751 798954904 797830462
2904.3 797830462 796653330 795305967 793728054 791939259 789997637 788010657 786128998 784499526
2920.6 784499526 783277333 782555103 782301664 782338917 782401264 782499135 782877684 783632815 784708560 786026478
2941 786026478 787407756 788570821 789349735 789813817 790114582 790196002 790044188 789969444 790158629 790491164
2961.4 790491164 790813446 791115880 791506827 792041302 792664289 793232918 793625236 793974638 794398904 794697046
2981.8 794697046 794778824 794805110 794918597 795204639 795502543 795487642 795212328 794853628 794365287 793822706
3002.2 793822706 793268263 792645633 792119086 791796982 791490376 790942609 790066957 789012134 787975550
3020.6 787975550 787062466 786213398 785271347 784303308 783445477 782666624 781783104 780659795 779527724
3038.9 779527724 778556049 777569532 776406467 775073826 773706138 772374034 771083176 769856691 768583477
3057.3 768583477 767213643 765897870 764717162 763635576 762484908 761112571 759644210 758331180
3073.6 758331180 757315040 756418288 755254745 753796816 752333522 750964165 749659538 748348475
3089.9 748348475 746861517 745237947 743753135 742498517 741199136 739610374 737923026 736473799
3106.2 736473799 735186994 733721673 732145667 730710208 729312897 727787554 726004779 723894536
3122.6 723894536 721721828 719807208 718130767 716398060 714452565 712495565 710728884 709011316
3138.9 709011316 707041264 704857707 702708364 700659454 698749065 696904480 694840193 692489505
3155.2 692489505 690115333 687855363 685659528 683480680 681214750 678824604 676452339 674180567
3171.5 674180567 671930313 669603527 667163193 664721847 662391245 660106778 657750368 655322909
3187.8 655322909 652872562 650403380 647976160 645544291 643005311 640476167 638071954 635722220
3204.1 635722220 633360863 630976200 628561735 626173615 623875558 621643305 619366705 616999149
3220.5 616999149 614631772 612367034 610183120 607991278 605843604 603805721 601728439 599546194
3236.8 599546194 597392201 595324516 593354285 591508329 589700162 587775767 585790694 583933055
3253.1 583933055 582225680 580510795 578698754 576891541 575145841 573473692 571939230 570491374
3269.4 570491374 568899930 567062557 565127492 563231647 561426520 559662223 557864964 556051850
3285.7 556051850 554282486 552600682 550907254 549069822 547091305 545014858 542937934 540986478
3302 540986478 539166689 537292302 535141289 532745242 530308366 527958572 525687158 523422062 521159649
3320.4 521159649 518969953 516802967 514432609 511853456 509337187 506975234 504748166 502622724
3336.7 502622724 500346959 497819692 495264024 492761165 490346134 488104641 485798925 483215123
3353 483215123 480581492 478175402 475953937 473695874 471416980 469386041 467553854 465505332 463078976
3371.4 463078976 460640430 458576947 456821471 455157846 453467160 451824665 450444549 449452758
3387.7 449452758 448783487 448019654 446883261 445759028 445105255 444716036 443963349 442799389 441870242
3406.1 441870242 441430092 441177756 440901339 440524638 440132082 439972311 440014780 440063596 440244883 440778494
3426.5 440778494 441567242 442320406 443117261 444114774 445002198 445586920 446221322 447264791 448620647
3444.8 448620647 449998051 451360315 452881426 454545766 456287533 458254069 460486084 462624878
3461.1 462624878 464636803 466982633 469580591 471807420 473515242 475256979 477410436 479978144
3477.4 479978144 482645214 484992772 487238437 489733875 492233425 494598657 497114867 499861211
3493.8 499861211 502688229 505448341 508183360 510923266 513482332 515893877 518416703 521216869
3510.1 521216869 524315536 527373612 530153155 532979727 536113203 539503038 542772412 545670152
3526.4 545670152 548510790 551616430 554992914 558572948 562118351 565454245 568988383 572896004
3542.7 572896004 576708078 580094576 583413720 586923361 590514839 594191253 598097980 602256119
3559 602256119 606436789 610444844 614243805 618270516 622749031 627132952 631321907 635658085 640217900
3577.4 640217900 644944668 649884105 654920280 659685910 664085805 668735981 673610330 678362846
3593.7 678362846 683189511 688261211 693311810 698286057 703259051 708017707 712772608 717762291
3610 717762291 722693980 727543592 732255280 736716151 741338670 746042252 750486553 754480600 758271873
3628.4 758271873 762732685 767159164 771105707 774919748 778681993 782379448 786061287 789614499
3644.7 789614499 792717338 795391917 798251450 801181972 803690970 806177616 808879375 811250150
3661 811250150 813255847 815267384 817062199 818379223 820019305 821656823 822372735 823267281 824798584
3679.4 824798584 826407552 828072667 829643965 830743432 831240237 831862748 832941473 834061623 834976315
3697.7 834976315 835613430 836104751 836858153 837817073 838565052 838837862 839045882 839877725 840788662 841283798
3718.1 841283798 841537893 841800511 842006683 842158020 842579305 843192697 843652964 843822241 844115138 844907105
3738.5 844907105 845636547 845551670 845174432 845744848 846078098 845530152 845583200 846424520 847021878 847082376
3758.9 847082376 847202420 847560942 847815871 847937286 847857118 847769916 848033369 848545194 848957121 848994017
3779.3 848994017 848918557 848942280 849011779 849190712 849411786 849601567 849698544 849728882 849917173 849843025 849434018
3801.7 849434018 849542022 849670708 849634349 850003183 850479662 850519478 850348473 850579023 850510657 850161135
3822.1 850161135 850294530 850520194 850668490 850728333 850792110 851032555 851003706 850590885 850424170 850486517
3842.5 850486517 850650251 851037145 851492405 851419449 850220621 849480748 850178719 850897610 851173639 851007342
3862.9 851007342 850838304 850934029 850794017 850617647 850643158 850714326 850868583 850843132 850879550 851095736
3883.3 851095736 851049542 850980520 850882888 850615859 850680113 851008654 851077676 850800514 850416005 850172997
3903.7 850172997 850241780 850480258 850641549 850749850 850874603 850881934 850718856 850637674 850677431 850632370 850639045
3926.1 850639045 850801051 850828946 850686967 850665629 850760698 850840211 850832760 850703716 850640774 850694418 850715518
3948.6 850715518 850722194 850755453 850784600 850826085 850900471 850944877 850908220 850827992 850761890 850801170 850951970
3971 850951970 851070940 851091623 851069689 851107299 851239741 851340473 851319134 851242721 851208508 851261199 851332009
3993.4 851332009 851306200 851255715
3997.5 851255715
##END=$$ End of the data block
