##TITLE=$$ Begin of the data block
##JCAMP-DX=5.00 $$ ACD/SpecManager v 10.08
##SPECTROMETER/DATA SYSTEM=Alpha
##DATE=09 Apr 2014 11:14:46
##DATA TYPE=INFRARED SPECTRUM
##DATA CLASS=XYDATA
##ORIGIN=
##OWNER=
##NPOINTS=1765
##FIRSTX=399.75695801
##LASTX=3997.56933594
##MAXX=3997.56933594
##MINX=399.75695801
##MAXY=0.88004988
##MINY=0.43996194
##XFACTOR=1.0000000000
##YFACTOR=1.000000000000000e-9
##FIRSTY=0.76384842
##DELTAX=2.03957629
##XUNITS=1/CM
##YUNITS=ARBITRARY UNITS
##XYDATA=(X++(Y..Y))
399.8G63848424l033876m352689l468871n65648J524686K25842k434551j762987J638949
418.1G51619279J968980j393199l477096k956391n4836J693428J39117k490223k580404
436.5G42468655J00732J904368N49019k062619k393246k90513J646638R41813j258373
454.8G41606474j804948k57671R81927j40071k373218k678812l16322J820803O95407
473.2G37533569k314448k996683n85318J874984J312792j367271k470553o68347J429975
491.5G31748700Q02040j734137k777398j074314J134157Q66771j393676k514779j004816
509.9G24052548J001478O80983j540602k839624j434446O81639N85854j512945k678513
528.3G16996372j429200M34875N97596j091659k311647j315534O39916Q84234q72313
$$ plain form
399.8 763848424 760814548 756461859 752992988 752427340 753952026 754177868 751743317 749980330 751619279
418.1 751619279 753588259 752195060 748717964 745761573 745706737 747400165 747539282 745049059 742468655
436.5 742468655 742569387 744473755 745022774 742960155 740566909 740276396 741923034 742864847 741606474
454.8 741606474 739801526 739543855 740525782 740385711 738012493 735333681 735017359 736838162 737533569
473.2 737533569 735219121 732222438 731637120 733512104 734824896 733457625 730987072 730318725 731748700
491.5 731748700 732550740 730816603 728039205 726964891 728099048 728965819 727572143 725057364 724052548
509.9 724052548 725054026 725735009 724194407 721354783 719920337 720601976 721187830 719674885 716996372
528.3 716996372 715567172 716002047 716599643 715507984 713196337 711880803 712520719 713404953 712532640
546.6G12532640k073885j186072K55763K61486r91404j877129j367629j69575l755
565G05380440j282811k365411j934051q64446o22034j281679j890838j764000q45313
583.3F92529857j75178p09295j617789j546503o30080j47999o56008j649022k028227
601.7F83369756j387418o98089p31349j211524j318157n24640O63042J438201J541972
620F81141794J627981K385855L226459L229559K343952J573503J867533K607346K483010
638.4G02486992J349211K40326M26232J718045K312958J346767o855m0114J540542
656.7G11374104L149807L113091K073050J300573J133740K405942K868712J838505
673.1G29257524J503527J994252K192557J625002J062512J223922J632392J609802
$$ plain form
546.6 712532640 710458755 709272683 709528446 709789932 708798528 706921399 705553770 705384195 705380440
565 705380440 704097629 701732218 699798167 698933721 698311687 697030008 695139170 693375170 692529857
583.3 692529857 692354679 691645384 690027595 688481092 687851012 687703013 687047005 685397983 683369756
601.7 683369756 681982338 681284249 680552900 679341376 678023219 677498579 678161621 679599822 681141794
620 681141794 682769775 685155630 688382089 691611648 693955600 695529103 697396636 700003982 702486992
638.4 702486992 703836203 704076529 704502761 706220806 708533764 709880531 709873676 709833562 711374104
656.7 711374104 714523911 717637002 719710052 721010625 722144365 724550307 727419019 729257524
673.1 729257524 730761051 732755303 734947860 736572862 737635374 738859296 740491688 742101490
689.4G42101490J106501N76198O18994J041592J181781R01997O41823P87735J258611
707.7G50216722J544893J347363J090706J176893J430035J603067J552880J330018
724G61292577J301884J489997J565099J314044R64403R22203J108826J198232J013398
742.4G72170663Q24094R92059J334429J451850J281619J052082J045465J263440J323283
760.8G82738984J066148P90179P38680Q19087Q16107N39303J06394j14501r5248j84357
781.2G87220776m71115o00934k97487L68714J066149J514554J795530K219439K858400
799.5G95674026L357708L274143K668381K121508K051354K168297J788378R24945K36392
817.9H14265132Q8036J30951l59416j396715k171934k183854j792372j716315k110780
$$ plain form
689.4 742101490 743207991 743784189 744403183 745444775 746626556 747528553 748170376 748958111 750216722
707.7 750216722 751761615 753108978 754199684 755376577 756806612 758409679 759962559 761292577
724 761292577 762594461 764084458 765649557 766963601 767928004 768850207 769959033 771157265 772170663
742.4 772170663 772994757 773986816 775321245 776773095 778054714 779106796 780152261 781415701 782738984
760.8 782738984 783805132 784595311 785333991 786153078 786969185 787508488 787614882 787500381 787405133 787220776
781.2 787220776 786749661 786148727 785851240 786219954 787286103 788800657 790596187 792815626 795674026
799.5 795674026 799031734 802305877 804974258 807095766 809147120 811315417 813103795 814028740 814265132
817.9 814265132 814353168 814484119 814124703 812727988 810556054 808372200 806579828 804863513 802752733
836.2H02752733k335787j909136j247168r89973j098753q80718K44320J969874L377854
854.6G99883246L906012L959119M293263M837036M868985M065334K938748K319157
870.9H31070900K412558K395749J556217M66466Q464R4772l0220p04050j477897j656711
891.3H34136248j054883k64764J16765J59622L50177Q86679J365005J279533N73278
909.6H37547660k48611p00772q76427j169026j699924k077401j801073r28641p8916
928H27966869K93970K31087J02103K64108N53370M81367o1393o14047o88374m67003
948.4H28062057o29127j449704k463817l054858l191709l466427m420281n834937o880939
966.8G96670258p153928p121444p409394p772982p294476n797386m280090l785670
$$ plain form
836.2 802752733 800416946 798507810 797260642 796270669 795171916 794291198 794535518 796505392 799883246
854.6 799883246 803789258 807748377 812041640 816878676 821747661 825812995 828751743 831070900
870.9 831070900 833483458 835879207 837435424 837901890 837910354 838005126 837974906 837270856 835792959 834136248
891.3 834136248 833081365 832816601 832933366 833092988 833443165 834329844 835694849 836974382 837547660
909.6 837547660 837299049 836598277 835721850 834552824 832852900 830775499 828974426 828045785 827966869
928 827966869 828260839 828491926 828594029 828858137 829411507 829892874 829831481 829217434 828529060 828062057
948.4 828062057 827432930 825983226 823519409 820464551 817272842 813806415 809386134 803551197 796670258
966.8 796670258 789516330 782394886 774985492 767212510 759918034 754120648 749840558 746054888
983.1G46054888m180968m292488l369272k057433j539707j940429k194107j485348
999.4G24995136l62754j26123j157999k381742k718151k467274k704740l703713m478872
1017.7G04893768m112065l035426k526939l087640l801942l574311k549112j825750
1034.1F80380583j989603k454579k282381j443505q88050j303494k162397k360225
1050.4F65496349j572728n23448k5630P749K65121Q75116J024902Q5532j426816k457142
1070.8F61749005k533436k144515k041519k381503k690673k570689k285421k423882
1087.1F42677367l000319l337443k815962j627564n69523j39653j71483j44839J09255
1105.4F30979836K61784J0013n50151j029670j261711j692414k682984l480673k887547
$$ plain form
983.1 746054888 741873920 737581432 734212160 732154727 730615020 728674591 726480484 724995136
999.4 724995136 724632382 724506259 723348260 720966518 718248367 715781093 713076353 709372640 704893768
1017.7 704893768 700781703 697746277 695219338 692131698 688329756 684755445 682206333 680380583
1034.1 680380583 678390980 675936401 673654020 672210515 671322465 670018971 667856574 665496349
1050.4 665496349 663923621 663400173 663374543 663382292 663647413 664522529 665547431 665632963 664206147 661749005
1070.8 661749005 659215569 657071054 655029535 652648032 649957359 647386670 645101249 642677367
1087.1 642677367 639677048 636339605 633523643 631896079 631326556 631186903 631015420 630870581 630979836
1105.4 630979836 631241620 631251633 630701482 629671812 628410101 626717687 624034703 620554030 617666483
1123.8F17666483j238406K30670J488269K086579J504004J237035K084434K912343
1140.1F27971411K872228K207280J660883J624107J764298J648247J325905J255751
1156.4F42330110J781643K673506L412783L864229M398584N237043O089509O437838
1172.7F76225245O078541N482674N278051N377412N106747M151344K934277K043307
1189.1G12677598J507401R05693N1737o44505n27084M13537J400232J757086J567304
1207.4G19108999J362145J340449J256823Q74639L18646O5267L52800P78437Q46386
1225.8G26304591O40034N90921Q89122J316786J485467J318932J139164J171291J249909
1244.1G36106217J088619O70731K47181Q3446K26379M69148O07192P16627J051843
$$ plain form
1123.8 617666483 616428077 616658747 618147016 620233595 621737599 622974634 625059068 627971411
1140.1 627971411 630843639 633050919 634711802 636335909 638100207 639748454 641074359 642330110
1156.4 642330110 644111753 646785259 650198042 654062271 658460855 663697898 669787407 676225245
1172.7 676225245 682303786 687786460 693064511 698441923 703548670 707700014 710634291 712677598
1189.1 712677598 714184999 715090692 715142429 714497924 713970840 714384377 715784609 717541695 719108999
1207.4 719108999 720471144 721811593 723068416 723943055 724261701 724326968 724679768 725458205 726304591
1225.8 726304591 726944625 727535546 728424668 729741454 731226921 732545853 733685017 734856308 736106217
1244.1 736106217 737194836 737865567 738112748 738196194 738422573 738891721 739498913 740215540 741267383
1262.5G41267383J641035K207518K505243K589225K695263K929270L157854L189027
1278.8G62181818L032625K918840L027498L266573L321827L030538K606333K362251
1295.1G85748303K340257K250970J881837J398087J116156J129270J177669R77099
1311.4G98019648N92351L89933N57721Q10921Q48353P17938O44326P50244Q58843O94752
1331.8H04885030L17335R4771J01030J02401J00553J09792Q4579J89125L65436L29912
1352.2H06679964J8418l11077k97069j57953m92453j012564j045585q48949n03361
1370.6H02029371l79264q61049j175940j168072j477599j673639j077950l67641k08378
1388.9G93639839o7056q7976o25491j172722j535415j473189j326084j737654j875996
$$ plain form
1262.5 741267383 742908418 745115936 747621179 750210404 752905667 755834937 758992791 762181818
1278.8 762181818 765214443 768133283 771160781 774427354 777749181 780779719 783386052 785748303
1295.1 785748303 788088560 790339530 792221367 793619454 794735610 795864880 797042549 798019648
1311.4 798019648 798611999 799001932 799559653 800370574 801218927 801936865 802581191 803331435 804190278 804885030
1331.8 804885030 805202365 805297136 805398166 805500567 805601120 805710912 805795491 805984616 806350052 806679964
1352.2 806679964 806698382 806387305 806090236 805932283 805439830 804427266 803381681 802532732 802029371
1370.6 802029371 801650107 800789058 799613118 798445046 796967447 795293808 794215858 793848217 793639839
1388.9 793639839 793572783 793484807 792859316 791686594 790151179 788677990 787351906 785614252 783738256
1407.3G83738256j562834j337588j033843o34253q06033j461745r80258l37660l01480
1425.7G75282562k59638k87652l457N66900N29527K28644N91933J022220J248658J401305
1446G80321002J388609J504362J999974K627492L185988L151297K739668K890825L279806
1464.4H03089023L427446L435432L690601M060983L689468K953649K393424J835049
1480.7H28575075J449883J371860J272381M57227o50287o37174m11033r28581j442909
1499.1H29056442j286090p89821j058936l144383l254831k222955k022028j875520
1515.4H13401878j632393j268148j858234k260685j752973j528621r48786r23992j846790
1533.7G99381256j264572o3419p75099j950860j499295q87275j25468K68698L08335
$$ plain form
1407.3 783738256 782175422 780837834 779803991 779169738 778363705 776901960 775921702 775584042 775282562
1425.7 775282562 775022924 774735272 774731815 775298715 775828242 776056886 776648819 777671039 778919697 780321002
1446 780321002 781709611 783213973 785213947 787841439 791027427 794178724 796918392 799809217 803089023
1464.4 803089023 806516469 809951901 813642502 817703485 821392953 824346602 826740026 828575075
1480.7 828575075 830024958 831396818 832669199 833126426 832476139 831838965 831427932 830499351 829056442
1499.1 829056442 827770352 826980531 825921595 822777212 819522381 817299426 815277398 813401878
1515.4 813401878 811769485 810501337 808643103 806382418 804629445 803100824 802152038 801228046 799381256
1533.7 799381256 798116684 798053265 797278166 795327306 793828011 792940736 792815268 793083966 793392301
1552.1G93392301L37958N21243m58301k028703q08537o46889j182139j781285k495587
1570.5G84850061j980722k346814m627824m441201l197193l570497m286409m774749
1586.8G55624652m909575m804909m851520n288244n566239n359709n092979m997849
1603.1G14753628n001962n227030n538463n140364m245163m801332o400764m716516
1619.4F73682034l222823l841996l743649l336668l036857j699924p81357j253426
1635.7F52765334q36611O10947J662434K571404L465175M016042L805339M142344N195916
1654.1F77398324M760385M534661M773438N069495N382776N385637N667389N777418
1670.4G18749523N126298N356371O009638N815328N552589N625487O254732N889595
$$ plain form
1552.1 793392301 793730259 794251502 793793201 791764498 790955961 790309072 789126933 787345648 784850061
1570.5 784850061 782869339 780522525 775894701 771453500 768256307 764685810 760399401 755624652
1586.8 755624652 750715077 745910168 741058648 735770404 730204165 724844456 719751477 714753628
1603.1 714753628 709751666 704524636 698986173 693845809 689600646 684799314 678398550 673682034
1619.4 673682034 670459211 666617215 662873566 659536898 656500041 654800117 654018760 652765334
1635.7 652765334 651928723 652539670 654202104 656773508 660238683 664254725 668060064 672202408 677398324
1654.1 677398324 682158709 686693370 691466808 696536303 701919079 707304716 712972105 718749523
1670.4 718749523 723875821 729232192 735241830 741057158 746609747 752235234 758489966 764379561
1686.7G64379561N340755N259693M830956N218625N913854N803287N802631M734457
1703H07283819M075348M144728L814996L396987K987624K673924K526045K268135J982868
1721.4H35154474J682102J613379J929879K341509K175093J348257R71377J484215
1737.7H48700285J885712J844347J548588J403391J553536J575350J317740J073599
1754H60902548R20117R38952J109600J037419P71045O59466O94931Q25882O67810L48866
1774.4H68876636K96772M11510N48542O06000M70221L39448M69983N21839L66747L24905
1794.8H73232603L61383K50340J53780K60889M06027L81350K19703R8825J69873L21209
1815.2H75855982K81513J31607J43051K99633L99828L63707N4360j94669M0710K77400
$$ plain form
1686.7 764379561 769720316 774980009 779810965 785029590 790943444 796746731 802549362 807283819
1703 807283819 811359167 815503895 819318891 822715878 825703502 828377426 830903471 833171606 835154474
1721.4 835154474 836836576 838449955 840379834 842721343 844896436 846244693 847216070 848700285
1737.7 848700285 850585997 852430344 853978932 855382323 856935859 858511209 859828949 860902548
1754 860902548 861822665 862761617 863871217 864908636 865679681 866339147 867034078 867859960 868527770 868876636
1774.4 868876636 869173408 869584918 870133460 870739460 871209681 871549129 872019112 872540951 872907698 873232603
1794.8 873232603 873593986 873844326 873998106 874258995 874665022 875046372 875266075 875364900 875534773 875855982
1815.2 875855982 876137495 876269102 876412153 876711786 877111614 877475321 877529681 877335012 877375722 877653122
1835.6H77653122K88367K58386K15233K9862M3571K03788R6917n6326m8936J21415
1856H78805399K76864J99079k563L1233K38299K07126m0829j27315r8646P689J82748
1878.4H79679084J99914K6583r3042M708J04547Q7500L9100r0241j51813J2934J58608
1900.9H79977882P2002q7142j14143k7895N3943P6651K8312j03771j15216M0233M0352
1923.3H79841208j17182k22922j92821k0146J02699J2815j33097j31011m5777o258
1943.7H79087508o5804k17676k94626j51157M1902L3557j45554k74718j94371J6451
1964.1H77835512O3479j60694l71158k94745l1233R7930n6326k93851k80320j9789
1984.5H76488805J47879M8399k21729l95775k30670M1246K3782k27928l45528j66774
$$ plain form
1835.6 877653122 877941489 878199875 878415108 878444970 878488541 878692329 878789246 878732920 878683984 878805399
1856 878805399 879082263 879281342 879278779 879310012 879548311 879755437 879714608 879587293 879488647 879496336 879679084
1878.4 879679084 879878998 879905581 879812539 879817247 879921794 880009294 880048394 879958153 879806340 879819274 879977882
1900.9 879977882 880049884 879962742 879848599 879820704 879874647 879951298 879979610 879875839 879760623 879800856 879841208
1923.3 879841208 879724026 879501104 879308283 879288137 879390836 879403651 879270554 879139543 879093766 879087508
1943.7 879087508 879021704 878804028 878509402 878358245 878400147 878433704 878288150 878013432 877819061 877835512
1964.1 877835512 877898991 877738297 877367139 877072394 877041161 877139091 877082765 876788914 876508594 876488805
1984.5 876488805 876636684 876685083 876463354 876067579 875836909 875878155 875901937 875674009 875328481 875161707
2004.9H75161707O2168K4080k35140l38793j49131N7876L2545j97649l68119k60234
2025.3H73789310M054R4175r9599l08812k61963j9073J38938r656k94625l15905n7161
2047.7H72659683J39773L2723k28703k99096q7678J40309J07944j35243k62797r1016
2068.1H71975899J16825Q2433j04129j82152o1870R7454J27494Q881j20401r5487M6432
2090.5H71891379J13726J4186j36018j34587K5034J53661J19447j8477r4652j7465
2110.9H71916234J14084J20699K206r5368m1902J15454J69218M4346q0943l3319J02758
2133.4H72333467J45495O4492l1054k2709P8439J48178J20997K7657j0848O8426J44720
2155.8H73067260J31786M8101k9743O676J23918J64628Q2910j0669N841J19865J66356
$$ plain form
2004.9 875161707 875223875 875247955 875012815 874674022 874524891 874582767 874615312 874417663 874049544 873789310
2025.3 873789310 873793364 873887539 873787940 873479128 873217165 873198092 873337030 873327374 873032749 872716844 872659683
2047.7 872659683 872799456 872832179 872603476 872304380 872216702 872357011 872464955 872329712 872066915 871975899
2068.1 871975899 872092724 872175157 872071028 871888876 871827006 871924460 872051954 872060835 871940434 871844947 871891379
2090.5 871891379 872005105 872019291 871883273 871748686 871773720 871927381 872046828 872028351 871933699 871916234
2110.9 871916234 872030318 872151017 872153223 872057855 872015953 872131407 872300625 872344971 872264028 872230709 872333467
2133.4 872333467 872478962 872543454 872512400 872489691 872568130 872716308 872837305 872864962 872854114 872922540 873067260
2155.8 873067260 873199046 873247147 873217404 873224080 873347998 873512626 873595536 873584867 873590708 873710573 873876929
2178.2H73876929O1572l7491M76J00553J59443J15096J610m2796L7014J27077J10030
2200.7H74509513J4723m4763J728R3937Q8334j4126n4121J7583Q3089M9830m1724p6532
2225.2H74627471r656Q5592R4235J3709m3928l6776M172L3438R716m2916o7770m6075
2249.6H74621212j9371l2663o4493p2479m2140K1398K9623l8028n5670k1816p271q881
2274.1H74309421l338L5107Q2672Q7022M1247m3929j41144j99377j97113j71006j77145
2296.5H73622417k31623k81811l16381m05491n01931n33580n54562n37097m88878o13689
2316.9H69157374q62002r56297q24631n98192n61356o93083n93305l53277l96192m89354
2337.3H62829685l04341j9074M19081J406610J841664N87285j325191k424359k282381
$$ plain form
2178.2 873876929 873938501 873901010 873901486 874002039 874161482 874276578 874278188 874235392 874272406 874399483 874509513
2200.7 874509513 874524236 874479473 874481201 874575138 874663472 874649346 874595225 874612808 874695897 874745727 874704003 874627471
2225.2 874627471 874617815 874703407 874797642 874811351 874767423 874730647 874734819 874768257 874777973 874735057 874667287 874621212
2249.6 874621212 874601841 874569178 874504685 874432206 874390066 874411464 874441087 874403059 874347389 874325573 874318302 874309421
2274.1 874309421 874306083 874341190 874423862 874510884 874552131 874508202 874367058 874167681 873970568 873799562 873622417
2296.5 873622417 873390794 873108983 872792602 872387111 871885180 871351600 870797038 870259941 869771063 869157374
2316.9 869157374 868295372 867339075 866514444 865916252 865354896 864661813 864068508 863715231 863319039 862829685
2337.3 862829685 862525344 862506270 862925351 864331961 866173625 866760910 865435719 863011360 860728979
2355.7H60728979j595735o73831K75075R07004J252056J608550J992285K144337J981854
2374H68620574J738370J600683J567900J440585J052320N57839K36035J35362J31190
2392.4H77080858J05858K4199l5465o079P4982R2924L1888m0948p1347j847R7155O4552
2416.9H77416730q7679j49786n8055L8028O7055L338r7215q0168K5987P9274J1206
2439.3H77168715j12951j25825l755Q6903K7478j01745j54019p8260L0696K4796j07766
2461.7H76654267k00689r4890R0957R2864o6102j58131j04010L5286P9810p3075k15113
2484.2H76041174j61648M769R3817k9146k26438j97173M0591J56939M292k09689k25604
2506.6H75291884m7386R9004L7789j51813k28584q2433Q9705L4213j77205k48849o2704
$$ plain form
2355.7 860728979 859133244 858459413 858734488 859641492 860893548 862502098 864494383 866638720 868620574
2374 868620574 870358944 871959627 873527527 874968112 876020432 876578271 876814306 876949668 877080858
2392.4 877080858 877186716 877210915 877175450 877169371 877244353 877337277 877369165 877328217 877256870 877255023 877352178 877416730
2416.9 877416730 877329051 877179265 877121210 877159238 877226293 877229631 877132416 877052248 877078235 877157509 877168715
2439.3 877168715 877055764 876929939 876926184 877013087 877040565 876938820 876784801 876706541 876737237 876762033 876654267
2461.7 876654267 876453578 876358688 876449645 876542509 876476407 876318276 876214266 876249552 876329362 876256287 876041174
2484.2 876041174 875879526 875884295 875978112 875948966 875722528 875525355 875565946 875722885 875727177 875517488 875291884
2506.6 875291884 875244498 875343502 875381291 875229478 875000894 874918461 875008166 875042379 874865174 874616325 874553621
2529H74553621J52349J02401j45495k57254j19805P9692R3400j10626k64168j58548
2549.4H73925567O5505J16885l7789k07723k07543j9908R0778m5180k25127k04086
2569.8H73251379l8565L6121o4075j93954k13086j45257o3658p1406j79112k23458
2590.2H72094929j44779o8129j06155k31266k94328k09213r3877p8320j58131k52784
2610.6H70457947k53558j51753r1911j82330l04163k84612j70767j08660j63376k98381
2631H68448436l58164k58505j14739p7606j72913k71141k63870j81735j25885j84476
2651.4H66439402k95818l23772k22624j10805j28567k15471k50399k18212j58072j43468
2671.8H64372194k00570k44856k16722j73211k08140k92837l17216k53856j43350r4294
$$ plain form
2529 874553621 874705970 874808371 874662876 874405622 874285817 874365509 874458909 874348283 874084115 873925567
2549.4 873925567 873991072 874107957 874070168 873862445 873654902 873634994 873725772 873680592 873455465 873251379
2569.8 873251379 873212814 873248935 873184860 872990906 872777820 872632563 872568905 872497499 872318387 872094929
2590.2 872094929 871950150 871882021 871775866 871544600 871250272 871041059 870947182 870868862 870710731 870457947
2610.6 870457947 870204389 870052636 869960725 869778395 869474232 869189620 869018853 868910193 868746817 868448436
2631 868448436 868090272 867831767 867717028 867639422 867466509 867195368 866931498 866749763 866623878 866439402
2651.4 866439402 866143584 865819812 865597188 865486383 865357816 865142345 864891946 864673734 864515662 864372194
2671.8 864372194 864171624 863926768 863710046 863536835 863328695 863035858 862718642 862464786 862321436 862227142
2692.2H62227142j98662l46065l54767k52008j82689j87218k49982l01003k37763j65284
2712.6H59751701k24173l12388l06964k20060j49131j62661k72929m07756l68476k25901
2733H57101262k00868k37465k74777k95341k32697j44482j52230k61009l55959l46422
2753.4H54600012k77161k43843k69174l19779l56019l40700k78294k27511k37703k93732
2773.8H51756096l70562m29571m43637m37081m14491l45707k59876k93672m55380n44548
2794.2H47761571m81546m20331m71652n46634n88179n99801n06223m37677n56409o86943
2814.6H42466176o98030o36638n46336n38826p08878q67724q06749o76394p09772q81552
2835H35395277j070261j305879j583993j835346k120734k334833k141475j500190q79883
$$ plain form
2692.2 862227142 862028480 861682415 861327648 861075640 860892951 860705733 860455751 860154748 859916985 859751701
2712.6 859751701 859527528 859215140 858908176 858688116 858538985 858376324 858103395 857695639 857327163 857101262
2733 857101262 856900394 856662929 856388152 856092811 855860114 855715632 855563402 855302393 854946434 854600012
2753.4 854600012 854322851 854079008 853809834 853490055 853134036 852793336 852515042 852287531 852049828 851756096
2773.8 851756096 851385534 850955963 850512326 850075245 849660754 849315047 849055171 848761499 848306119 847761571
2794.2 847761571 847280025 846859694 846388042 845841408 845253229 844653428 844147205 843709528 843153119 842466176
2814.6 842466176 841768146 841131508 840585172 840046346 839337468 838469744 837662995 836986601 836276829 835395277
2835 835395277 834325016 833019137 831435144 829599798 827479064 825144231 823002756 821502566 820622683
2853.3H20622683o33359n71072n14925n30124o45399q90851j206279j277625j007915
2871.7H13345134q57770j010835j043737q63850p07627o53207p31289q94309j001894
2890.1H05580616r64880q70168r42946j164317j231193j121462j079261j196504j401186
2908.4G95608699j595139j774907j947642k011597j879275j578867j188338p54476
2924.7G82878458k87473N4717Q5175Q9229L77357P61270J049876J273871J362979J180053
2945.1G88825512Q05497N09679L56496J10388j50323j02938J44542K87115K78890L00765
2965.5G91365623M42207N74231O25909N46396L73125L66687M44413K99692P2777J9670
2985.9G95130730J25765K88904K72036l0816k69770l76642m90725m85778n02467n97418
$$ plain form
2853.3 820622683 819989324 819418252 818903327 818373203 817727804 816836953 815630674 814353049 813345134
2871.7 813345134 812487364 811476529 810432792 809568942 808861315 808208108 807476819 806582510 805580616
2890.1 805580616 804615736 803745568 802802622 801638305 800407112 799285650 798206389 797009885 795608699
2908.4 795608699 794013560 792238653 790291011 788279414 786400139 784821272 783632934 782878458
2924.7 782878458 782590985 782645702 782730877 782820106 783197463 783958733 785008609 786282480 787645459 788825512
2945.1 788825512 789631009 790140688 790497184 790607572 790457249 790354311 790498853 790785968 791064858 791365623
2965.5 791365623 791807830 792382061 793007970 793554366 793927491 794294178 794738591 795038283 795111060 795130730
2985.9 795130730 795256495 795545399 795817435 795786619 795516849 795140207 794649482 794163704 793661237 793063819
3006.3G93063819n01871l29852l63052o01351q78334j008689j004160r38237q88347
3024.7G86549926r36210r27329q34465q01266r45747j173615j134455r66311j008391
3043G77822137j180828j309514j308977j278103j273095j217068j241803j359939j340270
3061.4G66312540j188636j054943j106083j359284j506686j355768j022398q55148
3077.7G56863594j125216j471639j508832j406372j313865j330614j513421j618624
3094G45575011j477540j235127j251638j564384j694440j457572j276911j478731j645208
3112.4G32493460j481116j408219j543105j776635k077461k152919j928151j676321
3128.7G18449533j689196j926064j979113j781761j702488j920283k149760k170563
$$ plain form
3006.3 793063819 792561948 792232096 791869044 791267693 790389359 789380670 788376510 787438273 786549926
3024.7 786549926 785613716 784686387 783851922 783050656 782104909 780931294 779796839 778830528 777822137
3043 777822137 776641309 775331795 774022818 772744715 771471620 770254552 769012749 767652810 766312540
3061.4 766312540 765123904 764068961 762962878 761603594 760096908 758741140 757718742 756863594
3077.7 756863594 755738378 754266739 752757907 751351535 750037670 748707056 747193635 745575011
3094 745575011 744097471 742862344 741610706 740046322 738351882 736894310 735617399 734138668 732493460
3112.4 732493460 731012344 729604125 728061020 726284385 724206924 722054005 720125854 718449533
3128.7 718449533 716760337 714834273 712855160 711073399 709370911 707450628 705300868 703130305
3145G03130305k081037j899719j801789k060592k413034k441824k259016k150237k174616
3163.4F83848441k274394k342940k326250k268433k263606k365828k467036k414167
3179.7F65125787k302289k295077k367675k435267k461791k447009k416909k454757
3196F45945013k535880k502561k377152k321065k348899k414823k454996k397120k284587
3214.3F24307930k214372k277791k395034k380252k271473k212286k180457k084852
3230.7F06291413k005577k118230k265632k223372k109945k003849j838326j756489
3247E89969993j879573j941502j840175j752972j758039j813710j793682j710237j654803
3265.3E73825300j595676j527548j608193j795649j897336j895725j830101j790643
$$ plain form
3145 703130305 701049268 699149549 697347760 695287168 692874134 690432310 688173294 686023057 683848441
3163.4 683848441 681574047 679231107 676904857 674636424 672372818 670006990 667539954 665125787
3179.7 665125787 662823498 660528421 658160746 655725479 653263688 650816679 648399770 645945013
3196 645945013 643409133 640906572 638529420 636208355 633859456 631444633 628989637 626592517 624307930
3214.3 624307930 622093558 619815767 617420733 615040481 612769008 610556722 608376265 606291413
3230.7 606291413 604285836 602167606 599901974 597678602 595568657 593564808 591726482 589969993
3247 589969993 588090420 586148918 584308743 582555771 580797732 578984022 577190340 575480103 573825300
3265.3 573825300 572229624 570702076 569093883 567298234 565400898 563505173 561675072 559884429
3281.6E59884429j790941j787126j760185j663923j648009j834809k045513k158582
3298E45195341k142012j965284j780868j840413k155005k415598k435028k326310k254605
3316.3E25880218k262712k275944k215981k185166k366841k557278k489566k339721
3332.6E07187009k236664k168477k287686k493858k531588k521277k454906k252937
3348.9D88239616k312749k628059k656668k410293k245605k232670k207041k004326
3365.3D69542205j855313k088190k478718k468616k059251j760751j677126j691788
3381.6D53462452j644671j396090r95696o49303p46578j127988j132131o74217l86090
3399.9D44709688p25001j123994q82298m29243k87473l08365l88831m08023j94520
$$ plain form
3281.6 559884429 558093488 556306362 554546177 552882254 551234245 549399436 547353923 545195341
3298 545195341 543053329 541088045 539307177 537466764 535311759 532896161 530461133 528134823 525880218
3316.3 525880218 523617506 521341562 519125581 516940415 514573574 512016296 509526730 507187009
3332.6 507187009 504950345 502781868 500494182 498000324 495468736 492947459 490492553 488239616
3348.9 488239616 485926867 483298808 480642140 478231847 475986242 473753572 471546531 469542205
3365.3 469542205 467686892 465598702 463119984 460651368 458592117 456831366 455154240 453462452
3381.6 453462452 451817781 450421691 449425995 448776692 448030114 446902126 445769995 445095778 444709688
3399.9 444709688 443984687 442860693 441978395 441549152 441261679 440953314 440564483 440156460 439961940
3418.3D39961940J79N3286K44260N86033Q06242P37161P72744J033068R32604N65916
3438.7D45693433O13749J064301J371950J359552J329273J484841J666695J826972
3455D56410766K024203K178401K084285K034813K380908K594411K229601J737625J772344
3473.4D75447357K169400K542287K611578K316564K250254K518863K512455K364039
3489.7D94732797K545685K798885K874851K780795K721131K717853K529502K401888
3506E16103387K556801K796292L033698L028631K806544K886295L187955L378510L227830
3524.4E43005943K878785K832950L128528L420234L583074L532946L378510L608823
3540.7E69369793L933132L775358L350496L313720L497422L585398L737390L952623
$$ plain form
3418.3 439961940 439962119 440015405 440259665 440845698 441651940 442389101 443161845 444194913 445127517 445693433
3438.7 445693433 446307182 447371483 448743433 450102985 451432258 452917099 454583794 456410766
3455 456410766 458434969 460613370 462697655 464732468 467113376 469707787 471937388 473675013 475447357
3473.4 475447357 477616757 480159044 482770622 485087186 487337440 489856303 492368758 494732797
3489.7 494732797 497278482 500077367 502952218 505733013 508454144 511171997 513701499 516103387
3506 516103387 518660188 521456480 524490178 527518809 530325353 533211648 536399603 539778113 543005943
3524.4 543005943 545884728 548717678 551846206 555266440 558849514 562382460 565760970 569369793
3540.7 569369793 573302925 577078283 580428779 583742499 587239921 590825319 594562709 598515332
3557E98515332M136204M194558M085362L860772L986954M375875M330934M178583M335523
3575.3F36000097M620313M852593M999161N001486M759550M451394M648268M820645
3591.7F74153507M742443M856408N090296N072594M983604M977047M783273M759908
3608G13419080N016684N018711M906834M705011M431665M580140M631639M362464L942788
3626.3G55015016L783047M457354M401982L912866L778458L746569L728688L732800
3642.6G86556780L570378L082097K694666K966881K984345K464354K404809K657115
3659H09381425K388776K043783K027870J810193J337945J607537J592219P28309R12965
3677.3H23831022J507103J550257J599312J557946J180828O15358O14584R81271J066923
$$ plain form
3557 598515332 602651536 606846094 610931456 614792228 618779182 623155057 627485991 631664574 636000097
3575.3 636000097 640620410 645473003 650472164 655473650 660233200 664684594 669332862 674153507
3591.7 674153507 678895950 683752358 688842654 693915248 698898852 703875899 708659172 713419080
3608 713419080 718435764 723454475 728361309 733066320 737497985 742078125 746709764 751072228 755015016
3626.3 755015016 758798063 763255417 767657399 771570265 775348723 779095292 782823980 786556780
3642.6 786556780 790127158 793209255 795903921 798870802 801855147 804319501 806724310 809381425
3659 809381425 811770201 813813984 815841854 817652047 818989992 820597529 822189748 822918057 823831022
3677.3 823831022 825338125 826888382 828487694 830045640 831226468 831841826 832456410 833437681 834504604
3695.7H34504604R23515O54816M65632P10308R50992P73490L32951K49029Q06629Q83103
3716.1H41255069M70340K16663K66373K26498J18732M06623O87063N90503K65360K82466
3736.5H44785690O88017O46412m9651l02195N42521L42429m54962L4392P75098N80013
3756.9H47587764L5227O6101L04938K43246J45018r4831r4771L05116N06222L94583
3777.3H49398613O5982j02758m5061L5405J81198K51353K05517J02222Q4757K62678
3797.7H50439906j6093l97563L2782N0307o7890L82304N16594J03950j12533J81377
3818H51113141j83225l77596J95683K60472J33991L8624J6928K22563L6419l74913
3838.4H51082087j69218Q6725J99675L95716M41193p9572j238942q56817O29485P19010
$$ plain form
3695.7 834504604 835428119 836082935 836548567 837258875 838209867 838983357 839316308 839565337 840371966 841255069
3716.1 841255069 841725409 841942072 842208445 842434943 842553675 842960298 843647361 844237864 844503224 844785690
3736.5 844785690 845473707 846120119 846070468 845768273 846310794 846653223 846198261 846232653 847007751 847587764
3756.9 847587764 847622991 847689092 847994030 848237276 848382294 848287463 848192692 848497808 849004030 849398613
3777.3 849398613 849464595 849361837 849316776 849352181 849533379 849784732 849990249 850092471 850177228 850439906
3797.7 850439906 850423813 850026250 850059032 850109339 850041449 850423753 850940347 851044297 850931764 851113141
3818 851113141 850929916 850552320 850748003 851008475 851142466 851181090 851198018 851420581 851457000 851082087
3838.4 851082087 850912869 850999594 851199269 851594985 852036178 851956606 850717664 849860847 850490332 851209342
3858.8H51209342K79606j22130n6565K12312l9637j86801n8472L8087J34230o1035
3879.2H51348937k0385J58906m0770l695l1770k06828J17600L14892k265k66195l03507
3901.7H51064920k72333K2888K42770J37150O9439O9738o4254j50502N96M9770j13010
3924.1H51057172m7624J65403O4134j06334J1563R7930P5341K2590j22071q3267K0742
3946.5H51155579o7651o2168O5744R5129N0724L2127J7583k3365m1127o259Q6427J50084
3971H51452827R1613o497l8624L2425J24574R3758j2636o0201k6465L1054K7359l0756
3995.5H51678431m3035
3997.5H51635396
$$ plain form
3858.8 851209342 851488948 851366818 851310253 851522565 851482928 851296127 851237655 851275742 851409972 851348937
3879.2 851348937 851328552 851487458 851446688 851442993 851411223 851204395 851321995 851636887 851634622 851368427 851064920
3901.7 851064920 850792587 850815475 851058245 851195395 851264834 851334572 851270318 851119816 851120412 851170182 851057172
3924.1 851057172 851009548 851174951 851239085 851132751 851144314 851242244 851317585 851340175 851218104 851134837 851155579
3946.5 851155579 851087928 851025760 851091504 851186633 851237357 851269484 851287067 851263702 851222575 851216316 851302743 851452827
3971 851452827 851544440 851537943 851499319 851531744 851656318 851750076 851737440 851677239 851650774 851681828 851709187 851678431
3995.5 851678431 851635396
3997.5 851635396
##END=$$ End of the data block
