##TITLE=$$ Begin of the data block
##JCAMP-DX=5.00 $$ ACD/SpecManager v 10.08
##SPECTROMETER/DATA SYSTEM=Alpha
##DATE=09 Apr 2014 11:14:46
##DATA TYPE=INFRARED SPECTRUM
##DATA CLASS=XYDATA
##ORIGIN=
##OWNER=
##NPOINTS=1765
##FIRSTX=399.75695801
##LASTX=3997.56933594
##MAXX=3997.56933594
##MINX=399.75695801
##MAXY=0.88000655
##MINY=0.43973389
##XFACTOR=1.0000000000
##YFACTOR=1.000000000000000e-9
##FIRSTY=0.76166713
##DELTAX=2.03957629
##XUNITS=1/CM
##YUNITS=ARBITRARY UNITS
##XYDATA=(X++(Y..Y))
399.8G61667132j830637m090369l943860o91831J806259O14166k277136k273023R80854
418.1G49961555K164423q06748l229678l150284l97563J538753L09289k080083k390683
436.5G41918981k35677J579523P91073j612663k277672m14491J404166P22170j171827
454.8G40703583j674950l95954Q40902n1200k028465k385259n05507J360774O71685
473.2G36535609j849652k654552o48260J627385J249493j267910k547741r88007J146138
491.5G30602503Q58664j528024k692461r56238J263678Q67308j514912k738833j098991
509.9G23062694J125574P88748j555085k796590j304925O58393M41075j577735k576173
528.3G16265976j223862M94004L69846j289427k178550j164794M86553O83844q08775
$$ y = [761667132, 759836495, 755746126, 751802266, 751110435, 752916694, 753530860, 751253724, 748980701, 749961555, 752125978, 751319230, 748089552, 744939268, 744541705, 746080458, 746389747, 744309664, 741918981, 741683304, 743262827, 744053900, 742441237, 740163565, 739749074, 741153240, 741875410, 740703583, 739028633, 738632679, 739473581, 739422381, 737393916, 735008657, 734503150, 735863924, 736535609, 734685957, 732031405, 731383145, 733010530, 734260023, 732992113, 730444372, 729456365, 730602503, 731461167, 729933143, 727240682, 726284444, 727548122, 728415430, 726900518, 724161685, 723062694, 724188268, 724977016, 723421931, 720625341, 719320416, 719978809, 720419884, 718842149, 716265976, 715042114, 715536118, 715905964, 714616537, 712437987, 711273193, 711759746, 712443590, 711634815]
546.6G11634815j861453r83537L71516J20461j275480k004325j295030j31488n4419
565G04521060j173317k164960j840055p68900m84109j282990k074719j932263q80003
583.3F91919744j55866o71864j546859j550734o48261k0682n48065j666606k058982
601.7F83051825j435280p25150o79016j157821j283347n48542N28753J349628J649439
620F80750489J782358K371490L100991L193021K459526J722157J854837K502322K520144
638.4G02257335J429320J97649K79784J552164K289594J455426J26481Q2731J552284
656.7G11222768L054738L093839K185940J386643J121521K352357K886116J945675
673.1G29249597J550495J899958K112925J631617J033307J129269J617015J704752
$$ y = [711634815, 709773362, 708789825, 709161341, 709281802, 708006322, 706001997, 704706967, 704575479, 704521060, 703347743, 701182783, 699342728, 698573828, 698089719, 696806729, 694732010, 692799747, 691919744, 691763878, 691092014, 689545155, 687994421, 687346160, 687325478, 686777413, 685110807, 683051825, 681616545, 680891395, 680212379, 679054558, 677771211, 677222669, 677751422, 679101050, 680750489, 682532847, 684904337, 688005328, 691198349, 693657875, 695380032, 697234869, 699737191, 702257335, 703686655, 703884304, 704164088, 705716252, 708005846, 709461272, 709587753, 709670484, 711222768, 714277506, 717371345, 719557285, 720943928, 722065449, 724417806, 727303922, 729249597, 730800092, 732700050, 734812975, 736444592, 737477899, 738607168, 740224183, 741928935]
689.4G41928935J230836O68704O15061R79245J211762J010120O36160P03216J246750
707.7G50230789J557648J335264J069247J155973J428962J575887J477957J267135
724G61098862J290321J561642J624226J250625Q89301R58503J184642J212001J053333
742.4G72123456Q94547R63747J265109J438856J316964J112104J086950J233101J278520
760.8G82713354J065969P62284O66976P62403P87139N21660J13010o6578k3604j02699
781.2G87199914m32491o55114l62337L55065J030385J428128J753628K290547K925753
799.5G95533478L311157L202796K629519K105117K088666K251446J864851R36567K31326
817.9H14154923J17063J34945l82423j425326k152979k091587j718879j690149k104580
$$ y = [741928935, 743159771, 743828475, 744443536, 745422781, 746634543, 747644663, 748280823, 748984039, 750230789, 751788437, 753123701, 754192948, 755348921, 756777883, 758353770, 759831727, 761098862, 762389183, 763950825, 765575051, 766825676, 767714977, 768673480, 769858122, 771070123, 772123456, 773018003, 773981750, 775246859, 776685715, 778002679, 779114783, 780201733, 781434834, 782713354, 783779323, 784541607, 785208583, 785970986, 786758125, 787279785, 787392795, 787326217, 787302613, 787199914, 786767423, 786112309, 785749972, 786105037, 787135422, 788563550, 790317178, 792607725, 795533478, 798844635, 802047431, 804676950, 806782067, 808870733, 811122179, 812987030, 813923597, 814154923, 814271986, 814406931, 814024508, 812599182, 810446203, 808354616, 806635737, 804945588, 802841008]
836.2H02841008k380848k000213j258969r23813j084804r20057K49445K021611L351331
854.6G99894691L796100L880024M317165M918158M898011M034102K898455K337932
870.9H30974638K461613K394557J563549N19395K8252N1439p1585p40230j539290j708746
891.3H33933592j063526k28166J58190J89662L83139R29952J400351J244187N08070
909.6H37455451k68995p11143q87633j160741j686275k060115j796365r44197r0897
928H27849090K81692K34842J35362K80857N26786M26292r7572n69702o11841m60923
948.4H27994883o59764j448035k456784l067494l182769l434181m431903n883634o892324
966.8G96537995p134854p121504p401585p728458p236659n761028m299521l846109
$$ y = [802841008, 800460160, 798459947, 797200978, 796277165, 795192361, 794272304, 794521749, 796543360, 799894691, 803690791, 807570815, 811887980, 816806138, 821704149, 825738251, 828636706, 830974638, 833436251, 835830808, 837394357, 837913752, 837942004, 837993443, 837921858, 837181628, 835642338, 833933592, 832870066, 832641900, 832800090, 832989752, 833372891, 834302843, 835703194, 836947381, 837455451, 837186456, 836475313, 835587680, 834426939, 832740664, 830680549, 828884184, 827939987, 827849090, 828130782, 828365624, 828500986, 828781843, 829308629, 829734921, 829637349, 829067647, 828455806, 827994883, 827335119, 825887084, 823430300, 820362806, 817180037, 813745856, 809313953, 803430319, 796537995, 789403141, 782281637, 774880052, 767151594, 759914935, 754153907, 749854386, 746008277]
983.1G46008277m218698m297077l380358k068758j534164j938045k176464j454651
999.4G24940062l90411j92046j196384k391756k712846k491057k737522l674447m443229
1017.7G04710364m113018l015995k485156l067434l803969l582298k556861j829862
1034.1F80255771j985848k459467k289533j413107q48294j300811k162874k341390
1050.4F65454447j541733m69804J847k7596K23696Q67545J010895L9637j447677k434850
1070.8F61676407k520144k139866k022803k380610k709150k569020k269626k406537
1087.1F42658651k974987l297448k771557j612067n98967j84417j96457j55031J15215
1105.4F30982935K92182K9505n52655j019954j246453j694500k692401l497899k930105
$$ y = [746008277, 741789579, 737492502, 734112144, 732043386, 730509222, 728571177, 726394713, 724940062, 724549651, 724357605, 723161221, 720769465, 718056619, 715565562, 712828040, 709153593, 704710364, 700597346, 697581351, 695096195, 692028761, 688224792, 684642494, 682085633, 680255771, 678269923, 675810456, 673520923, 672107816, 671259522, 669958711, 667795837, 665454447, 663912714, 663442910, 663444757, 663417161, 663640857, 664508402, 665519297, 665558934, 664111257, 661676407, 659156263, 657016397, 654993594, 652612984, 649903834, 647334814, 645065188, 642658651, 639683664, 636386216, 633614659, 632002592, 631403625, 631219208, 631022751, 630867720, 630982935, 631275117, 631304622, 630751967, 629732013, 628485560, 626791060, 624098659, 620600760, 617670655]
1123.8F17670655j299679J84596J482665K108932J533031J267672K090156K885937
1140.1F27923965K859593K224862J682580J645982J779735J626373J279533J225233
1156.4F42247856J795947K704144L386855L802061M367232N255342O134927O453753
1172.7F76148117O054341N462349N270243N363702N086840M142940K944290K043724
1189.1G12516546J481772Q83221M1068o57797n35846M16160J411021J780510J584589
1207.4G18921244J341641J339436J311063Q94726K98381P2002L66628P76112Q39651
1225.8G26160884O23941N93365R39428J344383J462221J304210J142501J189888J293897
1244.1G36054718J137376O84917K15710N0604K31147M76181N80251P04050J075566
$$ y = [617670655, 616370976, 616555572, 618038237, 620147169, 621680200, 622947872, 625038028, 627923965, 630783558, 633008420, 634691000, 636336982, 638116717, 639743090, 641022623, 642247856, 644043803, 646747947, 650134802, 653936863, 658304095, 663559437, 669694364, 676148117, 682202458, 687664807, 692935050, 698298752, 703385592, 707528532, 710472822, 712516546, 713998318, 714881539, 714922607, 714264810, 713728964, 714145124, 715556145, 717336655, 718921244, 720262885, 721602321, 722913384, 723808110, 724106491, 724178493, 724545121, 725321233, 726160884, 726784825, 727378190, 728317618, 729662001, 731124222, 732428432, 733570933, 734760821, 736054718, 737192094, 737877011, 738092721, 738143325, 738374472, 738850653, 739430904, 740134954, 741210520]
1262.5G41210520J648426K183616K490819K603114K700507K901316L123760L175616
1278.8G62037694L034115K915502L010988L246725L326058L074110K644539K359986
1295.1G85649717K330243K260268J908481J421690J119435J121998J162827R64701
1311.4G97939360O07073M12047N61655Q21173Q60632P05659O38485P66814Q52465O73712
1331.8H04839075L15427Q1957P3552J18732J41800J08897P6592K25008L97980K92361
1352.2H06671381n1856l12507k43068j48773n27620j007557j020849q65162n42640
1370.6H01951349l96013q36671j134932j143515j475632j683533j082361l59297k01344
1388.9G93638051o9321j03652o54101j185895j524746j457095j318216j760841j907646
$$ y = [741210520, 742858946, 745042562, 747533381, 750136495, 752837002, 755738318, 758862078, 762037694, 765071809, 767987311, 770998299, 774245024, 777571082, 780645192, 783289731, 785649717, 787979960, 790240228, 792148709, 793570399, 794689834, 795811832, 796974659, 797939360, 798546433, 798958480, 799520135, 800341308, 801201940, 801907599, 802546084, 803312898, 804165363, 804839075, 805154502, 805236459, 805310011, 805428743, 805570543, 805679440, 805756032, 805981040, 806379020, 806671381, 806619525, 806307018, 806063950, 805915177, 805387557, 804380000, 803359151, 802493989, 801951349, 801555336, 800718665, 799583733, 798440218, 796964586, 795281053, 794198692, 793839395, 793638051, 793568730, 793465078, 792810977, 791625082, 790100336, 788643241, 787325025, 785564184, 783656538]
1407.3G83656538j545966j300395j013994o27518q30173j487792r77397l45349l24309
1425.7G75203645k63095k66254k682N46813N17309K25305N85437J012266J253664J389981
1446G80202389J345873J513719K059877K652645L142357L100753K747774K922237L301144
1464.4H02988768L430128L450334L717243M060984L677487K987922K448320J870811
1480.7H28631997J453817J337469J217484M24743o37949o18517m18127r38773j413405
1499.1H29038739j247763p89762j111746l210425l251851k178550j989603j893162
1515.4H13365877j662910j285672j892150k240658j673877j469254r30787r37938j875401
1533.7G99397230j288533j08659q46982j959443j444340q27193o5268L11077K91348
$$ y = [783656538, 782110572, 780810177, 779796183, 779168665, 778338492, 776850700, 775873303, 775527954, 775203645, 774940550, 774674296, 774671614, 775218427, 775735736, 775961041, 776546478, 777558744, 778812408, 780202389, 781548262, 783061981, 785121858, 787774503, 790916860, 794017613, 796765387, 799687624, 802988768, 806418896, 809869230, 813586473, 817647457, 821324944, 824312866, 826761186, 828631997, 830085814, 831423283, 832640767, 833065510, 832427561, 831809044, 831390917, 830452144, 829038739, 827790976, 827001214, 825889468, 822679043, 819427192, 817248642, 815259039, 813365877, 811702967, 810417295, 808525145, 806284487, 804610610, 803141356, 802210569, 801272631, 799397230, 798108697, 798000038, 797153056, 795193613, 793749273, 792922080, 792856812, 793167889, 793459237]
1552.1G93459237K87771M86016m74691j996935p87258o60240j170278j724541k445460
1570.5G84973621j965940k375662m686654m439652l172576l596008m324019m767179
1586.8G55645931m903972m827202m848003n269289n575895n383194n105257n000710
1603.1G14732409n000651n222917n538046n153478m271566m838765o433249m707813
1619.4F73565924l197193l834724l759802l361225l052235j713454q13663j277566
1635.7F52556062q08001O44386J685739K588212L433347L953337L777087M121363N225718
1654.1F77177250M835606M583895M802168N100190N419910N384386N614161N742014
1670.4G18659580N160272N417168O059945N821168N520642N585253O226897N885840
$$ y = [793459237, 793747008, 794233024, 793758333, 791761398, 790974140, 790313900, 789143622, 787419081, 784973621, 783007681, 780632019, 775945365, 771505713, 768333137, 764737129, 760413110, 755645931, 750741959, 745914757, 741066754, 735797465, 730221570, 724838376, 719733119, 714732409, 709731758, 704508841, 698970795, 693817317, 689545751, 684706986, 678273737, 673565924, 670368731, 666534007, 662774205, 659412980, 656360745, 654647291, 653833628, 652556062, 651748061, 652392447, 654078186, 656666398, 660099745, 664053082, 667830169, 671951532, 677177250, 682012856, 686596751, 691398919, 696499109, 701919019, 707303405, 712917566, 718659580, 723819852, 729237020, 735296965, 741118133, 746638775, 752224028, 758450925, 764336765]
1686.7G64336765N358100N306899M871548N188047N845368N783439N804777M729271
1703H07224214M064798M156411L842652L388822K944052K633512K535940K341330K045989
1721.4H35177720J696944J603365J915097K330840K173721J311243R07421J453400
1737.7H48569751J910507J906753J571000J379966J526952J585305J349449J078785
1754H60878468R17375R40680J082719J013219P94947O76215O61552P84754O95169M13835
1774.4H68858933L12508L97503N47767O15298M80831L47674M74632N29110L74913L27707
1794.8H73266876L40700K31862J56581K51532L95000L74317K00570Q7976J85073L44097
1815.2H75834584K92421J41203J71661L24548L76403K95758n96j72257J11520L25024
$$ y = [764336765, 769694865, 775001764, 779873312, 785061359, 790906727, 796690166, 802494943, 807224214, 811289012, 815445423, 819288075, 822676897, 825620949, 828254461, 830790401, 833131731, 835177720, 836874664, 838478029, 840393126, 842723966, 844897687, 846208930, 847116351, 848569751, 850480258, 852387011, 853958011, 855337977, 856864929, 858450234, 859799683, 860878468, 861795843, 862736523, 863819242, 864832461, 865627408, 866303623, 866965175, 867749929, 868445098, 868858933, 869171441, 869568944, 870116711, 870732009, 871212840, 871560514, 872035146, 872564256, 872939169, 873266876, 873607576, 873839438, 873996019, 874247551, 874642551, 875016868, 875217438, 875305414, 875490487, 875834584, 876127005, 876268208, 876439869, 876764417, 877140820, 877436578, 877435982, 877263725, 877375245, 877700269]
1835.6H77700269K87712K39491K10345K0385J6093J82510Q0406n5551j5378J33753
1856H78800035K41637J70707J79M7744K57253K34306j3053j31607j35124l6717J52469
1878.4H79587829K07484O3121q3327k4080R0956R6202L1471q9526j16169L2604J40249
1900.9H79936814N8711p6294r3103k0146N2273R9719M8578j17541j37627J2338J6749
1923.3H79780471j00612j73569j54316k9684N8473j2219j16945j11460m8459k3544
1943.7H79068136r1314k25365k63989j33813J6213K3246j21117k63631k16842j0073
1964.1H77781451O8009j28448l46184l05653o5803P6174n3107k67387k43246J371J43647
1986.5H76660824J1563k74241m19795k21312O6936N0366k22564l65198j88768N4777
$$ y = [877700269, 877987981, 878227472, 878437817, 878458202, 878474295, 878656805, 878737211, 878681660, 878666282, 878800035, 879041672, 879212379, 879212558, 879260302, 879517555, 879751861, 879738808, 879607201, 879472077, 879435360, 879587829, 879795313, 879858434, 879775107, 879751027, 879841983, 879938185, 879969656, 879880130, 879763961, 879796565, 879936814, 879995525, 879919231, 879826128, 879805982, 879858255, 879957974, 880006552, 879889011, 879751384, 879763722, 879780471, 879679859, 879506290, 879351974, 879322290, 879380763, 879368544, 879251599, 879140139, 879091680, 879068136, 878976822, 878751457, 878487468, 878353655, 878369868, 878393114, 878271997, 878008366, 877791524, 877781451, 877849460, 877721012, 877374828, 877069175, 877003372, 877079546, 877026439, 876759052, 876515806, 876517177, 876660824, 876672387, 876398146, 875978351, 875757039, 875823975, 875874341, 875651777, 875286579, 875097811, 875152588]
2006.9H75152588L4630k12073l45230k00629K0325N2273j52826l34978k47896O437
2027.3H73772621J07169q5950l16083k85924m8577J11818j7643k69055k82944o2704
2047.7H72622728J12057L1352k01881k69532r0539J04427Q9586j15276k26736q4400
2068.1H71971786R1374Q6904q4937k10822j07765R2387J40131m292j26302o9797N7518
2090.5H71836185R8527Q345j22786j10388N5671J61469R1433m6670j07467k9802J00553
2113H71935070J24216K9921p5459n1856R6976J78934Q9705m6790o7651K9921J43171
2135.4H72386158J25765q642m6492O9439J81795J60038K6703m9472K7776J24574J26123
2157.9H73123765N8234j0550J9073J38045J69634N4300m3809J0907J50502K03490R5070
$$ y = [875152588, 875187218, 874975145, 874629915, 874429286, 874449611, 874501884, 874349058, 874014080, 873766184, 873772621, 873879790, 873793840, 873477757, 873191833, 873143256, 873255074, 873237431, 872968376, 872685432, 872622728, 872734785, 872766137, 872564256, 872294724, 872204185, 872308612, 872398198, 872282922, 872056186, 871971786, 872063160, 872150064, 872065127, 871854305, 871746540, 871838927, 871979058, 871974766, 871848464, 871778667, 871836185, 871934712, 871943057, 871820271, 871709883, 871765554, 871927023, 872018456, 871971786, 871864319, 871834517, 871935070, 872059286, 872089207, 872013748, 871961892, 872058868, 872237802, 872327507, 872280717, 872213066, 872242987, 872386158, 872511923, 872503281, 872456789, 872526228, 872708023, 872868061, 872894764, 872845292, 872873068, 872997642, 873123765, 873181999, 873171449, 873190522, 873328567, 873498201, 873552501, 873508692, 873519599, 873670101, 873873591, 873968661]
2180.3H73968661m0770l7968P9334J72138J27673m828n6624L6359J39057J13249N782
2202.7H74502063n6446j0133Q0884P9632p987m1962K3186J07229R1553k7538r7096
2225.2H74643385m9948L4511O8009L7372p15j5378n544J9729r119q0705p9810k0326
2249.6H74541461Q703j7822o1989p6234n2095%J7166m0292o1214n007J4663n961J4723
2276.1H74276102P0571J13547R7216K9265m3213j11639j92643k45630k30194j87456
2296.5H73575926j91629k67685l46005m07695m84169n36859n48303n03361m57168o09398
2316.9H69223654r13560j040220q61824o09815n57482o14763n16176l82900m31895
2335.3H63295019m46022k94328o4730M20570J424492J840293O06835j338721k512037
$$ y = [873968661, 873927891, 873889923, 873969257, 874141395, 874269068, 874264240, 874207616, 874243975, 874383032, 874496281, 874502063, 874445617, 874435484, 874516368, 874596000, 874588013, 874546051, 874569237, 874676466, 874768019, 874740481, 874643385, 874593437, 874627948, 874695957, 874733329, 874732614, 874717236, 874711692, 874731421, 874722302, 874641597, 874561787, 874541461, 874550164, 874532342, 874470353, 874394119, 874342024, 874342024, 874359190, 874318898, 874257684, 874252677, 874267340, 874261379, 874276102, 874346673, 874460220, 874557436, 874586701, 874543488, 874431849, 874239206, 873993576, 873763382, 873575926, 873384297, 873116612, 872770607, 872362912, 871878743, 871341884, 870793581, 870290220, 869833052, 869223654, 868310094, 867269874, 866408050, 865798235, 865240753, 864625990, 864109814, 863726914, 863295019, 862848997, 862554669, 862489939, 862910509, 864335001, 866175294, 866782129, 865443408, 862931371]
2353.6H62931371k341390j572788o45399J48416P62224J373470J825452K038300K060592
2372H66580248J940608J777947J665354J618027J445473J035153N63384K32696J08481
2390.4H76967371J26242J13905K0742l8683n603Q1301J07169R417r1135o4910L5763
2412.8H77261579Q1956L7671m0055j04487j00553J371P7367O497j05441q1241M4823
2435.2H77079487R7096j3471j55747j44660J79R0658O497j09017q7499K5093R1613
2457.7H76880229K4616j28686j93536p0930P3731L9995j15097j89245q9943P2956P7546
2480.1H76381636j06573k38836j54615N3406J36375n1617k78711k14339L1233J33634
2500.5H75691593J4007j74940k07364m2975R5784K6584j75655k54273p1407J29521
$$ y = [862931371, 860589981, 859017193, 858371794, 858520210, 859282434, 860655904, 862481356, 864519656, 866580248, 868520856, 870298803, 871964157, 873582184, 875027657, 876062810, 876626194, 876858890, 876967371, 877093613, 877207518, 877228260, 877189577, 877183974, 877265275, 877372444, 877381861, 877290726, 877225816, 877261579, 877343535, 877381206, 877341151, 877236664, 877136111, 877137482, 877214849, 877221346, 877115905, 877034664, 877079487, 877176583, 877163112, 877007365, 876862705, 876862884, 876953542, 876960039, 876851022, 876763523, 876788616, 876880229, 876904845, 876776159, 876582623, 876511693, 876585424, 876625419, 876510322, 876321077, 876231134, 876304090, 876381636, 876275063, 876036227, 875881612, 875935018, 876071393, 876019776, 875741065, 875526726, 875557959, 875691593, 875705600, 875530660, 875323296, 875280321, 875376105, 875402689, 875227034, 874972761, 874901354, 875030875]
2520.9H75030875O3181j58012k45929r4294J17361J06216j37746l00646j58489J05858
2541.3H74328375J18673j24812k75433j52767R3698J61887k6465k16603j85371j8537
2561.7H73702645M0114q6188k41399k03907j3054N1260p7963k23636k57075j46687
2582.1H72544110j5140n7220k03252k20537j11461o0260j25826k19464k53737k06232
2602.5H71070981j15693p0273j56939k67327k38538j40667j02341j81198k99693l00347
2622.9H69197965k07067j27554j36971k38002k90155k31624j68800j52826j84656k58684
2643.3H67201626k74300j82927j17421j80543k85446k99692k03371j23680j70469k64645
2663.7H65099132k82407k22981j53184j35064j74761j92642j48952j31786k20000l37482
$$ y = [875030875, 875094056, 874936044, 874690115, 874595821, 874713182, 874819398, 874681652, 874381006, 874222517, 874328375, 874447048, 874322236, 874046803, 873894036, 873987734, 874149621, 874123156, 873906553, 873721182, 873702645, 873742759, 873656571, 873415172, 873211265, 873198211, 873249471, 873171508, 872947872, 872690797, 872544110, 872528970, 872471750, 872268498, 872047961, 871936500, 871876240, 871750414, 871530950, 871277213, 871070981, 870955288, 870885015, 870728076, 870460749, 870222211, 870081544, 869979203, 869798005, 869498312, 869197965, 868990898, 868863344, 868726373, 868488371, 868198216, 867966592, 867797792, 867644966, 867460310, 867201626, 866927326, 866744399, 866626978, 866446435, 866160989, 865861297, 865657926, 865534246, 865363777, 865099132, 864816725, 864593744, 864440560, 864305496, 864130735, 863938093, 863789141, 863657355, 863437355, 863099873]
2684.1H63099873l70741k83480j33574p9333j89007l21149l13759k14160j77562k34604
2704.5H60782504l10540l19123k42949j60158j82032k97904l50476k66432j66297j57595
2724.8H58328998k55287l76045l44634k36988k23101k54809k98918l01778k08259j16527
2745.2H55712652j31905k61009l70502l55780k92361k66731k85268k98559k90573k93434
2765.6H52866530k91049k76148k82109l07441l52621l77953l65615l98517m44710l85225
2786H49385142k70843k89977m43339n26548m79877m29034m60446n54263o33180n90444
2806.4H44707191m49777m31895o05166p51912p32422o19471n41211n62667o96838q35538
2826.8H38480294q05557o81818o97076q60631j039327j292824j613558j874327k135635
$$ y = [863099873, 862729132, 862445652, 862312078, 862232745, 862043738, 861722589, 861408830, 861194670, 861017108, 860782504, 860471964, 860152841, 859909892, 859749734, 859567702, 859269798, 858919322, 858652890, 858486593, 858328998, 858073711, 857697666, 857353032, 857116044, 856892943, 856638134, 856339216, 856037438, 855829179, 855712652, 855580747, 855319738, 854949236, 854593456, 854301095, 854034364, 853749096, 853450537, 853159964, 852866530, 852575481, 852299333, 852017224, 851709783, 851357162, 850979209, 850613594, 850215077, 849770367, 849385142, 849114299, 848824322, 848380983, 847854435, 847374558, 846945524, 846485078, 845930815, 845297635, 844707191, 844257414, 843825519, 843220353, 842468441, 841736019, 841116548, 840575337, 840012670, 839315832, 838480294, 837674737, 836992919, 836295843, 835435212, 834395885, 833103061, 831489503, 829615176, 827479541]
2845.2H27479541k286911k067208j522839r71794o54936n13911m57526n09262o61432
2863.5H17833722r18866j224160j299321j065374r03904r78172r90689q37803o96540
2881.9H08918893o64889p42078r00030j005531r42170q51989r43959j158237j229287
2900.2H00480723j132249j092911j196921j379669j589238j815856j978636j979828
2916.6G88315415j844167j606644j209974p03811k41638M1664O0856Q7560L76939P59363
2937G84035563J055778J264512J355887J212596Q50201N10395L31342R1255j83642
2955.3G90523887j43648J35839L38853L50058L12686M04656N65469O57857N76675L77416
2975.7G94099748L31402L95119K88487J04904N0366J36494K97964K89738j3530k77102
$$ y = [827479541, 825192630, 823125422, 821602583, 820630789, 819975853, 819461942, 819004416, 818495154, 817833722, 816914856, 815690696, 814391375, 813326001, 812422097, 811443925, 810453236, 809615433, 808918893, 808254004, 807511926, 806611896, 805606365, 804664195, 803812206, 802868247, 801710010, 800480723, 799348474, 798255563, 797058642, 795678973, 794089735, 792273879, 790295243, 788315415, 786471248, 784864604, 783654630, 782950819, 782709181, 782750845, 782811701, 782899261, 783276200, 784035563, 785091341, 786355853, 787711740, 788924336, 789774537, 790284932, 790616274, 790707529, 790523887, 790380239, 790516078, 790854931, 791204989, 791517675, 791922331, 792487800, 793145657, 793722332, 794099748, 794431150, 794826269, 795114756, 795219660, 795270026, 795406520, 795704484, 795994222, 795980692, 795703590]
2996.1G95703590l91245m91202m92692n02169o07789n64813l60310l08335n50568q69751
3016.5G90564716j020908j019955r32872q64983r16183r15349q04960p64609r48667
3034.9G82376230j199365j140058r43482r88424j199066j348675j330793j275301j270234
3053.2G71680832j226068j263976j398623j373052j194179j058758j132369j363754
3069.5G61670053j464844j325011j026392q63016j119434j445115j463533j383781
3085.8G51578927j332104j337528j508058j621842j471579j247764j273095j545787
3102.2G40241170j658142j461327j323223j492560j599610j440823j407325j566470
3118.5G28291690j803755k064944k111017j920164j685679j678348j909017j976609
$$ y = [795703590, 795312345, 794821143, 794328451, 793826282, 793218493, 792653680, 792293370, 791985035, 791434467, 790564716, 789543808, 788523853, 787590981, 786725998, 785809815, 784894466, 784089506, 783324897, 782376230, 781176865, 780036807, 779093325, 778104901, 776905835, 775557160, 774226367, 772951066, 771680832, 770454764, 769190788, 767792165, 766419113, 765224934, 764166176, 763033807, 761670053, 760205209, 758880198, 757853806, 756990790, 755871356, 754426241, 752962708, 751578927, 750246823, 748909295, 747401237, 745779395, 744307816, 743060052, 741786957, 740241170, 738583028, 737121701, 735798478, 734305918, 732706308, 731265485, 729858160, 728291690, 726487935, 724422991, 722311974, 720391810, 718706131, 717027783, 715118766, 713142157]
3134.8G13142157j796961j729191j949966k180933k207160k103448j903534j800716
3151.1F97470248k047420k376616k391755k237678k158999k174139k283037k384782
3167.4F79415822k359629k271711k252996k339244k460242k455055k328575k292037
3183.7F60656333k392471k459288k442181k428114k423823k471566k550006k511978
3200.1F40976906k393782k347231k365172k399802k427757k392113k304435k242208
3216.4F22104406k292513k387643k368987k260983k209663k209127k110243k007008
3232.7F04258239k110004k233029k192676k113282k009511j839459j772583j911461
3249E88076234j986802j853585j728177j739085j791477j790881j753867j666903j509846
$$ y = [713142157, 711345196, 709616005, 707666039, 705485106, 703277946, 701174498, 699270964, 697470248, 695422828, 693046212, 690654457, 688416779, 686257780, 684083641, 681800604, 679415822, 677056193, 674784482, 672531486, 670192242, 667732000, 665276945, 662948370, 660656333, 658263862, 655804574, 653362393, 650934279, 648510456, 646038890, 643488884, 640976906, 638583124, 636235893, 633870721, 631470919, 629043162, 626651049, 624346614, 622104406, 619811893, 617424250, 615055263, 612794280, 610584617, 608375490, 606265247, 604258239, 602148235, 599915206, 597722530, 595609248, 593599737, 591760278, 589987695, 588076234, 586089432, 584235847, 582507670, 580768585, 578977108, 577186227, 575432360, 573765457, 572255611]
3267.4E72255611j421094j615762j895488j933872j866222j818001j778603j786589
3283.7E58139980j805484j771331j688242j713217j876413k017856k117932k103209
3300E43046296j898229j727105j825213k148450k439796k507806k414346k328694k299666
3318.4E23456991k266646k172947k140224k358615k580583k512217k353370k235234
3334.7E04837155k163529k288878k489835k541304k553105k480656k250671k275974
3351D85793203k580523k651662k433091k252698k267123k276837k042532j886845k137840
3369.3D65264052k464831k390980j990259j725376j676321j695245j636803j415730
3385.7D50268507j053423p02083p85649j159399j145691o69003l55184o82354j110345
$$ y = [572255611, 570834517, 569218755, 567323267, 565389395, 563523173, 561705172, 559926569, 558139980, 556334496, 554563165, 552874923, 551161706, 549285293, 547267437, 545149505, 543046296, 541148067, 539420962, 537595749, 535447299, 533007503, 530499697, 528085351, 525756657, 523456991, 521190345, 519017398, 516877174, 514518559, 511937976, 509425759, 507072389, 504837155, 502673626, 500384748, 497894913, 495353609, 492800504, 490319848, 488069177, 485793203, 483212680, 480561018, 478127927, 475875229, 473608106, 471331269, 469288737, 467401892, 465264052, 462799221, 460408241, 458417982, 456692606, 455016285, 453321040, 451684237, 450268507, 449215084, 448513001, 447727352, 446567953, 445422262, 444753259, 444398075, 443715721, 442605376]
3404D42605376r06408m42922k79396l16650l92616l76016j57475L3170Q6307K40714
3424.4D40094084N58614P95365P40945P63893R84758Q91298O07223O77675J032203
3442.8D47146058J304239J378626J406908J568109J712858J784772J957416K161980
3459.1D60420966K099633K043367K352744K544493K239108J821279J822740K149969
3475.4D77494299K526045K620161K330392K276987K540142K506464K362013K570361
3491.7D97226864K825588K855063K727210K701044K736211K545357K397656K566636
3508E18581629K853036L104627L069579K795041K820551L154636L437161L287435K879023
3526.4E45982718K810777L106713L432453L620445L524661L341258L604054L951848
$$ y = [442605376, 441698968, 441256046, 440976650, 440660000, 440267384, 439891368, 439733893, 439767063, 439853370, 440094084, 440652698, 441448063, 442189008, 442952901, 443937659, 444828957, 445436180, 446113855, 447146058, 448450297, 449828923, 451235831, 452803940, 454516798, 456301570, 458258986, 460420966, 462520599, 464563966, 466916710, 469461203, 471700311, 473521590, 475344330, 477494299, 480020344, 482640505, 484970897, 487247884, 489788026, 492294490, 494656503, 497226864, 500052452, 502907515, 505634725, 508335769, 511071980, 513617337, 516014993, 518581629, 521434665, 524539292, 527608871, 530403912, 533224463, 536379099, 539816260, 543103695, 545982718, 548793495, 551900208, 555332661, 558953106, 562477767, 565819025, 569423079, 573374927]
3542.7E73374927L801763L404677L385484L535450L569424L700852L924966M106701
3559F02804244M166662M062116L844560M028856M431844M315138M161775M375458M626691
3577.4F40817344M809499N017042N030215M690468M379869M682243M906177M822672
3593.7F79155529M884183N081594N063593M973770M992127M834354M813909N014599
3610G18813658M984975M916310M707694M413009M626929M697800M392982L954887L705978
3628.4G59214222M330993M438400M012943L797531L725290L702760L689289L509402
3644.7G90420830L000498K590120K909958L032387K548158K459764K680660K381742
3661H12024117J991510J963317J727879J245857J633882J665235P49171R63985J557053
$$ y = [573374927, 577176690, 580581367, 583966851, 587502301, 591071725, 594772577, 598697543, 602804244, 606970906, 611033022, 614877582, 618906438, 623338282, 627653420, 631815195, 636190653, 640817344, 645626843, 650643885, 655674100, 660364568, 664744437, 669426680, 674332857, 679155529, 684039712, 689121306, 694184899, 699158669, 704150796, 708985150, 713799059, 718813658, 723798633, 728714943, 733422637, 737835646, 742462575, 747160375, 751553357, 755508244, 759214222, 763545215, 767983615, 771996558, 775794089, 779519379, 783222139, 786911428, 790420830, 793421328, 796011448, 798921406, 801953793, 804501951, 806961715, 809642375, 812024117, 814015627, 815978944, 817706823, 818952680, 820586562, 822251797, 823000968, 823964953, 825522006]
3679.4H25522006J528859J518249J491547J177847O41465O88732J065970J072526Q60512
3697.7H35567713N75900M51088P63655R79840P58708K69949J79172Q03470R16362N29111
3718.1H41794968K94923K94686J88052J18077M39048O49452N25594K21312K16842P33733
3738.5H45476687P87854J0908l60668M54784K48968m94242J45436Q84771N84424M053
3758.9H47742975M7385L08097K73347J50323r4474p5042K78711M60327L54409L7432
3779.3H49483490p8440k920P9870K24531K29299J32978Q8095J53244L20196k8670m53114
3801.7H50148559K3126J15574J7166L76343L96610j9491j31249K24173j85609m11332
3822.1H50553870J87338K69651J50740J03474J43468L11077J6570m57764k61545k801
$$ y = [825522006, 827050865, 828569114, 830060661, 831238508, 831879973, 832568705, 833634675, 834707201, 835567713, 836143613, 836594701, 837358356, 838338196, 839096904, 839366853, 839546025, 840349495, 841265857, 841794968, 842089891, 842384577, 842572629, 842690706, 843129754, 843779206, 844304800, 844526112, 844742954, 845476687, 846264541, 846275449, 845914781, 846369565, 846618533, 846124291, 846269727, 847154498, 847738922, 847742975, 847790360, 848098457, 848371804, 848522127, 848427653, 848352611, 848631322, 849091649, 849446058, 849483490, 849405050, 849402130, 849482000, 849706531, 849935830, 850068808, 850156903, 850310147, 850630343, 850601673, 850148559, 850171685, 850287259, 850304425, 850680768, 851077378, 851057887, 850926638, 851150811, 850965202, 850553870, 850741208, 851010859, 851161599, 851265073, 851408541, 851719618, 851736188, 851278424, 851016879, 851014078]
3842.5H51014078J80483M49001M59493j01984j222730p88688O63936O93679K56657
3860.9H51603925j29998j13964J32382r4592k03848k9087J10745K02835o0141m2022
3881.3H51376235J78695J371K1398o0379k86818N2154L44575Q4161k61664l76642k75969
3903.7H50797117N6743K80202J80423N1320K8193n6327j31309K6405R8527n0128K921
3926.1H51284087J49429K6881j30594n0306M7863P9631N5671q0943p3314K4498o020
3948.6H51326883j1563Q463j4662M708L4571J2696K4497L279m3631N6982J10149N97
3973.1H51512969j4365M4048M7683P9275Q2075Q166j6511J5855L6121L6478l278m0651
3997.5H51787865
$$ y = [851014078, 851194561, 851643562, 852103055, 852001071, 850778341, 849989653, 850653589, 851347268, 851603925, 851473927, 851359963, 851492345, 851397753, 851193905, 851164818, 851275563, 851478398, 851418257, 851376235, 851554930, 851556301, 851577699, 851517320, 851230502, 851282656, 851627231, 851711392, 851449728, 851073086, 850797117, 850853860, 851134062, 851314485, 851365805, 851393998, 851337671, 851206362, 851232767, 851331294, 851281166, 851284087, 851433516, 851460397, 851329803, 851279497, 851327360, 851406991, 851462662, 851381719, 851308405, 851332903, 851326883, 851315320, 851323783, 851309121, 851313829, 851348400, 851361096, 851385593, 851388872, 851345241, 851402223, 851512372, 851512969, 851498604, 851542652, 851590335, 851669610, 851751685, 851759851, 851743340, 851759195, 851795316, 851831794, 851828516, 851787865]
##END=$$ End of the data block
