##TITLE=$$ Begin of the data block
##JCAMP-DX=5.00 $$ ACD/SpecManager v 10.08
##SPECTROMETER/DATA SYSTEM=Alpha
##DATE=09 Apr 2014 11:14:46
##DATA TYPE=INFRARED SPECTRUM
##DATA CLASS=XYDATA
##ORIGIN=
##OWNER=
##NPOINTS=1765
##FIRSTX=399.75695801
##LASTX=3997.56933594
##MAXX=3997.56933594
##MINX=399.75695801
##MAXY=0.88001794
##MINY=0.43968940
##XFACTOR=1.0000000000
##YFACTOR=1.000000000000000e-9
##FIRSTY=0.75831270
##DELTAX=2.03957629
##XUNITS=1/CM
##YUNITS=ARBITRARY UNITS
##XYDATA=(X++(Y..Y))
399.8 758312702 756583691 752424955 748614788 748128414 750326514 751163244 748653173 746149600 747327149
418.1 747327149 750197470 749942720 747032106 743885517 743067682 744300783 744556546 742471159 740187883
436.5 740187883 740214467 742022872 742782772 740986943 738641977 738271594 739778340 740562141 739173114
454.8 739173114 737191916 736822903 738046527 738344610 736271799 733681381 733205736 734702528 735191405
473.2 735191405 733029246 730348587 729809999 731588900 732942820 731586933 729056597 728361607 729827642
491.5 729827642 730747342 729006886 726081014 724985242 726231992 727173030 725687027 723020971 722080469
509.9 722080469 723321974 724083543 722481251 719794393 718597889 719302297 719738185 717944145 715055346
528.3 715055346 713739097 714384019 715003729 713885367 711638093 710410178 711077332 711918354 710973501
546.6 710973501 708795965 707539558 707835257 708155870 707145572 705229819 703937292 703838825 703758180
565 703758180 702522695 700372040 698568463 697831571 697338402 695952237 693851471 692074299 691355050
583.3 691355050 691308141 690721512 689121485 687391102 686620176 686587214 686054647 684389114 682268322
601.7 682268322 680761695 680072010 679511786 678472221 677207589 676615715 677165508 678544402 680100083
620 680100083 681755841 684260786 687714875 691039443 693350613 694934607 696731329 699222863 701774895
638.4 701774895 703254938 703512549 703836977 705381691 707646728 709150612 709302783 709271073 710773230
656.7 710773230 713938773 717098057 719281912 720681071 721811593 724209607 727113783 728972197
673.1 728972197 730488479 732502759 734698057 736305237 737308323 738470793 740190923 742009223
689.4 742009223 743232727 743737876 744224608 745194077 746349454 747256935 747944534 748791277 750088692
707.7 750088692 751654923 752997577 754058301 755251527 756750405 758371592 759882033 761131167
724 761131167 762340069 763855398 765498579 766798198 767760634 768775642 769927084 771039903 772002220
742.4 772002220 772892714 773947060 775244653 776621938 777904689 779003322 780013621 781172454 782481492
760.8 782481492 783643723 784500539 785258949 786126077 786977768 787459910 787444592 787224650 787101090 787011266
781.2 787011266 786666453 786069214 785724103 786073804 787062764 788455665 790212870 792532563 795517504
799.5 795517504 798882127 802046359 804584324 806697249 808875382 811121106 812908709 813836694 814099312
817.9 814099312 814233959 814333975 813917756 812548101 810379803 808184326 806475520 804875791 802816749
836.2 802816749 800440490 798427761 797133148 796168089 795072675 794190407 794456899 796459436 799837768
854.6 799837768 803679526 807586849 811875880 816728890 821618915 825653195 828523636 830826104
870.9 830826104 833267272 835687041 837271690 837792635 837823510 837883174 837831259 837089539 835552335 833887756
891.3 833887756 832834065 832568586 832719028 832898080 833237469 834151566 835576832 836854815 837369263
909.6 837369263 837086260 836413324 835565388 834341526 832570016 830516875 828802586 827898681 827768683
928 827768683 828027487 828282893 828433931 828692615 829167604 829558372 829480052 828956723 828371704 827924609
948.4 827924609 827251077 825752556 823263943 820215046 817070127 813669086 809258521 803379476 796493530
966.8 796493530 789375901 782264829 774860799 767121971 759847045 754039228 749728382 745880425
983.1 745880425 741651177 737395167 734087229 732020617 730455577 728519142 726324022 724817514
999.4 724817514 724411309 724250853 723076999 720652819 717878103 715390027 712697387 709001899 704517901
1017.7 704517901 700425148 697424054 694916070 691867709 688126683 684572995 682003856 680183709
1034.1 680183709 678228736 675789356 673534393 672158837 671317577 670023620 667861164 665495217
1050.4 665495217 663935304 663442731 663411856 663366258 663572907 664422095 665481508 665630758 664225936
1068.7 664225936 661749780 659210086 657097042 655065715 652611971 649852037 647316158 645100236
1085 645100236 642704964 639728427 636424720 633635521 632030129 631480396 631356478 631181300 631010175
1103.4 631010175 631086767 631325126 631318867 630762517 629771709 628563583 626876414 624169350 620672584
1121.8 620672584 617784441 616499782 616600931 618013978 620149136 621722579 622992873 625063062
1138.1 625063062 627928436 630766034 632981837 634678900 636323571 638093710 639728904 641012907
1154.4 641012907 642240584 644039631 646727562 650083303 653845251 658189356 663453221 669579327
1170.7 669579327 675986886 682000875 687456965 692748249 698144853 703252375 707390904 710318506
1187 710318506 712359190 713860750 714747190 714764953 714098334 713569283 713983238 715385914 717147946
1205.4 717147946 718699455 720043361 721403301 722697079 723601341 723952889 724049151 724400878 725162029
1223.7 725162029 726020634 726668894 727246821 728165150 729550302 731089115 732428908 733566403 734736919
1242.1 734736919 736005723 737135828 737841904 738097548 738186300 738433540 738915026 739495337 740166128
1260.4 740166128 741189778 742814302 744997084 747479200 750049412 752719641 755625784 758758605
1276.8 758758605 761936069 764983892 767901957 770895839 774125338 777431309 780480981 783128798
1293.1 783128798 785517156 787860692 790112555 791999996 793417692 794571638 795718968 796903849
1309.4 796903849 797909617 798519313 798901320 799455345 800292313 801161408 801851749 802474558 803255796
1327.8 803255796 804137230 804810643 805109203 805192590 805269599 805365741 805492699 805633664 805732310 805927277
1348.1 805927277 806316435 806648672 806613386 806274951 806019425 805891037 805382252 804367483 803325355
1366.5 803325355 802457869 801933765 801536679 800685227 799543142 798388481 796911597 795241296 794148862
1384.9 794148862 793759584 793571770 793532550 793424010 792766929 791607916 790103316 788637757 787294269
1403.2 787294269 785547733 783705175 782201052 780902147 779860079 779156446 778254271 776780963 775846899
1421.6 775846899 775508821 775178730 774912715 774632514 774607360 775146604 775670528 775917530 776540279 777576447
1442 777576447 778810561 780151784 781458139 782944441 784976125 787587643 790671110 793791056 796626806
1460.3 796626806 799602747 802923858 806351781 809782684 813461840 817476034 821163177 824199915
1476.6 824199915 826671660 828550100 830015123 831349671 832551897 832973480 832351208 831746042 831321120
1495 831321120 830350339 828908026 827665746 826886058 825761497 822562277 819367170 817219675 815226436
1513.4 815226436 813310206 811622143 810310781 808410943 806195676 804544389 803112268 802223980
1529.7 802223980 801269472 799334466 798031151 797940910 797112107 795162797 793721437 792911172 792855799
1548 792855799 793160319 793463111 793753207 794165730 793626130 791741073 791028619 790380239 789225161 787511051
1568.4 787511051 785071135 783081353 780641139 775946915 771574736 768448412 764887094 760587096
1584.7 760587096 755810320 750891030 746047080 741151452 735841095 730263948 724873483 719737768
1601.1 719737768 714721978 709725797 704504013 698972702 693838954 689553857 684649765 678195238
1617.4 678195238 673529446 670337915 666472852 662703693 659352005 656301081 654572785 653717875
1633.7 653717875 652392685 651590824 652278185 654011369 656619847 660040259 663999200 667786360 671865404
1652 671865404 677066028 681952953 686576068 691401184 696520686 701952040 707342446 712977052 718767405
1670.4 718767405 723947465 729343891 735391319 741197050 746678352 752229333 758476317 764390349
1686.7 764390349 769733787 775020301 779875398 785029471 790811956 796508074 802304804 807105601
1703 807105601 811200917 815365016 819246829 822687268 825643718 828224063 830712795 833092034 835191727
1721.4 835191727 836922884 838533103 840422273 842711151 844841421 846156120 847142875 848648727
1737.7 848648727 850520670 852340460 853879213 855270207 856781900 858362019 859766364 860885382
1754 860885382 861808181 862756073 863845527 864856005 865642428 866307974 866974652 867754877 868403852 868799686
1774.4 868799686 869125783 869529366 870106041 870760381 871234953 871551633 871981621 872450769 872820675 873189747
1794.8 873189747 873546600 873769879 873943090 874242008 874659896 875031710 875223100 875310898 875523210 875884354
1815.2 875884354 876162708 876286089 876426935 876708031 877063632 877370238 877401233 877253592 877366781 877674997
1835.6 877674997 877934992 878150582 878343999 878358424 878385901 878603101 878740847 878715396 878687382 878811955
1856 878811955 879053712 879229128 879230857 879256606 879474044 879663348 879626691 879510522 879428804 879460037 879634559
1878.4 879634559 879797041 879815042 879741013 879743576 879848719 879961252 880004048 879910111 879779696 879805386 879953563
1900.9 879953563 880017936 879938245 879835486 879795969 879835248 879931092 879961789 879816473 879684627 879745305 879790962
1923.3 879790962 879670322 879468620 879305542 879283249 879356623 879360318 879256904 879133940 879037917 878993750 878930569
1945.7 878930569 878720045 878443122 878298700 878316343 878335357 878196597 877935290 877759397 877782643 877835512
1966.1 877835512 877672255 877313912 877022386 876982212 877081454 877041817 876758575 876463294 876430690 876587570
1986.5 876587570 876630068 876389742 876009881 875803888 875841379 875866115 875653207 875304997 875115275 875154614
2006.9 875154614 875184476 874991119 874685228 874518216 874531031 874544621 874345362 873964965 873708427 873741686
2027.3 873741686 873859107 873753309 873405933 873104632 873075068 873215616 873215258 872954547 872680008 872640371
2047.7 872640371 872765183 872774661 872549653 872280777 872204304 872320235 872418582 872301519 872040570 871928632
2068.1 871928632 872041643 872139812 872030616 871830285 871770322 871876538 871986330 871954560 871817887 871737719
2088.5 871737719 871784508 871888578 871912777 871789277 871664584 871720374 871903121 872007847 871965349 871888220
2108.9 871888220 871901989 872004688 872089028 872093976 872028470 871995151 872096658 872260571 872329295 872275293 872232616
2131.3 872232616 872307360 872455716 872541547 872513473 872474611 872535408 872698843 872849524 872874796 872835338 872881711
2153.8 872881711 873032570 873175204 873218298 873180389 873178422 873311043 873508215 873607874 873582661 873576760 873713970
2176.2 873713970 873920023 874015570 873974264 873947918 874038696 874202073 874330521 874344051 874289215 874313295 874439120
2198.6 874439120 874538064 874539435 874480844 874453306 874535680 874652445 874669909 874607921 874582589 874641776 874714792
2221.1 874714792 874714315 874646127 874601662 874650896 874745011 874791682 874778330 874740243 874719560 874742925 874750972 874688089
2245.6 874688089 874616921 874601960 874605775 874574602 874511361 874442577 874407470 874421597 874423504 874364495 874302983 874290049
2270 874290049 874300659 874320447 874364257 874441743 874549627 874631464 874616146 874515831 874377787 874208808 874020636
2292.5 874020636 873826683 873607516 873334169 873016298 872702360 872359037 871901274 871341586 870768964 870278001
2312.9 870278001 869830072 869211793 868328393 867338479 866467476 865800023 865184963 864506543 863946736 863587618
2333.3 863587618 863193631 862750292 862436295 862338126 862753630 864233732 866120636 866715252 865357697
2351.6 865357697 862835407 860427976 858766735 858075082 858278751 859120190 860435724 862185657 864242554
2370 864242554 866352081 868350625 870226085 871982634 873610675 875016212 876038730 876619518 876869678
2388.3 876869678 876988947 877108037 877205908 877227724 877196014 877172589 877219200 877327085 877386510 877339721 877269089
2410.8 877269089 877275348 877358317 877406657 877336025 877209961 877145290 877188385 877265036 877256095 877165675 877106786 877136946
2435.2 877136946 877192259 877164781 877032340 876904547 876903653 876995564 877016723 876908004 876780987 876761436 876836121
2457.7 876836121 876864970 876747489 876556635 876485705 876574397 876629651 876532853 876358986 876248717 876282811 876347184
2480.1 876347184 876259446 876035213 875892639 875968575 876094937 876014233 875744224 875561297 875613868 875739634
2500.5 875739634 875712395 875494897 875265241 875223041 875346720 875394702 875214756 874985874 874960721 875094950
2520.9 875094950 875158906 875024676 874771297 874622226 874681234 874763072 874632895 874362707 874238551 874343812
2541.3 874343812 874460638 874383211 874159455 874011099 874058783 874147117 874071419 873854935 873678088 873674214 873763323
2563.7 873763323 873711288 873464465 873252332 873225093 873252690 873165548 872972667 872787118 872692585 872668862 872572184
2586.2 872572184 872322917 872057498 871927500 871892810 871806920 871577144 871277809 871062756 870956421 870872319
2606.6 870872319 870717883 870480776 870254636 870102763 869989395 869810879 869516850 869231641 869067013 868949592
2626.9 868949592 868754148 868456185 868154526 867938161 867789090 867652059 867476165 867239952 866986096 866784871
2647.3 866784871 866645753 866470575 866166711 865800083 865555704 865478218 865382791 865141749 864845753 864632189
2667.7 864632189 864517748 864400804 864216566 864010930 863811553 863595605 863333583 863021374 862728417 862539351
2688.1 862539351 862434387 862295985 862059355 861743510 861432374 861210167 861039579 860817373 860511780 860195994
2708.5 860195994 859922647 859694719 859483302 859217465 858920813 858692884 858546972 858413160 858177185 857794225
2728.9 857794225 857439399 857209027 856977522 856714547 856454194 856194675 855988801 855862200 855706871 855414152
2749.3 855414152 855029225 854680717 854406595 854134023 853829920 853513062 853192747 852883577 852595091 852313340
2769.7 852313340 852025807 851729035 851401448 851045370 850666821 850252509 849822998 849433422 849122226 848815680
2790.1 848815680 848418355 847963810 847535729 847116351 846607149 845997989 845359206 844791055 844365060 843951225
2810.5 843951225 843341589 842551112 841783583 841169596 840660512 840111375 839396536 838561535 837773800 837075293
2830.9 837075293 836346090 835477054 834440768 833170235 831585765 829713285 827569902 825246572 823129833
2849.3 823129833 821632504 820720792 820052147 819481492 819024205 818570137 817932785 816976964 815723360
2867.6 815723360 814453423 813445568 812562466 811563969 810582399 809788823 809118986 808456898 807688653
2886 807688653 806763828 805764139 804808021 803915203 802952647 801797032 800558865 799422920 798331201
2904.3 798331201 797101438 795687020 794111967 792349219 790413678 788443387 786585987 784961998
2920.6 784961998 783755898 783061624 782817960 782867193 782931089 783003092 783386409 784176767 785256624 786554694
2941 786554694 787937641 789098024 789845765 790314138 790668488 790784299 790621221 790520191 790704608 791055799
2961.4 791055799 791388392 791699827 792138815 792725086 793345690 793873549 794238806 794600904 795063317 795405030
2981.8 795405030 795516193 795541227 795643806 795944452 796249807 796192586 795848429 795442641 795000732 794573188
3002.2 794573188 794079900 793438971 792860031 792505980 792212546 791670382 790779412 789717197 788686931
3020.6 788686931 787801147 786958039 785991669 785028279 784216821 783454776 782503545 781319857 780215859
3038.9 780215859 779306233 778339386 777148068 775803924 774471939 773186922 771929085 770738363 769497395
3057.3 769497395 768099904 766710460 765504897 764471591 763376713 762016177 760543704 759246647
3073.6 759246647 758250058 757371187 756219149 754741669 753221035 751793206 750465810 749145210 747649133
3092 747649133 746034980 744572103 743334949 742045343 740467608 738806486 737377644 736084223 734581590
3110.3 734581590 732939005 731467426 730078459 728548646 726758659 724701285 722600520 720671117
3126.6 720671117 718960464 717256367 715328038 713354349 711567342 709823966 707848549 705698073
3143 705698073 703597426 701563656 699626744 697778225 695734203 693356872 690914273 688610017 686431050
3161.3 686431050 684302151 682064116 679695070 677334309 675039649 672782481 670473099 668037713
3177.6 668037713 665582240 663233876 660937786 658570647 656107843 653612673 651156723 648757577
3193.9 648757577 646314025 643784106 641289115 638886511 636525333 634165525 631754637 629304707
3210.3 629304707 626914859 624629676 622406840 620099902 617679238 615319729 613085210 610887766
3226.6 610887766 608681858 606533289 604454160 602297723 600072384 597905159 595792949 593770266
3242.9 593770266 591911852 590124309 588217139 586232781 584363997 582632244 580905735 579118788
3259.2 579118788 577339351 575606346 573922753 572330356 570848227 569291055 567467451 565486312
3275.5 565486312 563558996 561778843 560043514 558239043 556417823 554645658 552955091 551300168
3291.8 551300168 549507499 547486544 545311272 543146908 541191101 539454222 537645340 535460472
3308.2 535460472 532951772 530461729 528166950 525934100 523646951 521352589 519142389 516967475
3324.5 516967475 514595151 512026072 509520531 507156909 504902780 502714694 500423372 497933418
3340.8 497933418 495353609 492770314 490304679 488072962 485785514 483159840 480466396 478037655
3357.1 478037655 475787193 473482430 471180707 469167650 467371941 465320408 462841272 460363448
3373.4 460363448 458302051 456546694 454861403 453162551 451526523 450123161 449097782 448423386
3389.7 448423386 447660089 446500003 445339561 444685996 444333434 443612844 442480147 441587359 441151887
3408.1 441151887 440879971 440611064 440255284 439860135 439689398 439724565 439781129 440004468 440575570 441387713
3428.5 441387713 442171037 442958176 443914801 444813371 445457190 446124583 447145849 448461652 449838042
3446.8 449838042 451242447 452816695 454532862 456322759 458305418 460507005 462619931 464633197
3463.2 464633197 466990143 469630063 471949816 473739713 475481212 477587253 480113298 482741594
3479.5 482741594 485062689 487336695 489907891 492450684 494821936 497374952 500182450 503044367
3495.8 503044367 505763590 508419812 511143386 513765216 516275764 518875301 521665573 524678171
3512.1 524678171 527687669 530520380 533434212 536609650 540001631 543280840 546193361 549036026
3528.4 549036026 552174151 555591404 559149325 562685072 566105604 569750667 573718190 577524722
3544.7 577524722 580884457 584190488 587677062 591280460 595060349 599047422 603217423 607429564
3561.1 607429564 611463964 615240455 619225800 623677015 628062427 632265270 636621118 641237319
3577.4 641237319 646057189 651058316 656077266 660790741 665195525 669895947 674783349 679569364
3593.7 679569364 684478939 689602315 694672883 699615180 704545975 709360242 714211822 719240963
3610 719240963 724172771 729041338 733773708 738218069 742829561 747528911 751954138 755902290 759595692
3628.4 759595692 764020264 768491864 772431910 776205957 779968560 783678770 787337005 790836394
3644.7 790836394 793858528 796473205 799426556 802475929 804979205 807390928 810059845 812427342
3661 812427342 814398825 816344738 818095088 819377363 820919037 822474897 823221922 824209094 825754285
3679.4 825754285 827288926 828887284 830410659 831455946 831978381 832686722 833819866 834952533 835808933
3697.7 835808933 836353719 836800754 837575912 838562489 839313507 839606166 839843273 840680003 841570616 842005551
3718.1 842005551 842185199 842413247 842612743 842773080 843240559 843916953 844465315 844696045 844930828 845659018
3738.5 845659018 846388757 846321404 845956087 846498966 846752763 846152902 846261859 847186327 847820044 847895145
3758.9 847895145 848009467 848353207 848627090 848737955 848605990 848534703 848836780 849286973 849608421 849646509
3779.3 849646509 849583447 849590719 849715710 849981010 850201666 850346327 850449443 850534379 850733399 850587726
3799.7 850587726 850100100 850185990 850322843 850295007 850677073 851167977 851198196 850999594 851224959 851148307
3820.1 851148307 850804448 850983083 851245940 851406276 851468086 851566195 851865828 851849020 851395428 851193488
3840.5 851193488 851249278 851450145 851848662 852235198 852072299 850825012 850124657 850857973 851538777 851777136
3860.9 851777136 851681769 851656497 851823747 851643384 851355672 851359427 851500154 851659954 851597130 851593375 851753771
3883.3 851753771 851717234 851718128 851650834 851384699 851485729 851883531 852014005 851768136 851331592 850950122
3903.7 850950122 850951970 851248026 851458669 851541400 851604223 851575136 851464152 851448059 851464570 851368070 851347685
3926.1 851347685 851520777 851643085 851607323 851560295 851539671 851563871 851626158 851588011 851491511 851397574 851280689
3948.6 851280689 851253211 851327658 851432025 851578236 851690531 851666987 851607144 851605415 851613224 851646900 851723433
3971 851723433 851783097 851819515 851852417 851927936 852060139 852134168 852086306 852009952 852003455 852044165 852048278 851977587
3995.5 851977587 851929247
3997.5 851929247
##END=$$ End of the data block
