##TITLE=$$ Begin of the data block
##JCAMP-DX=5.00 $$ ACD/SpecManager v 10.08
##SPECTROMETER/DATA SYSTEM=Alpha
##DATE=09 Apr 2014 11:14:46
##DATA TYPE=INFRARED SPECTRUM
##DATA CLASS=XYDATA
##ORIGIN=
##OWNER=
##NPOINTS=1765
##FIRSTX=399.75695801
##LASTX=3997.56933594
##MAXX=3997.56933594
##MINX=399.75695801
##MAXY=0.88020009
##MINY=0.44023436
##XFACTOR=1.0000000000
##YFACTOR=1.000000000000000e-9
##FIRSTY=0.76187754
##DELTAX=2.03957629
##XUNITS=1/CM
##YUNITS=ARBITRARY UNITS
##XYDATA=(X++(Y..Y))
$$ plain form
399.8 761877537 759778917 755840480 752231419 751246572 752728164 753257632 750771403 748467088 749570608
418.1 749570608 751895607 751319706 748074353 744641006 744086027 745732963 746154070 744106770 741769791
436.5 741769791 741703868 743394613 743935883 741954684 739528060 739263594 741139710 742227852 740926445
454.8 740926445 738996208 738611221 739657581 739702880 737454295 734833360 734458148 736155987 736796975
473.2 736796975 734510958 731596708 730987787 732733905 734054148 732749820 730073988 729037821 730385780
491.5 730385780 731342435 729632437 726944268 726197422 727617562 728503108 726920545 724251330 723204434
509.9 723204434 724191785 724908769 723441243 720716774 719411492 720124125 720662534 718989372 716193438
528.3 716193438 714928389 715511143 715920925 714545310 712308049 711285174 711909890 712585032 711670816
$$ packed form
399.8G61877537k098620l938437l609061r84847J481592N29468k486229k304315J103520
418.1G49570608K324999n75901l245353l433347n54979J646936M21107k047300k336979
436.5G41769791o5923J690745N41270j981199k426624k64466J876116J088142j301407
454.8G40926445j930237l84987J046360M5299k248585k620935l75212J697839O40988
473.2G36796975k286017k914250o08921J746118J320243j304328k675832j036167J347959
491.5G30385780R56655j709998k688169p46846J420140Q85546j582563k669215j046896
509.9G23204434R87351P16984j467526k724469j305282P12633N38409j673162k795934
528.3G16193438j265049N82754M09782j375615k237261j022875O24716O75142r14216
$$ plain form
546.6 711670816 709638655 708430111 708628297 708877623 707921743 706107736 704838157 704681993 704647720
565 704647720 703473985 701244950 699375331 698595524 698077083 696767926 694704294 692873597 692103744
583.3 692103744 691961169 691248715 689604759 687913597 687187076 687259495 686892569 685262322 683112502
601.7 683112502 681702912 681132913 680559754 679407775 678041816 677451313 678085923 679536223 681158721
620 681158721 682834804 685163736 688366532 691623986 693981469 695593297 697518528 700211883 702740908
638.4 702740908 704020560 704228520 704693854 706415117 708687901 710010707 710076928 710123718 711629868
656.7 711629868 714717031 717902720 720140159 721537352 722695291 725089312 727948785 729808629
673.1 729808629 731308639 733296096 735552728 737334073 738478541 739568949 741038918 742589355
$$ packed form
546.6G11670816k032161j208544J98186K49326r55880j814007j269579j56164l4273
565G04647720j173735k229035j869619p79807n18441j309157k063632j830697p69853
583.3F92103744j42575p12454j643956j691162p26521P2419l66926j630247k149820
601.7F83112502j409590n69999n73159j151979j365959n90503O34610J450300J622498
620F81158721J676083K328932L202796L257454K357483J611828J925231K693355K529025
638.4G02740908J279652K07960M65334J721263K272784J322806O6221M6790J506150
656.7G11629868L087163L185689K237439J397193J157939K394021K859473J859844
673.1G29808629J500010J987457K256632J781345J144468J090408J469969J550437
$$ plain form
689.4 742589355 743720829 744354904 744997025 746086121 747368515 748308003 748917103 749694228 750931621
707.7 750931621 752414346 753695846 754715979 755876422 757419407 759148002 760696948 761943758
724 761943758 763193607 764726758 766337574 767565846 768402517 769309521 770498514 771739721 772758722
742.4 772758722 773656607 774732888 776040554 777394474 778611422 779634774 780671537 781962514 783327520
760.8 783327520 784403086 785110712 785746872 786622822 787575603 788092494 788058519 787872553 787802339 787700832
781.2 787700832 787306666 786677778 786271989 786564052 787600279 789108336 790927231 793205261 796111643
799.5 796111643 799441397 802633822 805214405 807303488 809420943 811698258 813560247 814458013 814638197
817.9 814638197 814747930 814862072 814403236 812975287 810902536 808863759 807147086 805446744 803328395
$$ packed form
689.4G42589355J131474O34075O42121J089096J282394R39488O09100P77125J237393
707.7G50931621J482725J281500J020133J160443J542985J728595J548946J246810
724G61943758J249849J533151J610816J228272Q36671R07004J188993J241207J019001
742.4G72758722Q97885J076281J307666J353920J216948J023352J036763J290977J365006
760.8G83327520J075566P07626O36160Q75950R52781N16891l3975j85966p0214j01507
781.2G87700832l94166o28888m05789K92063J036227J508057J818895K278030K906382
799.5G96111643L329754L192425K580583K089083K117455K277315J861989Q97766J80184
817.9H14638197J09733J14142m58836j427949k072751k038777j716673j700342k118349
$$ plain form
836.2 803328395 800929606 798950851 797729015 796790957 795694947 794827640 795075297 797037661 800368547
854.6 800368547 804123819 807913601 812098026 816939890 821913600 826045692 828946531 831227481
870.9 831227481 833678186 836117625 837672353 838148773 838184834 838267922 838248491 837572157 836046159 834326029
891.3 834326029 833252490 833006561 833147585 833269060 833535790 834395528 835803092 837098002 837646842
909.6 837646842 837397516 836728394 835896850 834737062 833006382 830924630 829127967 828171611 828049183
928 828049183 828288794 828494966 828632832 828900695 829385221 829811633 829734921 829127848 828482449 828067064
948.4 828067064 827460408 826010108 823529124 820465624 817318082 813907385 809475839 803586066 796687663
966.8 796687663 789565444 782469213 775086939 767383397 760166764 754418850 750133216 746272027
$$ packed form
836.2H03328395k398789j978755j221836r38058j096010q67307K47657J962364L330886
854.6H00368547L755272L789782M184425M841864M973710M132092K900839K280950
870.9H31227481K450705K439439J554728M76420L6061Q3088j9431o76334j525998j720130
891.3H34326029j073539k45929J41024J21475K66730Q59738J407564J294910N48840
909.6H37646842k49326o69122q31544j159788j730680k081752j796663r56356j22428
928H28049183K39611K06172J37866K67863M84526M26412p6712o07073o45399m15385
948.4H28067064o06656j450300k480984l063500l147542l410697m431546n889773o898403
966.8G96687663p122219p096231p382274p703542p216633n747914m285634l861189
$$ plain form
983.1 746272027 742015123 737710238 734342337 732256114 730688453 728718460 726507008 725023270
999.4 725023270 724599600 724359751 723116577 720675766 717921436 715456665 712791622 709144413 704709470
1017.7 704709470 700645983 697648168 695113719 692022085 688269317 684780836 682319999 680551708
1034.1 680551708 678561509 676086187 673822463 672430694 671576381 670284927 668150663 665820479
1050.4 665820479 664262950 663754940 663721859 663674653 663873315 664709091 665723920 665823996 664416730
1068.7 664416730 661979377 659487545 657389343 655347347 652936041 650260925 647751510 645507276
1085 645507276 643092632 640135050 636876702 634092152 632451892 631861329 631696999 631531596 631398976
1103.4 631398976 631509900 631790698 631795406 631192148 630113304 628847659 627182305 624519229 621026635
$$ packed form
983.1G46272027m256904m304885l367901k086223j567661j969993k211452j483738
999.4G25023270m23670k39849j243174k440811k754330k464771k665043l647209m434943
1017.7G04709470m063487k997815k534449l091634l752768l488481k460837j768291
1034.1F80551708j990199k475322k263724j391769q54313j291454k134264k330184
1050.4F65820479j557529n08010l3081m7206J98662Q35776J014829J00076j407266
1068.7F64416730k437353k491832k098202k041996k411306k675116k509415k244234
1085F45507276k414644k957582l258348k784550j640260n90563j64330j65403j32620
1103.4F31398976J10924K80798M708o03258j078844j265645j665354k663076l492594
$$ plain form
1121.8 621026635 618077457 616706073 616766572 618188739 620346189 621924043 623192370 625286162 628178120
1140.1 628178120 631015182 633213460 634894907 636540353 638309062 639912128 641168177 642391086
1156.4 642391086 644181252 646857083 650193095 653922677 658233166 663487017 669635296 676051378
1172.7 676051378 682040811 687480390 692769527 698144495 703225136 707354367 710281253 712327182
1189.1 712327182 713824570 714685500 714696944 714048862 713514149 713916719 715331137 717118382 718708336
1207.4 718708336 720073402 721444428 722767413 723655939 723949730 724044085 724440098 725225449 726087451
1225.8 726087451 726744056 727331102 728235900 729595780 731128275 732491195 733662367 734858692 736155212
1244.1 736155212 737303376 738006949 738262296 738356948 738605380 739085674 739671052 740324557 741299450 742896259
$$ packed form
1121.8F21026635k949178j371384O0499J422167K157450J577854J268327K093792K891958
1140.1F28178120K837062K198278J681447J645446J768709J603066J256049J222909
1156.4F42391086J790166K675831L336012L729582M310489N253851O148279O416082
1172.7F76051378N989433N439579N289137N374968N080641M129231K926886K045929
1189.1G12327182J497388Q60930J1444o48082n34713M02570J414418J787245J589954
1207.4G18708336J365066J371026J322985Q88526K93791R4355L96013P85351Q62002
1225.8G26087451O56605N87046R04798J359880J532495J362920J171172J196325J296520
1244.1G36155212J148164P03573K55347R4652K48432M80294N85378O53505R74893J596809
$$ plain form
1264.5 742896259 745076597 747539222 750085235 752744198 755640507 758777618 761961043 764994562
1280.8 764994562 767911375 770933211 774184525 777491152 780542612 783210993 785623729 787960887
1297.2 787960887 790192664 792084277 793502271 794639528 795813501 797046304 798058867 798666120
1313.5 798666120 799059510 799613833 800442934 801320076 802030742 802661777 803423941 804287136 804978967 805288076
1333.9 805288076 805355310 805440068 805570602 805722535 805856824 805937827 806132913 806515574 806835771 806811392
1354.3 806811392 806489110 806229889 806076050 805552304 804568231 803557992 802680194 802126527 801709592
1372.6 801709592 800852597 799717844 798574269 797091782 795390666 794289947 793950617 793815315 793784559
1391 793784559 793650687 792946875 791740000 790222466 788789213 787481725 785751402 783902764 782384872
$$ packed form
1264.5G42896259K180338K462625K546013K658963K896309L137111L183425L033519
1280.8G64994562K916813L021836L251314L306627L051460K668381K412736K337158
1297.2G87960887K231777J891613J417994J137257J173973J232803J012563O07253
1313.5G98666120L93390N54323Q29101Q77142P10666O31035P62164Q63195O91831L09109
1333.9H05288076O7234Q4758J30534J51933J34289Q1003J95086L82661L20197k4379
1354.3H06811392l22282k59221j53839n23746r84073j010239q77798n53667m16935
1372.6H01709592q56995j134753j143575j482487j701116j100719l39330j35302l0756
1391G93784559j33872p03812j206875j517534j433253j307488j730323j848638j517892
$$ plain form
1409.3 782384872 781086087 780054331 779372036 778488755 777023196 776097715 775762081 775443792 775193810
1427.7 775193810 774917662 774892032 775403023 775864363 776062012 776660621 777679563 778901279 780223727
1446 780223727 781514823 783015668 785067677 787683368 790758491 793859422 796680450 799640775 802965164
1464.4 802965164 806450784 809928298 813608706 817644954 821364284 824366033 826794028 828668237
1480.7 828668237 830148220 831482172 832650959 833036125 832424939 831847310 831422329 830456436 829058588
1499.1 829058588 827849448 827051997 825839698 822556376 819411457 817328751 815355480 813437045
1515.4 813437045 811755896 810462773 808596253 806405425 804735839 803274095 802368760 801406801 799511790
1533.7 799511790 798275709 798179805 797250330 795275807 793940663 793226600 793184936 793453872 793719649
$$ packed form
1409.3G82384872j298785j031756o82295q83281j465559r25481l35634l18289k49982
1427.7G75193810k76148k5630N10991M61340J97649N98609J018942J221716J322448
1446G80223727J291096J500845K052009K615691L075123L100931K821028K960325L324389
1464.4H02965164L485620L477514L680408M036248L719330L001749K427995J874209
1480.7H28668237J479983J333952J168787L85166o11186n77629m24981r65893j397848
1499.1H29058588j209140p97451j212299l283322l144919k082706j973271j918435
1515.4H13437045j681149j293123j866520k190828j669586j461744r05335r61959j895011
1533.7G99511790j236081r5904r29475j974523j335144p14063m1664K68936K65777
$$ plain form
1552.1 793719649 793972492 794362605 793835282 792016625 791372359 790745378 789567530 787822604 785361588
1570.5 785361588 783354700 780920684 776268303 771923840 768806159 765243351 760912359 756101429
1586.8 756101429 751189172 746370196 741472185 736135244 730536044 725147188 720018506 714982152
1603.1 714982152 709962070 704748333 699226260 694086373 689803004 684907556 678453863 673788548
1619.4 673788548 670609057 666756332 662990332 659622669 656545639 654820383 653983414 652647078
1635.7 652647078 651830554 652513087 654216945 656783700 660165548 664102912 667892992 672008634 677328765
1654.1 677328765 682281733 686897039 691709697 696855307 702341914 707744598 713324785 719060719
1670.4 719060719 724232912 729633927 735716462 741568267 747035444 752475381 758617818 764593542
$$ packed form
1552.1G93719649K52843L90113n27323j818657o44266o26981j177848j744926k461016
1570.5G85361588k006888k434016m652381m344463l117681l562808m330992m810930
1586.8G56101429m912257m818976m898011n336941n599200n388856n128682n036354
1603.1G14982152n020082n213737n522073n139887m283369m895448o453693m665315
1619.4F73788548l179491l852725l766000l367663l077030j725256q36969j336336
1635.7F52647078q16524O82533J703858K566755L381848L937364L790080M115642N320131
1654.1F77328765M952968M615306M812658N145610N486607N402684N580187N735934
1670.4G19060719N172193N401015O082535N851805N467177N439937O142437N975724
$$ plain form
1686.7 764593542 770023644 775323808 780140221 785228014 790958285 796680868 802518606 807309210
1703 807309210 811411023 815610230 819498360 822914362 825857162 828455865 830976546 833342969 835389555
1721.4 835389555 837086320 838712156 840641916 842951715 845064521 846336007 847305000 848819435
1737.7 848819435 850725591 852600634 854143262 855501115 857003510 858576000 859964728 861072898
1754 861072898 861961782 862875223 863976896 865029395 865855575 866538346 867182493 867913842 868534505 868942916
1774.4 868942916 869300127 869732916 870304108 870934546 871423483 871764719 872191787 872653246 873012781 873364747
1794.8 873364747 873715758 873949289 874147415 874468863 874884486 875243068 875432193 875518799 875721157 876087248
1815.2 876087248 876378059 876500607 876660228 876967728 877326787 877625644 877640843 877486885 877585173 877864480
$$ packed form
1686.7G64593542N430102N300164M816413N087793N730271N722583N837738M790604
1703H07309210M101813M199207L888130L416002K942800K598703K520681K366423K046586
1721.4H35389555J696765J625836J929760K309799K112806J271486R68993J514435
1737.7H48819435J906156J875043J542628J357853J502395J572490J388728J108170
1754H61072898Q88884R13441J101673J052499Q26180O82771O44147P31349O20663M08411
1774.4H68942916L57211M32789N71192O30438M88937L41236M27068M61459L59535L51966
1794.8H73364747L51011K33531J98126L21448M15623L58582J89125Q6606K02358L66091
1815.2H76087248K90811J22548J59621L07500L59059K98857J5199j53958R8288K79307
$$ plain form
1835.6 877864480 878130436 878378451 878582537 878590167 878611088 878811240 878934681 878910780 878889918 879028320
1856 879028320 879287243 879458249 879442036 879463971 879678786 879859388 879834950 879738033 879642904 879645348 879826128
1878.4 879826128 880027473 880056977 879950166 879923165 880015433 880121291 880180180 880110860 879980862 879993916 880137146
1900.9 880137146 880200088 880113482 879991889 879942477 879999757 880120635 880171537 880048573 879930079 879970312 879983127
1923.3 879983127 879856110 879663229 879504681 879481137 879548550 879540801 879421055 879308879 879274428 879283130 879220068
1945.7 879220068 878996849 878712535 878560305 878570020 878583014 878449202 878200531 878026485 878031492 878057957 877884507
1968.2 877884507 877539396 877263069 877228200 877315164 877249479 876968861 876715660 876706302 876838923 876836658 876556695
1990.6 876556695 876149833 875952601 876026809 876059294 875835598 875507355 875339985 875371873 875384808 875176013
$$ packed form
1835.6H77864480K65956K48015K04086P630K0921K00152J23441k3901k0862J38402
1856H79028320K58923J71006j6213K1935K14815J80602k4438r6917r5129K444J80780
1878.4H79826128K01345K9504j06811k7001R2268J05858N8889o9320j29998J3054J43230
1900.9H80137146O2942q6606j21593m9412N7280J20878N0902j22964j18494M0233J2815
1923.3H79983127j27017j92881j58548k3544O7413p749j19746j12176l4451Q702o3062
1945.7H79220068k23219k84314j52230R715J2994j33812k48671j74046N007K6465j73450
1968.2H77884507l45111k76327l4869Q6964o5685k80618k53201r358J32621k265k79963
1990.6H76556695m06862j97232P4208L2485k23696l28243j67370L1888J2935k08795
$$ plain form
2011 875176013 874854863 874692440 874729931 874765337 874583304 874219060 873961806 873973250 874056756 873922944 873567224
2033.4 873567224 873269200 873250961 873402596 873400092 873131931 872860849 872825742 872947514 872960925 872750640
2053.8 872750640 872507691 872440338 872525275 872576237 872430325 872187018 872106671 872225761 872332573 872241378
2074.2 872241378 872034311 871956348 872081220 872213960 872165620 872017324 871955335 872018397 872121036 872150779
2094.6 872150779 872049451 871931851 871961653 872110665 872211158 872178793 872076452 872051239 872173190 872298837
2115 872298837 872287810 872194648 872178674 872308731 872468352 872507215 872435927 872402906 872487247 872622728 872692645
2137.5 872692645 872665703 872636795 872708023 872871995 873006046 873025835 873013794 873093367 873254180 873404145 873465598
2159.9 873465598 873426020 873408437 873530090 873708844 873800695 873797476 873821497 873950064 874102890 874171197 874148428
$$ packed form
2011H75176013l21150j62423L7491L5406j82033l64244k57254J1444Q3506j33812l55720
2033.4H73567224k98024j8239J51635k504k68161k71082l5107J21772J3411k10285
2053.8H72750640k42949o7353Q4937N0962j45912k43307q0347J19090J06812r1195
2074.2H72241378k07067p7963J24872J32740m8340j48296o1989O3062J02639K9743
2094.6H72150779j01328j17600K9802J49012J00493l2365j02341k5213J21951J25647
2115H72298837j1027r3162j5974J30057J59621L8863p1288l3021Q4341J35481O9917
2137.5H72692645k6942k8908P1228J63972J34051J9789j2041P9573J60813J49965O1453
2159.9H73465598l9578j7583J21653J78754R1851l219K4021J28567J52826O8307k2769
$$ plain form
2182.3 874148428 874141514 874243319 874404132 874509573 874524057 874510527 874559939 874679267 874760985 874732435 874659419
2204.8 874659419 874660552 874762475 874850631 874828398 874765396 874778092 874863863 874932706 874921322 874848306 874802887
2227.2 874802887 874858081 874966681 875016272 874982715 874929488 874916911 874952734 874971569 874918163 874839067 874809980
2249.6 874809980 874827802 874819160 874744773 874654651 874620378 874651432 874659956 874598801 874556422 874565423 874560118 874529421
2274.1 874529421 874532759 874600351 874713302 874844253 874910474 874841452 874671578 874446690 874236047 874093592
2294.5 874093592 873955309 873765171 873534977 873273909 872933626 872473955 871934235 871385455 870904148 870474637
2314.9 870474637 869905174 869074464 868138909 867335856 866724312 866133749 865489244 864995360 864665449 864267290
2335.3 864267290 863829494 863495350 863361180 863733351 865100145 866899848 867554188 866349697 863982499
$$ packed form
2182.3H74148428o914J01805J60813J05441J4484j3530M9412J19328Q1718k8550p3016
2204.8H74659419J133J01923Q8156k2233o3002J2696Q5771O8843j1384p3016m5419
2227.2H74802887N5194J08600M9591l3557n3227j2577L5823J8835n3406p9096k9087
2249.6H74809980J7822q642p4387r0122l4273L1054Q524o1155m2379R001n305l0697
2274.1H74529421L338O7592J12951J30951O6221o9022j69874k24888k10643j42455
2294.5H74093592j38283j90138k30194k61068l40283m59671n39720n48780m81307m29511
2314.9H70474637n69463q30710r35555q03053o11544n90563o44505m93884l29911l98159
2335.3H64267290m37796l34144j34170L72171J366794J799703O54340j204491k367198
$$ plain form
2353.6 863982499 861723363 860220194 859659791 859884024 860652268 861875474 863472164 865359068 867362380
2372 867362380 869226813 870883584 872466505 874044299 875436902 876413703 876922667 877132773 877268553
2390.4 877268553 877395988 877464890 877444625 877381444 877362132 877445161 877576709 877621353 877559006 877504170 877536595
2412.8 877536595 877621472 877668738 877615154 877491176 877411962 877435863 877487838 877462089 877358675 877296865 877363920
2435.2 877363920 877473891 877469361 877330482 877180934 877162337 877262175 877294123 877170563 877006769 876965344 877062261
2457.7 877062261 877125144 877030730 876878619 876839936 876901925 876899660 876734257 876495421 876387775 876477361 876588225
2480.1 876588225 876497388 876228094 876052916 876137614 876317501 876270354 875972986 875774145 875852942 876018047
2500.5 876018047 876027703 875834227 875604451 875535190 875617683 875622928 875422955 875208914 875206053 875331402 875345528
$$ packed form
2353.6H63982499k259136j503169n60403K24233P68244J223206J596690J886904K003312
2372H67362380J864433J656771J582921J577794J392603R76801N08964K10106J35780
2390.4H77268553J27435O8902k0265o3181j9312Q3029J31548M4644o2347n4836L2425
2412.8H77536595Q4877M7266n3584j23978p9214K3901N1975k5749j03414o1810O7055
2435.2H77363920J09971m530j38879j49548j8597R9838L1948j23560j63794m1425R6917
2457.7H77062261O2883r4414j52111l8683O1989k265j65403k38836j07646Q9586J10864
2480.1H76588225r0837k69294j75178Q4698J79887m7147k97368j98841P8797J65105
2500.5H76018047R656j93476k29776o9261Q2493N245j99973k14041k861J25349J4126
$$ plain form
2522.9 875345528 875171125 874933481 874843955 874952376 875041783 874912322 874647975 874522090 874615848 874691904
2543.3 874691904 874581516 874377489 874262750 874318600 874387622 874298334 874094009 873924971 873891652 873939633
2563.7 873939633 873895705 873698950 873527408 873500466 873502254 873386443 873147488 872924328 872837126 872854233 872804463
2586.2 872804463 872569382 872288227 872153223 872123659 872051477 871845424 871555209 871357322 871285677 871201038
2606.6 871201038 871001124 870713174 870454013 870305896 870233297 870087862 869793296 869479120 869275808 869130075
2626.9 869130075 868930757 868663430 868392467 868190408 868064463 867930353 867710173 867431939 867177844 866996646
2647.3 866996646 866871834 866704285 866412997 866076529 865844309 865724623 865582228 865340829 865097642 864941597
2667.7 864941597 864831269 864703536 864500523 864243448 864054441 863933086 863734782 863415718 863071203 862806618
$$ packed form
2522.9H75345528j74403k37644q9526J08421Q9407j29461k64347j25885R3758P6056
2543.3H74691904j10388k04027j14739N5850O9022q9288k04325j69038l3319M7981
2563.7H73939633m3928j96755j71542k6942J788j15811k38955k23160q7202J7107m9770
2586.2H72804463k35081k81155j35004k9564p2182k06053k90215j97887p1645q4639
2606.6H71201038j99914k87950k59161j48117p2599j45435k94566l14176k03312j45733
2626.9H69130075j99318k67327k70963k02059j25945j34110k20180k78234k54095j81198
2647.3H66996646j24812j67549k91288l36468k32220j19686j42395k41399k43187j56045
2667.7H64941597j10328j27733k03013k57075j89007j21355j98304l19064l44515k64585
$$ plain form
2688.1 862806618 862648606 862516701 862308860 862006128 861702204 861476839 861289561 861061990 860779405 860506713
2708.5 860506713 860302210 860130906 859895945 859564245 859219551 858974636 858840406 858706594 858436346 858036578
2728.9 858036578 857680738 857437849 857243776 857026875 856724799 856395721 856154501 856019616 855910778 855691075
2749.3 855691075 855337143 854991853 854730487 854482710 854187071 853860259 853528380 853193760 852893233 852645814
2769.7 852645814 852399886 852129400 851805627 851412773 851004779 850586474 850140750 849749565 849474251 849174201
2790.1 849174201 848692358 848150849 847734630 847364604 846881688 846296787 845676303 845092535 844633818 844207287
2810.5 844207287 843605220 842842162 842102468 841484070 840967298 840433419 839735508 838894069 838092387 837417185
2830.9 837417185 836714566 835815310 834737480 833455443 831888914 830065846 827952862 825603127 823443830
$$ packed form
2688.1H62806618j58012j31905k07841l02732l03924k25365j87278k27571k82585k72692
2708.5H60506713k04503j71304k34961l31700l44694k44915j34230j33812k70248l99768
2728.9H58036578l55840k42889j94073k16901l02076l29078k41220j34885j08838k19703
2749.3H55691075l53932l45290k61366k47777k95639l26812l31879l34620l00527k47419
2769.7H52645814k45928k70486l23773l92854m07994m18305m45724l91185k75314l00050
2790.1H49174201m81843n41509m16219l70026m82916n84901o20484n83768m58717m26531
2810.5H44207287o02067p63058p39694o18398n16772n33879o97911q41439q01682o75202
2830.9H37417185p02619q99256j077830j282037j566529j823068k112984k349735k159297
$$ plain form
2849.3 823443830 821937740 821043313 820402324 819878757 819442391 818951190 818293095 817364633 816093624
2867.6 816093624 814737260 813676596 812820435 811860979 810875535 810059547 809378028 808712900 807959199
2886 807959199 807062089 806075692 805135369 804283917 803349733 802192152 800942779 799780130 798673689
2904.3 798673689 797489762 796132565 794551253 792753816 790812671 788835168 786961019 785364568
2920.6 785364568 784199715 783518910 783278167 783301473 783324540 783399940 783836544 784664035 785713375 786960959
2941 786960959 788331926 789525688 790326118 790822089 791159451 791256607 791121721 791044056 791189134 791490614
2961.4 791490614 791825533 792173147 792615533 793166935 793770313 794313967 794712722 795101464 795552492 795852721
2981.8 795852721 795924127 795955718 796097219 796395242 796685398 796654165 796349406 795984089 795552671 795066535
$$ packed form
2849.3H23443830j506090q94427o40989n23567m36366m91201o58095r28462j271009
2867.6H16093624j356364j060664q56161r59456r85444q15988o81519o65128p53701
2886H07959199q97110r86397r40323q51452r34184j157581j249373j162649j106441
2904.3G98673689j183927j357197j581312j797437j941145j977503j874149j596451
2920.6G85364568j164853o80805k40743K3306K3067P5400M36604Q27491J049340J247584
2941G86960959J370967J193762Q00430M95971L37362R7156j34886p7665J45078L01480
2961.4G91490614L34919L47614M42386N51402O03378N43654L98755L88742M51028L00229
2981.8G95852721P1406L1591J41501K98023K90156l1233l04759l65317m31418m86136
$$ plain form
3002.2 795066535 794532418 793941617 793426096 793083966 792758346 792168736 791271865 790258229 789279938
3020.6 789279938 788406432 787556231 786598802 785640121 784802854 784031987 783125520 781957686 780797422
3038.9 780797422 779844403 778892875 777730882 776387393 775055647 773801208 772573173 771383822 770120323
3057.3 770120323 768715501 767345250 766126037 765035033 763902605 762548685 761093795 759797931
3073.6 759797931 758784652 757921875 756840050 755422115 753923655 752492309 751144826 749796271
3089.9 749796271 748282075 746692419 745270371 744040787 742734373 741154432 739506066 738074958
3106.2 738074958 736784101 735306621 733667791 732170284 730775177 729280829 727532804 725481689
3122.6 725481689 723369241 721455336 719744921 717989445 716024935 714045465 712256491 710540950
$$ packed form
3002.2G95066535n34117n90801n15521l42130l25620n89610q96871j013636r78291
3020.6G89279938q73506q50201r57429r58681q37267p70867r06467j167834j160264
3038.9G80797422r53019r51528j161993j343489j331746j254439j228035j189351j263499
3057.3G70120323j404822j370251j219213j091004j132428j353920j454890j295864
3073.6G59797931j013279q62777j081825j417935j498460j431346j347483j348555
3089.9G49796271j514196j589656j422048j229584j306414j579941j648366j431108
3106.2G38074958j290857j477480j638830j497507j395107j494348j748025k051115
3122.6G25481689k112448j913905j710415j755476j964510j979470j788974j715541
$$ plain form
3138.9 710540950 708637118 706541300 704408526 702304184 700343072 698509693 696484864 694140911
3155.2 694140911 691736519 689453483 687286139 685142159 682865560 680470467 678121269 675852239
3171.5 675852239 673594534 671282649 668859363 666406274 664029121 661685705 659295917 656846106
3187.8 656846106 654369652 651917040 649526119 647101283 644549906 641983807 639540255 637196958
3204.1 637196958 634841681 632413983 629966438 627583265 625290513 623032451 620718598 618348718
3220.5 618348718 615991950 613693595 611444831 609217942 607076406 605043530 602936566 600711286
3236.8 600711286 598535597 596440136 594418585 592560172 590770125 588830531 586830795 584985554
3253.1 584985554 583286524 581545115 579678774 577842772 576120913 574489713 572975755 571528256
$$ packed form
3138.9G10540950j903832k095818k132774k104342j961112j833379k024829k343953
3155.2F94140911k404392k283036k167344k143980k276599k395093k349198k269030
3171.5F75852239k257705k311885k423286k453089k377153k343416k389788k449811
3187.8F56846106k476454k452612k390921k424836k551377k566099k443552k343297
3204.1F37196958k355277k427698k447545k383173k292752k258062k313853k369880
3220.5F18348718k356768k298355k248764k226889k141536k032876k106964k225280
3236.8F00711286k175689k095461k021551j858413j790047j939594j999736j845241
3253.1E84985554j699030j741409j866341j836002j721859j631200j513958j447499
$$ plain form
3269.4 571528256 569924653 568085194 566142619 564180851 562298715 560524762 558753610 556973517
3285.7 556973517 555241644 553554595 551841915 549999774 547986984 545864701 543771148 541852355
3302 541852355 540089250 538227141 536046982 533617675 531162798 528809488 526499927 524179220 521881640
3320.4 521881640 519660234 517494202 515164614 512612343 510091543 507714152 505446911 503251016
3336.7 503251016 500943840 498437136 495882303 493342906 490891129 488631159 486322492 483742028
3353 483742028 481097728 478659183 476398408 474098384 471770465 469690412 467824787 465763360 463322550
3371.4 463322550 460862041 458790362 457032114 455363065 453691274 452083915 450703889 449670166
3387.7 449670166 448961854 448164463 446981490 445840567 445224494 444888353 444184273 443064988 442161798
$$ packed form
3269.4E71528256j603603j839459j942575j961768j882136j773953j771152j780093
3285.7E56973517j731873j687049j712680j842141k012790k122283k093553j918793
3302E41852355j763105j862109k180159k429307k454877k353310k309561k320707k297580
3320.4E21881640k221406k166032k329588k552271k520800k377391k267241k195895
3336.7E03251016k307176k506704k554833k539397k451777k259970k308667k580464
3353D83742028k644300k438545k260775k300024k327919k080053j865625k061427k440810
3371.4D63322550k460509k071679j758248j669049j671791j607359j380026j033723
3387.7D49670166p08312p97391j182973j140923o16073l36141p04080j119285r03190
$$ plain form
3406.1 442161798 441720992 441440046 441113442 440708071 440340817 440234363 440294355 440329820 440539896 441129982
3426.5 441129982 441962928 442748994 443561465 444562078 445435077 445985496 446599096 447653174 449037373
3444.8 449037373 450452834 451848984 453389585 455098689 456913948 458923846 461169899 463343173
3461.1 463343173 465412647 467775404 470348299 472591639 474356502 476144493 478310525 480840772
3477.4 480840772 483461291 485813022 488107830 490668654 493218154 495610356 498151571 500915885
3493.8 500915885 503756046 506505847 509197474 511898756 514455080 516926646 519557774 522403061
3510.1 522403061 525440276 528454840 531275511 534184635 537391603 540824115 544115722 547020316
3526.4 547020316 549861431 552983403 556391776 560022354 563645065 567047238 570602953 574509263
$$ packed form
3406.1D42161798m40806k80946l26604m05371l67254j06454N9992L5465K10076N90086
3426.5D41129982Q32946P86066Q12471J000613Q72999N50419O13600J054078J384199
3444.8D49037373J415461J396150J540601J709104J815259K009898K246053K173274
3461.1D63343173K069474K362757K572895K243340J764863J787991K166032K530247
3477.4D80840772K620519K351731K294808K560824K549500K392202K541215K764314
3493.8E00915885K840161K749801K691627K701282K556324K471566K631128K845287
3510.1E22403061L037215L014564K820671K909124L206968L432512L291607K904594
3526.4E47020316K841115L121972L408373L630578L622711L402173L555715L906310
$$ plain form
3542.7 574509263 578354180 581819952 585180640 588638902 592206478 595986664 599971294 604079783
3559 604079783 608193874 612239301 616130531 620161355 624598324 628981769 633178353 637547195 642206848
3577.4 642206848 647037745 652004778 656996250 661707699 666133046 670869410 675788701 680555046
3593.7 680555046 685420215 690570235 695712268 700737476 705734253 710519075 715252936 720208287
3610 720208287 725175381 730096698 734864295 739337921 743902266 748516440 752932608 756953835 760668397
3628.4 760668397 764963448 769366026 773362637 777165711 780885339 784570217 788219810 791669786
3644.7 791669786 794623077 797187328 800094843 803084195 805518091 807877004 810513794 812872648
3661 812872648 814875305 816879511 818663299 819936037 821501791 823089182 823782921 824705243 826267123
$$ packed form
3542.7E74509263L844917L465772L360688L458262L567576L780186L984630M108489
3559F04079783M114091M045427L891230M030824M436969M383445M196584M368842M659653
3577.4F42206848M830897M967033M991472M711449M425347M736364M919291M766345
3593.7F80555046M865169N150020N142033N025208M996777M784822M733861M955351
3610G20208287M967094M921317M767597M473626M564345M614174M416168M021227L714562
3628.4G60668397M295051M402578L996611L803074L719628L684878L649593L449976
3644.7G91669786K953291K564251K907515K989352K433896K358913K636790K358854
3661H12872648K002657K004206J783788J272738J565754J587391O93739R22322J561880
$$ plain form
3679.4 826267123 827817678 829379916 830913484 832048833 832594573 833236873 834312856 835421324 836306870
3697.7 836306870 836875141 837331474 838142037 839097261 839745283 839989901 840265512 841110885 841972232 842392743
3718.1 842392743 842574894 842804074 842998326 843162060 843653321 844368219 844912410 845046103 845194876 845956504
3738.5 845956504 846765578 846706867 846217811 846642196 846963286 846555769 846769333 847660303 848189533 848191738
3758.9 848191738 848322034 848676860 848937273 849077344 848959565 848857284 849197268 849752367 850128531 850121498
3779.3 850121498 850005984 849990427 850033343 850188613 850408494 850637794 850794911 850895286 851120472 850981295
3799.7 850981295 850420892 850477934 850679576 850693703 851075530 851556718 851601720 851428807 851577699 851356447
3820.1 851356447 851000428 851268888 851516604 851622641 851714432 851845384 852135539 852094769 851622224 851441085
$$ packed form
3679.4H26267123J550555J562238J533568J135349N45740O42300J075983J108468Q85546
3697.7H36306870N68271M56333Q10563R55224O48022K44618K75611Q45373Q61347M20511
3718.1H42392743J82151K29180J94252J63734M91261P14898N44191J33693J48773P61628
3738.5H45956504Q09074n8711m89056M24385L21090m07517K13564Q90970N29230K205
3758.9H48191738J30296L54826K60413J40071j17779j02281L39984N55099L76164p033
3779.3H50121498j15514j5557M2916J55270K19881K29300J57117J00375K25186j39177
3799.7H50981295n60403N7042K01642J4127L81827M81188M5002j72913J48892k21252
3820.1H51356447l56019K68460K47716J06037R1791J30952K90155m0770m72545j81139
$$ plain form
3840.5 851441085 851499319 851693153 852177322 852667928 852506816 851183236 850412130 851143241 851869583 852138758
3860.9 852138758 852015853 851918340 852049410 851898909 851635098 851605415 851759791 852012455 851988733 851950288
3881.3 851950288 852049172 851913452 851904392 851948142 851757646 851828218 852149904 852205455 851944029 851592779 851305664
3903.7 851305664 851296544 851514459 851698101 851826072 851952195 851936936 851766407 851733625 851818621 851792932 851795554
3926.1 851795554 851935148 851977110 851855814 851791263 851838410 851943791 851993501 851907790 851890206 851925790 851878405
3948.6 851878405 851887167 851930320 851917028 851942360 852003276 852018952 852026045 852047563 852065146 852110386 852161407 852167964
3973.1 852167964 852192998 852269292 852350652 852450490 852541387 852529109 852405131 852286339 852283299 852355182 852381229
3995.5 852381229 852368534
$$ packed form
3840.5H51441085N8234J93834M84169M90606j61112j323580p71106P31111P26342K69175
3860.9H52138758j22905r7513J31070j50501k63811k9683J54376K52664k3722l8445
3881.3H51950288R8884j35720r060M3750j90496P0572L21686N5551k61426l51250k87115
3903.7H51305664r120K17915J83642J27971J26123j5259j70529l2782Q4996k5689K622
3926.1H51795554J39594M1962j21296o4551M7147J05381M9710q5711j7584L5584m7385
3948.6H51878405Q762M3153j3292K5332O0916J5676P093K1518J7583M5240N1021O557
3973.1H52167964K5034P6294Q1360R9838R0897j2278j23978j18792l040P1883K6047
3995.5H52381229j2695
$$ plain form
3997.5 852368534
$$ packed form
3997.5H52368534
##END=$$ End of the data block
