##TITLE=$$ Begin of the data block
##JCAMP-DX=5.00 $$ ACD/SpecManager v 10.08
##SPECTROMETER/DATA SYSTEM=Alpha
##DATE=09 Apr 2014 11:14:46
##DATA TYPE=INFRARED SPECTRUM
##DATA CLASS=XYDATA
##ORIGIN=
##OWNER=
##NPOINTS=1765
##FIRSTX=399.75695801
##LASTX=3997.56933594
##MAXX=3997.56933594
##MINX=399.75695801
##MAXY=0.87840939
##MINY=0.44925335
##XFACTOR=1.0000000000
##YFACTOR=1.000000000000000e-9
##FIRSTY=0.74057394
##DELTAX=2.03957629
##XUNITS=1/CM
##YUNITS=ARBITRARY UNITS
##XYDATA=(X++(Y..Y))
399.8G40573943R1374J274228j157046l659606k443671J173318K396404N4479k829254
418.1G35474169j843989J462758R38594k326548l383159j59502L035128J126468l378987
436.5G30944932l513337Q31008L359556O35505k986014k333402J248538K645791p034
454.8G30825543k974093k166330J151979J708328j113653l170788j545191J497150
471.1G24212945J444220j741052k981424n93364K037048J290977j647711k475917l21984
489.5G19223738J614392O02662j983285k476394k67088J530766L45826k060771k164542
507.9G14365304N5789J166463l24607k165436j787842K79963Q79944p97093k295733
526.2G09376752j612424m7684K36273j024366j890480r41217M11868L50237r12905
$$ plain form
399.8 740573943 740665317 741939545 740782499 737122893 734679222 735852540 738248944 738303423 735474169
418.1 735474169 733630180 735092938 736031532 733704984 730321825 730162323 733197451 734323919 730944932
436.5 730944932 727431595 728262603 731622159 732257664 729271650 726938248 728186786 730832577 730825543
454.8 730825543 727851450 725685120 726837099 728545427 727431774 724260986 722715795 724212945
471.1 724212945 725657165 723916113 720934689 720341325 722378373 723669350 722021639 719545722 719223738
489.5 719223738 720838130 721440792 719457507 716981113 716714025 718244791 718590617 716529846 714365304
507.9 714365304 714421093 715587556 715262949 713097513 711309671 711589634 712469578 711672485 709376752
526.2 709376752 707764328 707716644 707952917 706928551 705038071 704096854 704508722 704858959 703946054
544.6G03946054j564860o50108L49879j26660j311123j531661o26325L1471n91517
562.9F97925150j587212j609981r93430q95262j504958j894891j383364o40214p47084
581.3F86668754j463294j692713j065314n45918r61841j599431j353681n61476n25176
599.6F76899910j512408k226770j533687j83225J64390o32048j051545r6798J647472
618F71475291K596677K306342K201855K928018L482700K927840J762747J411558K228856
636.3F93321884K741038J709402K5213r7752J725316L030181J888454m33564j031101
654.7G02879071J158238L835916L994346K204776J113653K003252L946960K600551
671G23736763O92964Q60214K445519L153860J773954J44303M89890K134562K606928
$$ plain form
544.6 703946054 702381194 701731086 702080965 701954305 700643182 699111521 698485196 698516667 697925150
562.9 697925150 696337938 694727957 693734527 692839265 691334307 689439416 688056052 687415838 686668754
581.3 686668754 685205460 683512747 682447433 681901515 680939674 679340243 677986562 677425086 676899910
599.6 676899910 675387502 673160732 671627045 671443820 671608210 670976162 669924617 669827819 671475291
618 671475291 674071968 676378310 678580165 681508183 684990883 687918723 689681470 691093028 693321884
636.3 693321884 696062922 697772324 697797537 697699785 699425101 702455282 704343736 703910172 702879071
654.7 702879071 704037309 707873225 711867571 714072347 715186000 717189252 721136212 723736763
671 723736763 724429727 725289941 727735460 730889320 732663274 732807577 733297467 735432029 738038957
689.4G38038957J090765n13196j43289J558065K107263P25865n13136L35156K285898
707.7G44972348K727449J118124k94030M37796K333105K829194J259684j27017O44505
726.1G55901158K449572K706587R00269o27637J93536K187014K566099Q14974n55396
744.4G66536176M00365K374529K668620R33051l41654O25372K443611K606214Q88526
762.8G79134810m16338L87191J964391J901507P7486j178503m10140R47893P72476
781.2G83180773q75115j828253p10965J201809J774549R18627O46770K160907M060447
799.5G90529549M351020L014684J931250K439618L383934K899111J167476Q1062N13673
817.9H10311377J113892M02808j201451k168179j847982j277029j710296k725482k920985
$$ plain form
689.4 738038957 739129722 738616526 738473237 740031302 742138565 742864430 742351294 742686450 744972348
707.7 744972348 747699797 748817921 748523891 748961687 751294792 754123986 755383670 755256653 755901158
726.1 755901158 758350730 761057317 761957586 761329949 761523485 763710499 766276598 767091572 766536176
744.4 766536176 766936541 769311070 771979690 772912741 772571087 773196459 775640070 778246284 779134810
762.8 779134810 778718472 779105663 781070054 782971561 783049047 781870544 781460404 782408297 783180773
781.2 783180773 782305658 780477405 779766440 780968249 782742798 783661425 784308195 786469102 790529549
799.5 790529549 794880569 797895253 799826503 802266121 805650055 808549166 809716642 809797704 810311377
817.9 810311377 811425269 811828077 810626626 808458447 806610465 805333436 803623140 800897658 797976673
836.2G97976673j984358j144290j402021k134502k005815o38187J011074J994073K560616
854.6G94233263L508865M818917N574763N255877M453838M011810L906310L392994
870.9H29156637K300143J381994J143634J209378Q51929o7710q96454j068175q49128
889.3H33162248r18805j210928r83179j10686P68244J103878Q98064P45952R63688
907.6H34418476R26375J16050j001060j573860j510144j527786j939356k133012j443267
926H24332416j33991P42912N97239P6055R0122N51403O02007j54376r29833q32557
946.4H24941397l55006o09219j713276k761185k997636k851487l380894m829169o267845
964.7G99175680o824553o862522p235705p875860p826686o561100m792691l753900
$$ plain form
836.2 797976673 795992315 794848025 793446004 791311502 789305687 788667500 789678574 791672647 794233263
854.6 794233263 797742128 802561045 808135808 813391685 817845523 821857333 825763643 829156637
870.9 829156637 831456780 832838774 833982408 835191786 836043715 835976005 835079551 834011376 833162248
889.3 833162248 832243443 831032515 830049336 829938650 830706894 831810772 832708836 833454788 834418476
907.6 834418476 835344851 835460901 834459841 832885981 831375837 829848051 827908695 825775683 824332416
926 824332416 824198425 824941337 825538576 825614631 825704753 826256156 826858163 826703787 825773954 824941397
946.4 824941397 824586391 823977172 822263896 819502711 816505075 813653588 810272694 805443525 799175680
964.7 799175680 792351127 785488605 778252900 770377040 762550354 755989254 751196563 747442663
981G47442663l738880l817440l156065k104760j613497j917899k201378j658082o72281
999.4G26562381k94745q36194j626670j947522j964510k431571l446639m181802l967226
1017.7G05865502l218889k929866l379524l832996l519416k694308k259255k414584
1034.1F81616664k488852j965940j194894r76026j479149k040744k017140j486540
1050.4F67967379j056611r48012o65307K10166J229107J437902N44370o97017j465082
1068.7F66556895j728595k020597k620339l102661l012836k630651k577960l057361
1085F45805895l684103l841937l321051k493024j770556j079679j92940O25551R14335
1103.4F30962491O18517J56880r3937k02894n07117j256167k434969l597916l928423
$$ plain form
981 747442663 743703783 739886343 736730278 734625518 733012021 731094122 728892744 727234662 726562381
999.4 726562381 726267636 725431442 723804772 721857250 719892740 717461169 714014530 709832728 705865502
1017.7 705865502 702646613 699716747 696337223 692504227 688984811 686290503 684031248 681616664
1034.1 681616664 679127812 677161872 675966978 674990952 673511803 671471059 669453919 667967379
1050.4 667967379 666910768 665962756 665297449 665507615 666736722 668174624 668718994 668021977 666556895
1068.7 666556895 664828300 662807703 660187364 657084703 654071867 651441216 648863256 645805895
1085 645805895 642121792 638279855 634958804 632465780 630695224 629615545 629422605 630048156 630962491
1103.4 630962491 631581008 631737888 631643951 631441057 630933940 629677773 627242804 623644888 619716465
1121.8F19716465k895891j235724O616J038492J586914J182020R56356J579583K383113
1140.1F24317944K780736K668082K210737J724958J448393J401484J504302J665830
1156.4F39722466J934708K427160L113151L903985M694402N314887N661607N738020
1172.7F72510386N617022N376160N075157M708707M161895L395915K540707J712740
1189.1G05098689R08136J39952m02451m29153J02102Q72076J489401J797736J900970
1207.4G11477458J931787J803696J310170O58631L72350N63741Q07166P24018M68671
1225.8G20117688N02885R46223J360774J328230J034856J001179J356423J633465J341045
1244.1G30622768O60122K89202M52160O46711M25339K741K0445P13765J516104J784861
$$ plain form
1121.8 619716465 616820574 615584850 615591466 616629958 618216872 619398892 620355248 621934831 624317944
1140.1 624317944 627098680 629766762 631977499 633702457 635150850 636552334 638056636 639722466
1156.4 639722466 641657174 644084334 647197485 651101470 655795872 661110759 666772366 672510386
1172.7 672510386 678127408 683503568 688578725 693287432 697449327 700845242 703385949 705098689
1189.1 705098689 706006825 706146777 705744326 705315173 705417275 706289351 707778752 709576488 711477458
1207.4 711477458 713409245 715212941 716523111 717181742 717554092 718117833 718924999 719649017 720117688
1225.8 720117688 720620573 721566796 722927570 724255800 725290656 726291835 727648258 729281723 730622768
1244.1 730622768 731282890 731572092 732024252 732670963 733096302 733099043 733119488 733833253 735349357 737134218
1264.5G37134218J684189J869679K575576L235221L196358K677560K476335K929985
1280.8G57779121L469825L409565K871632K582014K914548L313362L022194K159059
1297.2G81521320J585186J761258K126514J876355J032471M43816O90997J224816J120865
1315.5G93383598M37677O1631N51999J324117J396716P53462K69532M55380Q49783
1333.9G99483895P35581K1696n67078k23875N81681Q09730K71201k12372L3140O08862
1354.3H01542461N78523j35482o95467o43372l15965l71873r28461j287044r58740
1372.6G96784580n55158q05199j836836l207148l388404j362205R62615R36270k29597
1391G87298918m67241k37882n12362j493215k141953j904666j531065j412928j568079
$$ plain form
1264.5 737134218 738818407 740688086 743263662 746498883 749695241 752372801 754849136 757779121
1280.8 757779121 761248946 764658511 767530143 770112157 773026705 776340067 779362261 781521320
1297.2 781521320 783106506 784867764 786994278 788870633 789903104 790346920 791037917 792262733 793383598
1315.5 793383598 793821275 793882906 794434905 795759022 797155738 797909200 798178732 798634112 799483895
1333.9 799483895 800219476 800241172 799674094 799450219 800031900 800841630 801112831 800900459 800933599 801542461
1354.3 801542461 802120984 801985502 801290035 800646663 800330698 799958825 799030364 797743320 796784580
1372.6 796784580 796229422 795424223 793587387 790380239 786991835 785629630 786592245 787528515 787298918
1391 787298918 786831677 786593795 786081433 784588218 782446265 780541599 779010534 777597606 776029527
1409.3G76029527j716256j336694n79595k53916p96378j145482p46250k36571L8803
1427.7G69257188j46628m18663p6651P22289J039505O33180N55277Q67963J416147
1446G73849607J825630J736760J637638K071381L541171M513264L025293K523303L259599
1464.4G97983646L577233L204524L456235M280269L932596K912700K322554J832486
1480.7H23502243J350402R96709Q77440M51267m83572q79705q71957j229286j742303
1499.1H21971238j846195j531601j549661l103792l692925k964318k556145k152503
1515.4H02574098j902103j700878j849115j908839j670480j778662j579225j247525
1531.7G88937271j318753j077891m94837n06938j061857q99434n09858j56343R4593
$$ plain form
1409.3 776029527 774313271 772976577 772396982 772143066 771346688 770201206 769454956 769218385 769257188
1427.7 769257188 769110560 768691897 768615246 769337535 770377040 771010220 771565497 772433460 773849607
1446 773849607 775675237 777411997 779049635 781121016 784662187 789175451 792200744 794724047 797983646
1464.4 797983646 801560879 804765403 808221638 812501907 816434503 819347203 821669757 823502243
1480.7 823502243 824852645 825849354 826726794 827178061 826694489 825814784 824942827 823713541 821971238
1499.1 821971238 820125043 818593442 817043781 813939989 810247064 807282746 804726601 802574098
1515.4 802574098 800671995 798971117 797122002 795213163 793542683 791764021 790184796 788937271
1531.7 788937271 787618518 786540627 786045790 785538852 784476995 783577561 783067703 782911360 783005953
1550.1G83005953L68237P22409R94742Q74877m37677q60811o13808p01309j374542
1568.4G81978071k458751k494634k375781l570497m174829m008770m255473m360259
1584.7G54279077m508674m869640n219102n276680n170882n066692n127788n341411
1601.1G13698208n357861n035997m855334n177558n336106m874646m861832n525529
1617.4F72673345m538477l786266m266798l960192l327549l049612k258122j307487
1633.7F46178842o62029j17183L95835R56654J657486K980530L751338K768516L352762
1652F61262751N227148L872872L357768M078388M834235M916489M464984N268931O124377
1670.4G03407943N074620N087615N769968N311012N035043N774736P383406O215036
$$ plain form
1550.1 783005953 783374190 784096599 785091341 785966218 785528541 784667730 784053922 783352613 781978071
1568.4 781978071 779519320 777024686 774648905 771078408 766903579 762894809 758639336 754279077
1584.7 754279077 749770403 744900763 739681661 734404981 729234099 724167407 719039619 713698208
1601.1 713698208 708340347 703304350 698449016 693271458 687935352 683060706 678198874 672673345
1617.4 672673345 668134868 664348602 660081804 656121612 652794063 649744451 647486329 646178842
1633.7 646178842 645516813 645399630 645795465 646752119 648409605 651390135 655141473 657909989 661262751
1652 661262751 666489899 670362771 673720539 677798927 682633162 687549651 692014635 697283566 703407943
1670.4 703407943 708482563 713570178 719340146 724651158 729686201 735460937 742844343 749059379
1686.7G49059379N140662N410850M930556N493879O378770O427229P048666N337894
1703G95227885M333735M526794L926992L478229L246069L135502L234387K608895J917184
1721.4H25635672J813531J815974J825273K033651K088905K116382J705289J394033
1737.7H40428710J834750K008617J734555J619458J746237J860857J601577J164436
1754H53999197J059056J097500J145661J150310Q50976P12513Q41558R92299R63330
1772.4H62812400O08802L80218N26547O97255O41108N30720M79519N40435P09057P14660
1792.8H68640721M40001L46005M24207M79459L94523K81573K90572L71278L80516K67327
1813.2H72316182K22742K52605K80678K87116K89082K91169L24428L03984J22010O2227
$$ plain form
1686.7 749059379 754200041 759610891 764541447 770035326 776414096 782841325 789889991 795227885
1703 795227885 799561620 804088414 808015406 811493635 814739704 817875206 821109593 823718488 825635672
1721.4 825635672 827449203 829265177 831090450 833124101 835213006 837329388 839034677 840428710
1737.7 840428710 842263460 844272077 846006632 847626090 849372327 851233184 852834761 853999197
1754 853999197 855058253 856155753 857301414 858451724 859302700 860015213 860856771 861849070 862812400
1772.4 862812400 863421202 863801420 864327967 865025222 865666330 866197050 866676569 867217004 867926061 868640721
1792.8 868640721 869080722 869426727 869850934 870330393 870724916 871006489 871297061 871668339 872048855 872316182
1813.2 872316182 872538924 872791529 873072207 873359323 873648405 873939574 874264002 874567986 874689996 874752223
1833.6H74752223J69099K29180K20716K44438K42353J56641R7036R6441Q0227O2645
1854H76350999J09553J80543J89781J04427Q1718J92285K51114R8825o7115o8546M0889
1876.4H77464473J59085J58370K9802o1989N3525K21968J46448n3584r5487P15J18852
1898.8H78142178J34289l0815j67072m2498J64032J23799o9619j11699R060J34170
1919.2H78285825J23561r0838k98083j81555Q1837J26838p2181k36153j36495J08063
1939.6H77710819J53125j11103l15011k03073L7670R0480j36077l44098k56658l57
1960H76625717P8618j01924k72035j95563J7702N5790j52409l27170k01881N3823Q4877
1982.5H75665545j34944l06786k08914L4034O4373j72793l34621k29359L517M1247
$$ plain form
1833.6 874752223 874921322 875150502 875371218 875615656 875858009 876014650 876111686 876208127 876288354 876350999
1854 876350999 876460552 876641095 876830876 876935303 877017021 877209306 877460420 877559245 877492130 877423584 877464473
1876.4 877464473 877623558 877781928 877811730 877749741 877803266 878025234 878171682 878118098 878022611 878023326 878142178
1898.8 878142178 878276467 878245652 878078580 878036082 878200114 878323913 878254294 878142595 878151655 878285825
1919.2 878285825 878409386 878318548 878020465 877838910 877920747 878047585 877975404 877739251 877602756 877710819
1939.6 877710819 877863944 877752841 877437830 877234757 877272427 877362907 877226830 876882732 876626074 876625717
1960 876625717 876704335 876602411 876330376 876134813 876152515 876208305 876055896 875728726 875526845 875580668 875665545
1982.5 875665545 875530601 875223815 875014901 875048935 875113308 874940515 874605894 874376535 874380052 874421299
2002.8H74421299j49131k83242k00569p75N8293j20401k87533k15292k9147R418j51992
2025.3H73050928k93255k11358M17M9591j10328k40981j63198J4901M1783r7394k19166
2047.7H71821940j57654J2695M7446q6367j80126j09493L0636P1824n8770j86265j21176
2070.2H71084690N2333R6381l8207j38044p0989M5597N8234o795n3108m3154O736K4676
2094.6H71018350j2994k7537P510M6134M5300L7074L7431R418m292J2994K0504J9372
2119.1H71209264K2650L9041P1585Q6307Q1897O9499M3154M6015P0691O6340N2035
2141.5H71858478O4909R5129J23143R3878J6629N067O6220J16289J21236Q7082L5286
2164H72683346M3452J13249J45018R4891J1921o438O3002J22309P7844N96K0206R9063
$$ plain form
2002.8 874421299 874272168 873988926 873788357 873787582 873845875 873725474 873437941 873222649 873193502 873202920 873050928
2025.3 873050928 872757673 872546315 872546732 872596323 872485995 872245014 872081816 872096717 872138500 872041106 871821940
2047.7 871821940 871664286 871676981 871724427 871638060 871457934 871348441 871379077 871450901 871392131 871205866 871084690
2070.2 871084690 871137023 871233404 871195197 871057153 870986164 871031761 871089995 871083200 871030092 870986938 870993674 871018350
2094.6 871018350 871005356 870977819 870985329 871031463 871076763 871113837 871151268 871160686 871156394 871169388 871189892 871209264
2119.1 871209264 871231914 871270955 871342540 871428847 871510744 871580243 871623397 871669412 871740103 871806443 871858478
2141.5 871858478 871923387 872018516 872141659 872235537 872252166 872257233 872323453 872439742 872560978 872648060 872683346
2164 872683346 872726798 872840047 872985065 873079956 873091877 873085439 873148441 873270750 873348594 873349190 873369396 873468459
2188.4H73468459J23858P7009K981k8193L3199J11997P9334k9504m1068P0811J27196
2210.9H73996079M7922n5075o5803L1650J16110O6340n1677q4579K0086J30892Q6010
2233.3H74237955o4671j26362j5080J15275O9022r8288j54972j4603J22190N4180j05381
2255.8H74019265j39236k4438R4354M5359j11818j38223K6345J74045J10507m8458
2276.1H74007702n7399R2923J91510Q0466j30594j88410p3671K1756j9193j64688k22087
2298.6H73538315q1598L7372r2864l40224m11927k19107m411o4611l61264n76258m44352
2321H70979071j51039j11937l16739l76284r4831J84119L1471l34919l67582j5258
2341.4H69426072M64141Q32856O40273n4002p31647j037955r07183n98907k11835K88784
$$ plain form
2188.4 873468459 873592317 873669326 873672307 873644114 873677313 873789310 873868644 873839140 873798072 873868883 873996079
2210.9 873996079 874044001 873988926 873923123 873954773 874070883 874137223 874085546 874000967 874021053 874151945 874237955
2233.3 874237955 874173284 874046922 874031842 874147117 874216139 874117851 873962879 873948276 874070466 874124646 874019265
2255.8 874019265 873880029 873855591 873949945 873995304 873883486 873745263 873771608 873945653 874056160 874007702
2276.1 874007702 873950303 874043226 874234736 874315202 874184608 873996198 873922527 873944283 873925090 873760402 873538315
2298.6 873538315 873456717 873494089 873401225 873061001 872649074 872429967 872425556 872360945 871999681 871423423 870979071
2321 870979071 870828032 870716095 870399356 870023072 869928241 870112360 870143831 869808912 869441330 869426072
2341.4 869426072 869890213 870723069 871363342 871309340 870577693 869539738 868632555 868033648 867821813 868110597
2361.8H68110597O18279O32525N96940P21693J023710J148283R25839P08044O68824
2380.2H75154734O76095O00100L61860P8797j9074Q0765J61171O9260r1672p2181J34707
2402.6H77134562K26080N2333j56224j32084M8399J42753M5479j25826j35004J8179
2423H77118647R4593K980j09434q8454M5956J07467L576j41144j57058M768J28508
2445.4H77010405O56j98961j60873N0724J27852m77j52290j26540N6445J24276l1948
2467.9H76699269j99676j81555n901J19090L3855j51038j82986k4975P4447l8505j95205
2490.3H75946820j75596j7285O6698j1087j60038j90258j1623J26898Q643j87338k10404
2512.7H75185430k2054J49012M6551j86741k20001j2100J21534k2650k12192k21372
$$ plain form
2361.8 868110597 868728876 869361401 869958341 870680034 871703744 872852027 873777866 874485910 875154734
2380.2 875154734 875830829 876430929 876792789 876871586 876852512 876933277 877094448 877163708 877072036 876999855 877134562
2402.6 877134562 877360642 877412975 877256751 877124667 877173066 877315819 877361298 877235472 877100468 877118647
2423 877118647 877213240 877216220 877106786 877018332 877064288 877171755 877175331 877034187 876877129 876881897 877010405
2445.4 877010405 877011061 876812100 876651227 876701951 876829803 876829326 876677036 876550496 876606941 876731217 876699269
2467.9 876699269 876499593 876318038 876312137 876431227 876465082 876314044 876131058 876106083 876180530 876142025 875946820
2490.3 875946820 875771224 875753939 875820637 875809550 875649512 875459254 875447631 875574529 875583172 875395834 875185430
2512.7 875185430 875163376 875312388 875358939 875172198 874952197 874940097 875061631 875038981 874826789 874605417
2533.1H74605417o0618R4772L4809j49310j92880o0380N7042M232j43826j81973n6327
2555.6H73950958L5823m9472j75357j88470p6234K9623o2167k50519k50518p0751N3525
2578H72946441p15j70052k56360j55985l2544q0884k33710k71439j52171m3332j07110
2600.4H71442139k76744l17753j89364j00314j62482k47062k69711k16782j17302j17600
2620.8H69427025k27928k84672k05516j08421j52767k85327l16561k20358j39773j45853
2641.2H67339849k27034k87532k45274j86324j79290k10405k49386k25961j65105j63078
2661.6H65200460j88112j77801j78754j94967j74105j71662k09450k06590j85728k36452
2682H63276839k90870k65479k40207k50817k40922k03669j97887k50757l06546k88487
$$ plain form
2533.1 874605417 874544799 874639571 874674380 874525070 874332190 874271810 874328852 874333084 874189258 874007285 873950958
2555.6 873950958 873986781 873937309 873761952 873573482 873497248 873526871 873464704 873214185 872963667 872892916 872946441
2578 872946441 872945726 872775674 872519314 872363329 872330785 872249901 872016191 871744752 871592581 871549249 871442139
2600.4 871442139 871165395 870847642 870658278 870557964 870395482 870148420 869878709 869661927 869544625 869427025
2620.8 869427025 869199097 868914425 868708909 868600488 868447721 868162394 867845833 867625475 867485702 867339849
2641.2 867339849 867112815 866825283 866580009 866393685 866214395 866003990 865754604 865528643 865363538 865200460
2661.6 865200460 865012348 864834547 864655793 864460826 864286721 864115059 863905609 863699019 863513291 863276839
2682 863276839 862985969 862720490 862480283 862229466 861988544 861784875 861586988 861336231 861029685 860741198
2702.4H60741198k38180k50042k70247k79188k91825k72870k83956l10958k74181k21789
2722.8H58047962k02775k57373l79026m08351k90513j64449j84477l32892m00781l07739
2743.2H55119586j39773p6711k47181m42802m06921k28644k09689l83794m76778l73363
2763.6H52133930k34425k24114l15308l75986l23356k80618l66032m92871n53847m68909
2784H48498464l11137k70605m21405n94139n39422l56614l51548n58198o97315o05225
2804.4H43792856m59433m56750o14286p48217o73532n34475n40495o69360p76053p43925
2824.8H37576330o36757o43134p89583r35852r87709r57131j080513j498997j903892
2843.1H28142762k081811k097130j940012j588166j154184p54833m57824m04358o56545
$$ plain form
2702.4 860741198 860503018 860252976 859982729 859703541 859411716 859138846 858854890 858543932 858269751 858047962
2722.8 858047962 857845187 857587814 857208788 856800437 856509924 856345475 856160998 855828106 855427325 855119586
2743.2 855119586 854979813 854903102 854655921 854213119 853806198 853577554 853367865 852984071 852507293 852133930
2763.6 852133930 851899505 851675391 851360083 850984097 850660741 850380123 850014091 849521220 848967373 848498464
2784 848498464 848187327 847916722 847495317 846901178 846361756 846005142 845653594 845095396 844398081 843792856
2804.4 843792856 843333423 842876673 842262387 841514170 840840638 840306163 839765668 839096308 838320255 837576330
2824.8 837576330 836939573 836296439 835506856 834571004 833583295 832626164 831545651 830046654 828142762
2843.1 828142762 826060951 823963821 822023809 820435643 819281459 818526626 818068802 817664444 817007899
2861.5H17007899r87708j176894j261294j235485j084149j033127j065970r26196p25746
2879.9H07511330o89924p65860q28564q45015q62182r23991r80675j013994j070023
2898.2G99531102j113355j156688j246035j322150j361549j474798j731038j982271
2914.5G88143218k033890j849591j525343j149476q01682m51624j04905N1737J21713
2932.9G80400157L27527O27399R05156J141369J260102J098752P31886M43637L01063
2951.2G87237048M0352k48551j88768N1201J31607Q3506J04308K14815K97546L67761
2971.6G88090825L76344K73287K96772M27127L08632P4447P2717K06530L21746K48194
2992G90696621r2745l12805l59178m75049n58912n90027n64277m11928l33845m92513
$$ plain form
2861.5 817007899 816020191 814843297 813582003 812346518 811262369 810229242 809163272 808237076 807511330
2879.9 807511330 806821406 806055546 805226982 804381967 803519785 802595794 801615119 800601125 799531102
2898.2 799531102 798417747 797261059 796015024 794692874 793331325 791856527 790125489 788143218
2914.5 788143218 786109328 784259737 782734394 781584918 780783236 780331612 780226707 780278444 780400157
2932.9 780400157 780727684 781355083 782260239 783401608 784661710 785760462 786492348 786935985 787237048
2951.2 787237048 787277400 787028849 786840081 786891282 787022889 787106395 787210703 787425518 787723064 788090825
2971.6 788090825 788467169 788740456 789037228 789464355 789772987 789847434 789920151 790126681 790448427 790696621
2992 790696621 790603876 790291071 789931893 789456844 788897932 788307905 787743628 787331700 786997855 786505342
3012.4G86505342p44284q87155q80897q44360q69274r75847j030266q58367o90102
3030.8G78724790p59662j019060j236320j075864q07166r41991j292170j370847j155913
3049.1G69065797j058161j179278j278162j335084j298189j135469j064300j086116
3065.5G59631038j128137j230419j267970j175880j013279r05991j005113j190603
3081.8G50713646j304447j358688j303375j221120j299322j423716j401842j256645
3098.1G40144491j192987j331925j448929j373291j308024j418174j470208j344085
3114.4G29256868j318514j461685j688540j907706j877963j680911j624525j704335
3130.7G15992689j793861j812697j717746j693904j867533k000213j987993j932145
$$ plain form
3012.4 786505342 785761058 784873903 783993006 783148646 782279372 781303525 780273259 779414892 778724790
3030.8 778724790 777965128 776946068 775709748 774633884 773826718 772884727 771592557 770221710 769065797
3049.1 769065797 768007636 766828358 765550196 764215112 762916923 761781454 760717154 759631038
3065.5 759631038 758502901 757272482 756004512 754828632 753815353 752909362 751904249 750713646
3081.8 750713646 749409199 748050511 746747136 745526016 744226694 742802978 741401136 740144491
3098.1 740144491 738951504 737619579 736170650 734797359 733489335 732071161 730600953 729256868
3114.4 729256868 727938354 726476669 724788129 722880423 721002460 719321549 717697024 715992689
3130.7 715992689 714198828 712386131 710668385 708974481 707106948 705106735 703118742 701186597
3147G01186597j822829j743138j869380k148748k295077k203106k058149k024770k088427
3165.4F82932973k153576k139389k076209k084612k156497k214133k234698k228379
3181.7F65645480k195716k157509k163351k202689k222300k224922k254605k293826
3198F47930562k290487k241134k184630k134561k141357k191186k173245k088904k022147
3216.4F28462911k070845k183437k212047k152622k056599j950502j869679j875579
3232.7F12091601k011359k091467j988590j886427j810491j692296j668036j782596
3249E97160339j825750j700878j589238j629889j693547j656711j615465j595974j495480
3267.4E82357407j382232j478791j675368j745641j746058j707614j678586j701057
$$ plain form
3147 701186597 699363768 697620630 695751250 693602502 691307425 689104319 687046170 685021400 682932973
3165.4 682932973 680779397 678640008 676563799 674479187 672322690 670108557 667873859 665645480
3181.7 665645480 663449764 661292255 659128904 656926215 654703915 652478993 650224388 647930562
3198 647930562 645640075 643398941 641214311 639079750 636938393 634747207 632573962 630485058 628462911
3216.4 628462911 626392066 624208629 621996582 619843960 617787361 615836859 613967180 612091601
3232.7 612091601 610080242 607988775 606000185 604113758 602303267 600610971 598942935 597160339
3249 597160339 595334589 593633711 592044473 590414584 588721037 587064326 585448861 583852887 582357407
3267.4 582357407 580975175 579496384 577821016 576075375 574329317 572621703 570943117 569242060
3283.7E69242060j677453j610399j563727j615525j764595j870871j928568j898646
3300E55312276j747191j665890j753211j981616k235294k296090k189278k155602k178789
3318.4E37109315k133131k089202k125442k266109k402842k379716k282261k210796
3334.7E19219816k127171k179086k396286k521336k539038k439857k219736k281785
3351E00515521k610535k673089k425760k245725k306521k351403k127588j952350k170950
3369.3D79651600k510935k480358k134800j904905j830697j791566j741082j582920
3385.7D63674337j253605r04531r48458j335532j378029r04292o10680r53644j327217
3404D54058349j057029o28680n38915n50211o11156o58124m39704k01166j20014O0648
$$ plain form
3283.7 569242060 567564607 565954208 564390481 562774956 561010361 559139490 557210922 555312276
3300 555312276 553565085 551899195 550145984 548164368 545929074 543632984 541443706 539288104 537109315
3318.4 537109315 534976184 532886982 530761540 528495431 526092589 523712873 521430612 519219816
3334.7 519219816 517092645 514913559 512517273 509995937 507456899 505017042 502797306 500515521
3351 500515521 497904986 495231897 492806137 490560412 488253891 485902488 483774900 481822550 479651600
3369.3 479651600 477140665 474660307 472525507 470620602 468789905 466998339 465257257 463674337
3385.7 463674337 462420732 461516201 460567743 459232211 457854182 456949890 456339210 455385566 454058349
3404 454058349 453001320 452372640 451833725 451283514 450672358 450014234 449574530 449373364 449253350 449313998
3424.4D49313998L16471M80771M89116N58436P50273O57231L34978L60578P93934J172543
3444.8D55228329J253068J160115J231760J440674J594901J766265J895785J776010
3461.1D67346907J753240K161474K397924K002329J504361J543045J936883K310306
3477.4D82956469K395779K110213J990706K226263K293408K193749K277166K459675
3493.8E00903428K576410K486170K420366K529978K386034K118230K312481K738416
3510.1E20471513K897442K706468K447247K503813K799749L096402L024995K696693
3526.4E42644322K686381K912402L095448L247917L229082L070831L246427L614843
3542.7E67747653L658890L285587L063977L256559L420532L432453L588974L814161
$$ plain form
3424.4 449313998 449630469 450111240 450600356 451158792 451909065 452566296 452901274 453261852 454055786 455228329
3444.8 455228329 456481397 457641512 458873272 460313946 461908847 463675112 465570897 467346907
3461.1 467346907 469100147 471261621 473659545 475661874 477166235 478709280 480646163 482956469
3477.4 482956469 485352248 487462461 489453167 491679430 493972838 496166587 498443753 500903428
3493.8 500903428 503479838 505966008 508386374 510916352 513302386 515420616 517733097 520471513
3510.1 520471513 523368955 526075423 528522670 531026483 533826232 536922634 539947629 542644322
3526.4 542644322 545330703 548243105 551338553 554586470 557815552 560886383 564132810 567747653
3542.7 567747653 571406543 574692130 577756107 581012666 584433198 587865651 591454625 595268786
3559E95268786L809094L637791L778815M442513M480541L910899L852427M147768M321575
3577.4F31650209M478395M636467M611790M647374M809797M687607M408718M527509
3593.7F68457866M836023M945278M885852M742682M537880M508734M874885N046070
3610G06835270M909575M780054M547477M750252N046725M329204L616333L792406M858672
3628.4G47465968N146206M046320L681362L714979L636956L555656L382206L217339
3644.7G77846992L457546M137039L637195K331972K231002K783299K665877K189338
3661H01280260J910865J783431J815915J979470J906932J576662J610637J564443J252949
3679.4H16681564J188159J229763J345515J689613J642346Q97229O02245O89030P06613
$$ plain form
3559 595268786 599077880 602715671 606494486 610936999 615417540 619328439 623180866 627328634 631650209
3577.4 631650209 636128604 640765071 645376861 650024235 654834032 659521639 663930357 668457866
3593.7 668457866 673293889 678239167 683125019 687867701 692405581 696914315 701789200 706835270
3610 706835270 711744845 716524899 721072376 725822628 730869353 735198557 738814890 742607296 747465968
3628.4 747465968 752612174 756658494 760339856 764054835 767691791 771247447 774629653 777846992
3644.7 777846992 781304538 785441577 789078772 791410744 793641746 796425045 799090922 801280260
3661 801280260 803191125 804974556 806790471 808769941 810676873 812253535 813864172 815428615 816681564
3679.4 816681564 817869723 819099486 820445001 822134614 823776960 824674189 825276434 825965464 826672077
3697.7H26672077Q06570R29296P65026N93185O45101P84815Q21233O53505M37677L62217
3718.1H33470702M16875M49717M02033K72870K35022M12821O95110Q39710O99937L49045
3738.5H38243842J5974n4478K40445M18961K94625L73722M21881K83003J84298Q4459
3758.9H40506732J9491R7752K49266L07680J98245N4776Q2851K36153L84808L13997
3779.3H42451751L9280k3127P7069J00315P1465N5194J55509L12924K69890J30475
3799.7H43640745P4684K5273L993O0n4121j5915J48833K70903K45154J37150L1591
3822.1H44508350N722O6757L1650j22547J490L66330L23057q8810k16484p9036O4611
3844.6H44861090M6909j23084k57492k03549J84893K89500P8320r656J8001J19l1531
$$ plain form
3697.7 826672077 827478647 828407943 829172969 829766154 830411255 831196070 832017303 832670808 833108485 833470702
3718.1 833470702 833887577 834337294 834739327 835012197 835247219 835660040 836355150 837194860 837894797 838243842
3738.5 838243842 838259816 838205338 838445783 838864744 839159369 839533091 839954972 840237975 840422273 840506732
3758.9 840506732 840526223 840623975 840873241 841180921 841379166 841433942 841516793 841752946 842137754 842451751
3779.3 842451751 842491031 842467904 842544973 842645288 842716753 842771947 842927456 843240380 843510270 843640745
3799.7 843640745 843715429 843740702 843744695 843744755 843690634 843674719 843823552 844094455 844339609 844476759 844508350
3822.1 844508350 844514072 844580829 844612479 844489932 844491422 844857752 845180809 845091999 844875515 844796479 844861090
3844.6 844861090 844907999 844784915 844527423 844323874 844508767 844798267 844876587 844866931 844884932 844885051 844853520
3867H44853520M7386J50621O8069l5108k2947J1563O7711J30117O2763j14023j42336
3889.4H45077336m2737J669L398q166n6327m8577J3709J1146k6345k1160K4855M2617
3913.9H44971418L8207K5094k9028o0677m9055l1352L4928J08540J04547R894j04070
3936.3H45018446q5949L4689R3937M7028k8610l7968k0802k2233J20M2259N8175K9206
3960.8H45128298r597l337M7087P7546M7564J9968Q5950J81496J46210L2485J5557
3983.2H45769227J967p3851m8041J7643L5286M7862P928
3997.5H45758021
$$ plain form
3867 844853520 844900906 845051527 845119596 845084488 845061541 845073104 845140815 845270932 845333695 845219672 845077336
3889.4 845077336 845034599 845036268 845039666 845031500 844975173 844926596 844940305 844951451 844925106 844903946 844928801 844971418
3913.9 844971418 845009625 845034719 845005691 844945014 844895959 844864607 844899535 845008075 845112622 845122516 845018446
3936.3 845018446 844932497 844967186 845061123 845108151 845079541 845041573 845020771 844998538 844998658 845040917 845099092 845128298
3960.8 845128298 845118701 845115364 845162451 845239997 845287561 845307529 845393479 845574975 845721185 845753670 845769227
3983.2 845769227 845771194 845697343 845649302 845666945 845702231 845750093 845758021
3997.5 845758021
##END=$$ End of the data block
