##TITLE=$$ Begin of the data block
##JCAMP-DX=5.00 $$ ACD/SpecManager v 10.08
##SPECTROMETER/DATA SYSTEM=Alpha
##DATE=09 Apr 2014 11:14:46
##DATA TYPE=INFRARED SPECTRUM
##DATA CLASS=XYDATA
##ORIGIN=
##OWNER=
##NPOINTS=1765
##FIRSTX=399.75695801
##LASTX=3997.56933594
##MAXX=3997.56933594
##MINX=399.75695801
##MAXY=0.87898111
##MINY=0.44952580
##XFACTOR=1.0000000000
##YFACTOR=1.000000000000000e-9
##FIRSTY=0.74292779
##DELTAX=2.03957629
##XUNITS=1/CM
##YUNITS=ARBITRARY UNITS
##XYDATA=(X++(Y..Y))
399.8G42927790n14090J212537j139283l649056k352119J377762K706885M77314k392590
418.1G38655150j879215J198768P89166k719045l869176l66211K889872J147568k975464
436.5G32871413l187060P55608K935111L34442l026247k559721R10282K436995O974
454.8G31477797k651870j790762J258731J651823j195073l240645j518547J504302
471.1G25495756J211464j898706k802491m59910J925469J202047j614571k387285j21832
489.5G20549941J816034M83513k371847k805472l19958J702130L29972k330900k271652
507.9G14781761J50442J182497l35574k022565j555681L66986P62880r34661k510786
526.2G09885299j859665k444M28558q75592j793981r44197M73738M23491r86517j556873
$$ plain form
399.8 742927790 742413700 743626237 742486954 738837898 736485779 737863541 740570426 741047740 738655150
418.1 738655150 736775935 737974703 738763869 736044824 732175648 731809437 734699309 735846877 732871413
436.5 732871413 729684353 730439961 733375072 733709514 730683267 728123546 729033828 731470823 731477797
454.8 731477797 728825927 727035165 728293896 729945719 728750646 725510001 723991454 725495756
471.1 725495756 726707220 724808514 722006023 721546113 723471582 724673629 723059058 720671773 720549941
489.5 720549941 722365975 722849488 720477641 717672169 717352211 719054341 719384313 717053413 714781761
507.9 714781761 714932203 716114700 715779126 713756561 712200880 712567866 713330746 712396085 709885299
526.2 709885299 708025634 708023190 708451748 707576156 705782175 704837978 705311716 705735207 704748690 703191817
546.6G03191817n23925L12328l42786j501977j599491o17564L7790n74828j517355
565F96864009j535118q89897o80804j313627j917958j652122r46700q20756j311899
583.3F85795128j532137j051009n54323q87632j578987j359463n48005o29008j654863
601.7F75999701k186596j414240j39296K06649n97476j081527j73509J565337K577484
620F74756527K295196K127945K941430L607333K971530J718759J358211K170027K695024
638.4F96641982J702189j2219k54214J641572L197610K029479n33939j156687J205086
656.7G04460859L973902M073262K233803J184225K108812L892601K445459O60658R20296
675.1G25953877K527297L285288J935840J49786L45409K041996K574444J027822n91159
$$ plain form
546.6 703191817 702667892 702980220 702637434 701135457 699535966 698918402 698956192 698381364 696864009
565 696864009 695328891 694438994 693758190 692444563 690526605 688874483 687927783 687107027 685795128
583.3 685795128 684262991 683211982 682657659 681770027 680191040 678831577 678283572 677654564 675999701
601.7 675999701 673813105 672398865 672259569 672466218 671868742 670787215 670613706 672179043 674756527
620 674756527 677051723 679179668 682121098 685728431 688699961 690418720 691776931 693946958 696641982
638.4 696641982 698344171 698331952 698077738 699719310 702916920 704946399 704412460 703255773 704460859
656.7 704460859 708434761 712508023 714741826 715926051 718034863 721927464 724372923 725033581 725953877
675.1 725953877 728481174 731766462 733702302 733852088 734197497 736239493 738813937 739841759 739250600
693.5G39250600j49488J607239K153754P76828n11647K25604K186358K772152J204312
711.8G49515712k44081N12302K399743K815902J197159j94549N66959K389491K688110
730.2G61646748R25541n46873K70307K193689K519250P38144o21855M29511K445400
748.5G69999862K662897Q94964l54588O33239K440512K536834P92920m19318M85897
766.9G79673219K026558J907229R6440j198470m89474Q78931P60614q09967j753628
785.2G81091452p47085J128912J815021J017928O77109K146661M059732M294515K937257
803.6G98421502J952648K497912L368199K820372J101554Q4817N74410J182377M34935
821.9H12438726j212775k201975j903236j297414j641691k614438k848685k000928
$$ plain form
693.5 739250600 739101112 740708351 742862105 743638933 743127286 743352890 745539248 748311400 749515712
711.8 749515712 749271631 749783933 752183676 754999578 756196737 756002188 756569147 758958638 761646748
730.2 761646748 762572289 762025416 762295723 764489412 767008662 767746806 767124951 767554462 769999862
748.5 769999862 772662759 773557723 773203135 773836374 776276886 778813720 779606640 779187322 779673219
766.9 779673219 781699777 783607006 783703446 782504976 782015502 782894433 783655047 782845080 781091452
785.2 781091452 780344367 781473279 783288300 784306228 784983337 787129998 791189730 795484245 798421502
803.6 798421502 800374150 802872062 806240261 809060633 810162187 810247004 810821414 812003791 812438726
821.9 812438726 811225951 809023976 807120740 805823326 804181635 801567197 798718512 796717584
838.3G96717584j207352j455485k170325j994848n73039J062751J993477K570272L574967
856.6G98518002M876435N541742N127251M314005L942788L891349L395796K306103
872.9H31913471J393616J170457J213729Q42631m5896q74996j075566q64207q98779
891.3H32774460j165330r82404j35302P65085J077890Q35359O82652R37581R63569
909.6H35753560J45912j028001j588285j465380j478732j961470k182424j412570q9645
928H24692965O50227M41491K5690J64628O57201O31809j75178r21250q18550l81053
948.4H24967980o77526j767933k750874k977907k863467l406823m851102o240905o773472
966.8G92657971o857335p254064p883907p847726o583154m774392l703952l675401
$$ plain form
838.3 796717584 795510232 794054747 791884422 789889574 789316535 790379286 792372763 794943035 798518002
856.6 798518002 803394437 808936179 814063430 818377435 822320223 826211572 829607368 831913471
872.9 831913471 833307087 834477544 835691273 836533904 836488008 835613012 834537446 833673239 832774460
891.3 832774460 831609130 830626726 830491424 831256509 832334399 833169758 833852410 834789991 835753560
909.6 835753560 835899472 834871471 833283186 831817806 830339074 828377604 826195180 824782610 824692965
928 824692965 825343192 825784683 825810373 825975001 826632202 827264011 827088833 826167583 825349033 824967980
948.4 824967980 824290454 822522521 819771647 816793740 813930273 810523450 805672348 799431443 792657971
966.8 792657971 785800636 778546572 770662665 762814939 756231785 751457393 747753441 744078040
983.1G44078040l757179l152907k167701j701236j990020k217293j623452o31749k78235
1001.4G26558268q59737j677931j984894j969874k409875l424526m209995m018545
1017.7G06002891l207505k856612l310561l784478l505230k716779k257288k400339
1034.1F81964099k495050j952231j152575r48966j501858k069711k000034j469136
1050.4F68374538j053094r20713o24121K44379J220107J397610N36025o78778j470804
1068.7F67025149j762509k019585k561807l053606l009140k632916k588988l104448
1085F46292150l727198l826737l288925k508044j769900j034797j84774N94914R11415
1103.4F31458104O53445J77205j05917j96994m89890j262129k442360l622412l970921
$$ plain form
983.1 744078040 740320861 737167954 735000253 733299017 731308997 729091704 727468252 726836503 726558268
1001.4 726558268 725698531 724020600 722035706 720065832 717655957 714231431 710021436 706002891
1017.7 706002891 702795386 699938774 696628213 692843735 689338505 686621726 684364438 681964099
1034.1 681964099 679469049 677516818 676364243 675415277 673913419 671843708 669843674 668374538
1050.4 668374538 667321444 666400731 665776610 666020989 667241096 668638706 669174731 668495953 667025149
1068.7 667025149 665262640 663243055 660681248 657627642 654618502 651985586 649396598 646292150
1085 646292150 642564952 638738215 635449290 632941246 631171346 630136549 629951775 630546689 631458104
1103.4 631458104 632111549 632288754 632182837 631985843 631495953 630233824 627791464 624169052 620198131
1121.8F20198131k909243j242698k9564J024306J629234J229882R94265J607895K358377
1140.1F24860585K720475K623796K181411J708329J457214J419843J499056J651466
1156.4F40122175J941204K438426L111542L890752M676879N300104N664945N757272
1172.7F72903299N613923N352259N050123M669189M123271L388464K549708J730681
1189.1G05380917R30070J22905m35054m23729J20878Q96632J503826J747667J854897
1207.4G11699009J945853J792193J274764O76751M30167O12378Q23379P17401M63724
1225.8G20435619N01931R48906J363754J327634J038432J020491J378775J623929J307070
1244.1G30946541O49512L21388N03778O77646M20630j6392O56P06732J514137J779675
$$ plain form
1121.8 620198131 617288888 616046190 616016626 617040932 618670166 619900048 620894313 622502208 624860585
1140.1 624860585 627581060 630204856 632386267 634094596 635551810 636971653 638470709 640122175
1156.4 640122175 642063379 644501805 647613347 651504099 656180978 661481082 667146027 672903299
1172.7 672903299 678517222 683869481 688919604 693588793 697712064 701100528 703650236 705380917
1189.1 705380917 706310987 706433892 705998838 705575109 705695987 706592619 708096445 709844112 711699009
1207.4 711699009 713644862 715437055 716711819 717388570 717818737 718431115 719254494 719971895 720435619
1225.8 720435619 720937550 721886456 723250210 724577844 725616276 726636767 728015542 729639471 730946541
1244.1 730946541 731596053 731917441 732421219 733098865 733519495 733503103 733503759 734210491 735724628 737504303
1264.5G37504303J692772J883269K594471L242016L149986K617836K460241K938330
1280.8G58083224L492654L441095K868414K542078K871097L298878L035665K161443
1297.2G81794548J565576J755893K169251J914800J019477M39823P22766J238883J097440
1315.5G93718457M21822R9540O10709J341641J379609P19548K34127M58479Q92579
1333.9G99876511P82132N7817n51403k24054N80728P80881K06888k47360O0559O39855
1354.3H01962554N70536j57893o93261o10054k88248l58105r18865j283109r58264
1372.6G97265291n83768q48055j844465l195703l372312j338839R68396R26793k16663
1391G87760675m41492k30968n17487j488567k123832j893938j545071j428664j594305
$$ plain form
1264.5 737504303 739197075 741080344 743674815 746916831 750066817 752684653 755144894 758083224
1280.8 758083224 761575878 765016973 767885387 770427465 773298562 776597440 779633105 781794548
1297.2 781794548 783360124 785116017 787285268 789200068 790219545 790659368 791382134 792621017 793718457
1315.5 793718457 794140279 794239819 794850528 796192169 797571778 798291326 798525453 798983932 799876511
1333.9 799876511 800658643 800716460 800165057 799941003 800521731 801302612 801509500 801262140 801322699 801962554
1354.3 801962554 802533090 802375197 801681936 801071882 800783634 800425529 799506664 798223555 797265291
1372.6 797265291 796681523 795833468 793989003 790793300 787420988 786082149 787050545 787977338 787760675
1391 787760675 787319183 787088215 786570728 785082161 782958329 781064391 779519320 778090656 776496351
1409.3G76496351j760245j334667n23329k04086q11934j186848p61092k56479L4214
1427.7G69691885j05918l56853j7583P19130R39429N47111N23209Q66115J418174J806020
1448.1G76030719J708687J645803K150834L658712M474163K886474K472818L280401
1464.4G98308611L587723L228664L547609M348576L876388K843022K299667J820862
1480.7H23861122J324296J009405R69052N24700n51462r71675q50439j170159j765728
1499.1H22379112j863539j470208j407147l041088l801763k989888k513409k132118
1515.4H03159952j896322j646757j792907j969398j745641j794874j570702j204968
1531.7G89538383j270055j039148l81052l72470j114368j001894n92769k17318P6592
$$ plain form
1409.3 776496351 774736106 773401439 772878110 772674024 771862090 770675242 769914150 769657671 769691885
1427.7 769691885 769585967 769229114 769211531 769930661 770870090 771417201 771940410 772806525 774224699 776030719
1448.1 776030719 777739406 779385209 781536043 785194755 789668918 792555392 795028210 798308611
1464.4 798308611 801896334 805124998 808672607 813021183 816897571 819740593 822040260 823861122
1480.7 823861122 825185418 826194823 827163875 827688575 827137113 826165438 825314999 824144840 822379112
1499.1 822379112 820515573 819045365 817638218 814597130 810795367 807805479 805292070 803159952
1515.4 803159952 801263630 799616873 797823966 795854568 794108927 792314053 790743351 789538383
1531.7 789538383 788268328 787229180 786848128 786475658 785361290 784359396 783766627 783549309 783625901
1550.1G83625901L76820P73073J132488J056373n35786j063466p01964p17163j363695
1568.4G82582581k457917k486884k328694l553093m242181m071117m287600m355669
1584.7G54799426m472793m877805n279422n324364n190730n061746n119979n370438
1601.1G14102149n402029n059659m883111n216896n365670m870236m812836n536914
1617.4F72954798m606664l760696m193306l983676l430546l130853k254486j211941
1633.7F46382630n47469j23203L52800R57489J713097L090680L820598K804041L467321
1652F61917984N234361L721476L292262M110277M904449M930079M447401N317866O179333
1670.4G04055488N054176N086303N794882N323530N084812N875469P377147O052971
$$ plain form
1550.1 783625901 784002721 784775794 785908282 786964655 786428869 785365403 784663439 783946276 782582581
1568.4 782582581 780124664 777637780 775309086 771755993 767513812 763442695 759155095 754799426
1584.7 754799426 750326633 745448828 740169406 734845042 729654312 724592566 719472587 714102149
1601.1 714102149 708700120 703640461 698757350 693540454 688174784 683304548 678491712 672954798
1617.4 672954798 668348134 664587438 660394132 656410456 652979910 649849057 647594571 646382630
1633.7 646382630 645835161 645711958 646064758 647022247 648735344 651826024 655646622 658450663 661917984
1652 661917984 667152345 670873821 674166083 678276360 683180809 688110888 692558289 697876155 704055488
1670.4 704055488 709109664 714195967 719990849 725314379 730399191 736274660 743651807 749704778
1686.7G49704778N041361N412102M977345N548656O434560O466210O985307N257487
1703G95827806M328609M517316L908635L509223L293991L169954L261864K571464J842975
1721.4H26231837J765430J795352J851678K132058K220809K168000J611114J332461
1737.7H41108739J839698K000391J720727J628995J786470J883805J532554J073778
1754H54575157J028180J100481J152396J165927Q51273P05957Q76606J096368J043856
1772.4H63596201N55396K86579M69268O67572O46531N46634M69148N68927P89463P43211
1792.8H69338930L86476K93672M15325M72129L61025K62380L11971M04417L70383K29538
1813.2H72846246K09868K63393K78771K86281L38435L48687L48866L07679P1943K265
$$ plain form
1686.7 749704778 754746139 760158241 765135586 770684242 777118802 783585012 790570319 795827806
1703 795827806 800156415 804673731 808582366 812091589 815385580 818555534 821817398 824388862 826231837
1721.4 826231837 827997267 829792619 831644297 833776355 835997164 838165164 839776278 841108739
1737.7 841108739 842948437 844948828 846669555 848298550 850085020 851968825 853501379 854575157
1754 854575157 855603337 856703818 857856214 859022141 859873414 860579371 861455977 862552345 863596201
1772.4 863596201 864151597 864438176 864907444 865575016 866221547 866768181 867237329 867806256 868595719 869338930
1792.8 869338930 869725406 870019078 870434403 870906532 871267557 871529937 871841908 872246325 872616708 872846246
1813.2 872846246 873056114 873319507 873598278 873884559 874222994 874571681 874920547 875228226 875300169 875302434
1833.6H75302434J48237K21073K24829K93195K97249J30772M9293R2328Q6844N9426
1854H76905680J09851J79350J78576J09374J17362K53797L01897P2122j25408r0242
1874.4H78012359L7432J56402J59622L0040n6088P7606K39849J20878q0943j15574
1894.7H78581583m2855R9480J56999q95j45256k4319J88232J35898r7990j51038J1921
1917.2H78711760J59204J10149j34229l19422j75535Q9407J40071o7592k56360j26481
1937.6H78130972J69158J93119j46031l77178k18988O8486J11282j42217l47852k56479
1958H77184272K920R1374r2029k69771k07960j2398K1755j71422l21925j99557N0664
1980.4H76075923J00077j18077k88427j73330M9889M0233j91331l14057k04980J967
$$ plain form
1833.6 875302434 875450671 875671744 875896573 876189768 876487017 876617789 876667082 876759410 876846254 876905680
1854 876905680 877015531 877194881 877373457 877482831 877600193 877853990 878155887 878228009 878102601 878012359
1874.4 878012359 878049791 878206193 878365815 878395855 878339767 878417373 878657222 878778100 878697157 878581583
1894.7 878581583 878538728 878638208 878795207 878794312 878649056 878624737 878812969 878948867 878850877 878699839 878711760
1917.2 878711760 878870964 878981113 878846884 878527462 878351927 878441334 878581405 878513813 878257453 878130972
1937.6 878130972 878300130 878493249 878347218 877970040 877751052 877819538 877930820 877788603 877440751 877184272
1958 877184272 877187192 877278566 877186537 876916766 876708806 876696408 876718163 876546741 876224816 876025259 876075923
1980.4 876075923 876176000 876057923 875769496 875596166 875646055 875686288 875494957 875180900 874975920 874977887
2000.8H74977887K9683j73271l17395k11894O497O7949j11520k95580k28822k1160
2021.2H73722374L1352j43885l14236k45750j2159O0499r6441k10166j41143R000M2081
2043.6H72701526j02163k26259j36137M7684O3956j04785k21432j36137M0710J07646
2064H72034609l2663j93596j44243K5332O8724m4465j23561o1273M3631P1704K9981
2086.5H71674180k2352l4392o675R536j0430l1948j8299L5405O2883M5121K8908J6451
2110.9H71748388J7285J1504P927L5823O0796O6936O3599N5909O6340O0439K5451M5657
2135.4H72266054Q8632O9976L2246L7492O6876R0837P6175M1902N6684R3997J06275
2157.9H73027146R1135P7129O9618O9559J06275J29997R3937K8789o973M0531J04487
$$ plain form
2000.8 874977887 875007570 874834299 874516904 874305010 874311507 874379456 874267936 873972356 873743534 873722374
2021.2 873722374 873753726 873609841 873295605 873049855 873037696 873098195 873001754 872791588 872650445 872659445 872701526
2043.6 872701526 872599363 872373104 872236967 872284651 872348607 872243822 872022390 871886253 871926963 872034609
2064 872034609 872001946 871808350 871664107 871689439 871758163 871713698 871590137 871528864 871572495 871644199 871674180
2086.5 871674180 871651828 871617436 871610761 871620297 871609867 871577919 871559620 871595025 871657908 871703029 871731937 871748388
2110.9 871748388 871765673 871777177 871785104 871820927 871881723 871948659 872012258 872068167 872134507 872194946 872220397 872266054
2135.4 872266054 872354686 872424662 872456908 872494400 872561276 872652113 872728288 872770190 872826874 872920871 873027146
2157.9 873027146 873118281 873195410 873265028 873334587 873440862 873570859 873664796 873693585 873686612 873727143 873831630
2180.3H73831630Q7023M3869M7743R1731J22071P4863o139n186O9022J10269N8830
2202.7H74525726m4108o3121N6744J37686N8532n2511o6817L7253J53422R3341q4818
2225.2H74751329j23262J8716J32799Q4281n8949j24812j0967J26779Q3208q7500j41978
2247.6H74649644r894Q2075n841j19090j10209r120R4533M4406j23203j37031M5359
2270H74401629J81973J07050o0320r1732P2837K08259R7990j23024j75595l0935Q2791
2292.5H74670923j0610k17736k49862o9082L9577q2433k92003l36230j67131l815p4327
2314.9H73207271l42011n02766l24308m8638p8022l11077l53277r9063J21534K5332
2335.3H71294975k43842l23773m2081L95298P00117N43236n7399o26445p82549o26028
$$ plain form
2180.3 873831630 873918653 873962522 874010265 874101996 874224067 874298930 874292791 874287605 874356627 874466896 874525726
2202.7 874525726 874481618 874418497 874475241 874612927 874671459 874618948 874552131 874589384 874742806 874836147 874751329
2225.2 874751329 874628067 874646783 874779582 874863863 874804914 874680102 874669135 874795914 874879122 874791622 874649644
2247.6 874649644 874639750 874721825 874715984 874596894 874486685 874477565 874572098 874616504 874493301 874356270 874401629
2270 874401629 874583602 874690652 874630332 874538600 874611437 874819696 874917686 874794662 874619067 874588132 874670923
2292.5 874670923 874660313 874442577 874192715 874123633 874163210 874080777 873788774 873452544 873285413 873281598 873207271
2314.9 873207271 872865260 872362494 872038186 871989548 871911526 871600449 871247172 871148109 871269643 871294975
2335.3 871294975 871051133 870727360 870685279 871080577 871780694 872323930 872266531 871640086 870857537 870231509
2355.7H70231509m29272r5487K32696L91841N04494N40912O09160Q69810J010418Q43346
2376.1H74709427O28531N69284O13869N71191L24666N3823n126J11223J89662P9870
2396.5H77846420j22488j18434R6261J90974P1346r0777j21236M2438J87576N0366
2416.9H78032446j73628j40310N1618J15037j2696j69754j53959N2572J89185P1883
2437.3H77862394j33872j75059L159J54913K7954j97709j79290M3988J61588K4974
2457.7H77593040k00390k16902J6332J67191J7345k04086j98126j3352Q7738L994j47760
2480.1H76905024j60456k98R6202l0100k14994j85609J4782J04845k6644k09391j94013
2502.5H76099348K7478J63793K1994k10702k27332n186J35541K027k03431k24948m5657
$$ plain form
2355.7 870231509 869802237 869706750 869939446 870331287 870835781 871376693 871985853 872855663 873866081 874709427
2376.1 874709427 875337958 875907242 876521111 877092302 877416968 877470791 877465665 877576888 877766550 877846420
2396.5 877846420 877723932 877605498 877701759 877892733 877964079 877873302 877752066 877794504 877982080 878032446
2416.9 878032446 877858818 877718508 877770126 877885163 877872467 877702713 877548754 877601326 877790511 877862394
2437.3 877862394 877728522 877553463 877556622 877711535 877739489 877541780 877362490 877406478 877568066 877593040
2457.7 877593040 877392650 877175748 877192080 877359271 877376616 877172530 876974404 876961052 877048790 877052784 876905024
2480.1 876905024 876744568 876744270 876840472 876810372 876595378 876409769 876424551 876529396 876502752 876293361 876099348
2502.5 876099348 876126826 876290619 876312613 876101911 875874579 875869393 876004934 876006961 875803530 875578582 875532925
2525H75532925J10269K7299j73331k00629l3557R1254k0682k30015k11000Q881J26839
2547.4H75028253J3291j77919k18332q1420L3915k9802j91629k25664n4657Q5831k2710
2569.8H74159157k32696k57015q8394K8372l8743j80066k34723j44482j4901m7088
2590.2H72949421k24173k84791j53303l3080r8110k78175l22282j86086j14262j70767
2610.6H71084392k17259k45869k29716j43051j16408j89484k63094k49327j72138j63197
2631H69094849k45095k68638j83105j22547j67191k73884l18050k36571j45018j50442
2651.4H66984308k31505k95818k57074j60039j33514j80900j96934j81198j88709k04861
2671.8H64953756k06887j79768j41859j55151k29001k70307k40088k46822l11435k99811
$$ plain form
2525 875532925 875643194 875670493 875497162 875296533 875262976 875354230 875333548 875103533 874892533 874901414 875028253
2547.4 875028253 875041544 874863625 874645293 874563873 874597788 874567986 874376357 874150693 874096036 874181867 874159157
2569.8 874159157 873926461 873669446 873581052 873609424 873570681 873390615 873155892 873011410 872996509 872949421
2590.2 872949421 872725248 872440457 872287154 872254074 872155964 871877789 871555507 871369421 871255159 871084392
2610.6 871084392 870867133 870621264 870391548 870248497 870132089 869942605 869679511 869430184 869258046 869094849
2631 869094849 868849754 868581116 868398011 868275464 868108273 867834389 867516339 867279768 867134750 866984308
2651.4 866984308 866752803 866456985 866199911 866039872 865906358 865725458 865528524 865347326 865158617 864953756
2671.8 864953756 864746869 864567101 864425242 864270091 864041090 863770783 863530695 863283873 862972438 862672627
2692.2H62672627k04623j91033k67923k90036k20299j80006k51114l18825l27528k96652
2712.6H60124588k30610k55704l29256k90692k19286j93178k57671l85583l92496k88010
2733H57282102j89602j85967l27945m14311k95878j20103j02818k86758m41849l64185
2753.4H54552686j84178j93596l95417m96567l92794k52783k27452l17871l65258k91884
2773.8H51434886k77638l78370m89295n55873m77314k86340k20001m04775o03795n31972
2794.2H47209513l53575l91244o08623p23422o07491m37080m32432o04749p37786o57320
2814.6H41655791n23269n24164o56902p90954p90596p00831o58632p38561q76248r44018
2835H34451616r41754j102626j522422j911700k095758k089560j903475j587212j179516
$$ plain form
2692.2 862672627 862468004 862276971 862009048 861719012 861498713 861318707 861067593 860748768 860421240 860124588
2712.6 860124588 859893978 859638274 859309018 859018326 858799040 858605862 858348191 857962608 857570112 857282102
2733 857282102 857092500 856906533 856578588 856164277 855868399 855748296 855645478 855358720 854916871 854552686
2753.4 854552686 854368508 854174912 853779495 853282928 852890134 852637351 852409899 852092028 851726770 851434886
2773.8 851434886 851157248 850778878 850289583 849733710 849256396 848970056 848750055 848345280 847741485 847209513
2794.2 847209513 846855938 846464694 845856071 845132649 844525158 844088078 843655646 843050897 842313111 841655791
2814.6 841655791 841132522 840608358 839951456 839160502 838369906 837669075 837010443 836271882 835395634 834451616
2835 834451616 833509862 832407236 830884814 828973114 826877356 824787796 822884321 821297109 820117593
2853.3H20117593p54416m59135m25756o63101r68874j161992j265526j251221j087785
2871.7H12079787j031399j105546r68159p15375o60598p36296p90775q20339q72373
2890.1H04378927r50694r90272r99927j055718j110732j135588j210511j316726j379788
2908.4G94228971j484990j746655k013683k046525j839996j519620j148880p99656
2924.7G81628966m52876j09911M7505J11997L22402O29186R25124J188696J272320
2943.1G85563409J070083P26044M39465K67446L5345k05099j65105L6299J37150J14382
2963.5G88019419R9599K10643L40760L62515K89202K20716L26454M51625K83182P0571
2983.9G90674686J30356K84254L45052K02298j34170l20018l37421m42505n60165o17325
$$ plain form
2853.3 820117593 819363177 818904042 818478286 817815185 816846311 815684319 814418793 813167572 812079787
2871.7 812079787 811048388 809942842 808974683 808259308 807598710 806862414 806071639 805251300 804378927
2890.1 804378927 803428233 802437961 801438034 800382316 799271584 798135996 796925485 795608759 794228971
2908.4 794228971 792743981 790997326 788983643 786937118 785097122 783577502 782428622 781628966
2924.7 781628966 781176090 781066179 781113684 781225681 781548083 782177269 783102393 784291089 785563409
2943.1 785563409 786633492 787359536 787799001 788066447 788101792 787896693 787731588 787767887 787905037 788019419
2963.5 788019419 788119018 788329661 788670421 789032936 789322138 789542854 789869308 790320933 790604115 790674686
2983.9 790674686 790805042 791089296 791434348 791636646 791502476 791182458 790845037 790402532 789842367 789225042
3004.3G89225042o01411m44710l11792m27723o87420q51453q74579q72254r01342r71674
3024.7G82280684j012266q60632o85870p77722j067876j213551r99928p99954r93192
3043G73869693j307010j337111j131773j067698j199603j283706j310825j272321j130521
3061.4G62829125j038253j053989j147867j253485j251579j157522j022398r24886
3077.7G53979146j001119j173496j288474j351178j323521j251936j317978j416504
3094G43854940j353502j196385j161039j327872j463115j381993j297772j446963j505375
3112.4G31720924j287520j265525j498759j732648j918912j899659j717925j623452
3128.7G18776524j689911j813769j824677j705110j680970j858890j983524j961052
$$ plain form
3004.3 789225042 788623631 788178921 787867129 787439406 786751986 785900533 785025954 784153700 783252358 782280684
3024.7 782280684 781268418 780407786 779721916 778944194 777876318 776662767 775662839 774862885 773869693
3043 773869693 772562683 771225572 770093799 769026101 767826498 766542792 765231967 763959646 762829125
3061.4 762829125 761790872 760736883 759589016 758335531 757083952 755926430 754904032 753979146
3077.7 753979146 752978027 751804531 750516057 749164879 747841358 746589422 745271444 743854940
3094 743854940 742501438 741305053 740144014 738816142 737353027 735971034 734673262 733226299 731720924
3112.4 731720924 730433404 729167879 727669120 725936472 724017560 722117901 720399976 718776524
3128.7 718776524 717086613 715272844 713448167 711743057 710062087 708203197 706219673 704258621
3145G04258621j914680j775861j646519j841247k212226k332688k219081k087295k041220
3163.4F86187804k104044k148152k124905k106071k109587k143264k205431k248466
3179.7F68997884k251983k217054k179027k200484k252638k259195k230883k219915
3196F51186705k254010k300381k280355k203941k142072k132892k144695k133786k123893
3214.3F31470680k118110k147973k223492k208709k095104k021193j985908j937270
3230.7F14732921j888156j934349k029300k027810j950442j817585j678288j663208
3247E99743783j771986j789033j650274j585543j691640j746356j663387j616418j559496
3265.3E84669650j417995j366138j524985j713634j765072j744211j692593j681626
$$ plain form
3145 704258621 702343941 700568080 698921561 697080314 694868088 692535400 690316319 688229024 686187804
3163.4 686187804 684083760 681935608 679810703 677704632 675595045 673451781 671246350 668997884
3179.7 668997884 666745901 664528847 662349820 660149336 657896698 655637503 653406620 651186705
3196 651186705 648932695 646632314 644351959 642148018 640005946 637873054 635728359 633594573 631470680
3214.3 631470680 629352570 627204597 624981105 622772396 620677292 618656099 616670191 614732921
3230.7 614732921 612844765 610910416 608881116 606853306 604902864 603085279 601406991 599743783
3247 599743783 597971797 596182764 594532490 592946947 591255307 589508951 587845564 586229146 584669650
3265.3 584669650 583251655 581885517 580360532 578646898 576881826 575137615 573445022 571763396
3281.6E71763396j734912j712442j599550j533150j595498j747846j876891j953244
3298E58009863j928687j769006j682222j797080k002836k195120k297282k262592k167463
3316.3E39907575k110660k116740k126217k127886k245545k396107k387226k317667
3332.6E22079527k252519k162456k227366k394498k474963k557278k492368k223373
3348.9E03294706k255559k609968k733320k491504k240091k249241k299249k131552
3365.3D84284222k008974k216757k533585k510577k163678j897067j829982j856685
3381.6D67266917j780003j534700j226217r28432r42588j286685j347572r56356p00116
3399.9D56564248r58652j294136j119882p20411n33044m83424n54979o00368m00155
$$ plain form
3281.6 571763396 570028484 568316042 566716492 565183342 563587844 561839998 559963107 558009863
3298 558009863 556081176 554312170 552629948 550832868 548830032 546634912 544337630 542075038 539907575
3316.3 539907575 537796915 535680175 533553958 531426072 529180527 526784420 524397194 522079527
3332.6 522079527 519827008 517664552 515437186 513042688 510567725 508010447 505518079 503294706
3348.9 503294706 501039147 498429179 495695859 493204355 490964264 488715023 486415774 484284222
3365.3 484284222 482275248 480058491 477524906 475014329 472850651 470953584 469123602 467266917
3381.6 467266917 465486914 463952214 462725997 461797565 460854977 459568292 458220720 457264364 456564248
3399.9 456564248 455605596 454311460 453191578 452471167 451938123 451454699 450899720 450299352 449899197
3418.3D49899197k14458j58936M679K81930M92633M99606N73158P82073O71655L58134
3438.7D53189671L90321P48456J100808J247197J198441J252860J411736J551092J748770
3457D63839352J922369J834840J796305K173483K381921J960576J490861J588911J985341
3475.4D80973959K306879K339810K063542K013922K296060K328396K183110K299696
3491.7D98805374K497643K552807K456189K482235K626181K413332K084077K237796
3508E18155634K646089K852619K736270K501071K527892K845109L185332L061890K698124
3526.4E43210030K727031K909899L016830L213524L271103L115952L286422L644168
3542.7E68394959L655910L284395L100336L327071L480018L418445L540755L810346
$$ plain form
3418.3 449899197 449684739 449525803 449530482 449812412 450305045 450804651 451377809 452159882 452831537 453189671
3438.7 453189671 453579992 454328448 455429256 456676453 457874894 459127754 460539490 462090582 463839352
3457 463839352 465761721 467596561 469392866 471566349 473948270 475908846 477399707 478988618 480973959
3475.4 480973959 483280838 485620648 487684190 489698112 491994172 494322568 496505678 498805374
3491.7 498805374 501303017 503855824 506312013 508794248 511420429 513833761 515917838 518155634
3508 518155634 520801723 523654342 526390612 528891683 531419575 534264684 537450016 540511906 543210030
3526.4 543210030 545937061 548846960 551863790 555077314 558348417 561464369 564750791 568394959
3542.7 568394959 572050869 575335264 578435600 581762671 585242689 588661134 592201889 596012235
3559E96012235L841042L703833L863752M413545M362285L875017L872395M167735M378081
3577.4F32489920M562676M668176M595637M674196M880965M730165M433572M566014
3593.7F69601321M840672M908979M890084M761517M545331M560769M974425N117953
3610G08201051M919529M768610M530251M723966N020022M346967L692448L906429M955769
3628.4G49065042N123913L983676L646970L684819L600955L538251L397822L230393
3644.7G79271841L484666M178167L612757K301812K226889K763092K604962K088606
3661H02532792J848579J842796J969636K152741K009094J625359J596272J410603J096308
3679.4H18084180J133860J280605J438380J762807J659751Q41021N40853O86944P50958
$$ plain form
3559 596012235 599853277 603557110 607420862 611834407 616196692 620071709 623944104 628111839 632489920
3577.4 632489920 637052596 641720772 646316409 650990605 655871570 660601735 665035307 669601321
3593.7 669601321 674441993 679350972 684241056 689002573 693547904 698108673 703083098 708201051
3610 708201051 713120580 717889190 722419441 727143407 732163429 736510396 740202844 744109273 749065042
3628.4 749065042 754188955 758172631 761819601 765504420 769105375 772643626 776041448 779271841
3644.7 779271841 782756507 786934674 790547431 792849243 795076132 797839224 800444186 802532792
3661 802532792 804381371 806224167 808193803 810346544 812355638 813980997 815577269 816987872 818084180
3679.4 818084180 819218040 820498645 821937025 823699832 825359583 826200604 826741457 827428401 828179359
3697.7H28179359P97272Q43167P20919O18219P01785Q88586R01759O21855L67582L05176
3718.1H34945679L97086M84645M28975K49684K18093M98891R08315R88364N87762J59383
3738.5H39866877m5598j2875K89619M69983L30985K89499K40148J55925J70172J56581
3758.9H41911316O5505R5845K20000K19226J30415J05024J32560J91808L19660K80261
3779.3H43671620O5505N3406J13726P1108N3287J27792K54691L12388K06232R5844
3799.7H45025599O2943L3617j908o6995q5712L6120K40088M07636L89993J57953j38343
3822.1H46060991j65999J967R597q4877P4148L72827L14236m8876j80483n9545N3882
3844.6H46347868L7015j1623J1444J3232j3053k2590j7703N0426O4492l9518k5570
$$ plain form
3697.7 828179359 828976631 829819798 830540717 831158936 831860721 832749307 833651066 834272921 834640503 834945679
3718.1 834945679 835342765 835827410 836256385 836506069 836724162 837223053 838131368 839119732 839707494 839866877
3738.5 839866877 839821279 839808404 840098023 840568006 840898991 841188490 841428638 841584563 841754735 841911316
3758.9 841911316 841976821 842072666 842292666 842511892 842642307 842747331 842879891 843071699 843391359 843671620
3779.3 843671620 843737125 843790531 843904257 843975365 844028652 844156444 844411135 844723523 844929755 845025599
3799.7 845025599 845088542 845122159 845120251 845053256 844967544 845003664 845243752 845651388 846041381 846199334 846060991
3822.1 846060991 845894992 845896959 845906556 845821679 845895827 846268654 846582890 846534014 846353531 846293986 846347868
3844.6 846347868 846384883 846373260 846384704 846397936 846384883 846362293 846344590 846395016 846459508 846419990 846394420
3867H46394420J09672Q5891r6798j26243J0192J07825J08183J01506M1247j41204j62124
3889.4H46432567p689L9518K0444M2200L4988J013n7816j42515j51455o5625L9816
3911.9H46185446J05798J22786P5042R54n7579r1672m1425O2287Q7679J7702m6551
3934.3H46420467p7903q0526j4484P8618R8288M6611l5822j01864m4466Q3268P6175
3956.7H46448362l2365n0605k3484M470Q9467J39952R6678N4479P0572P7724L8863
3979.2H46914113M5895R0003P868q5413k4558K0564J4067N3346P0274
3997.5H47106159
$$ plain form
3867 846394420 846504092 846589983 846493185 846366942 846377134 846484959 846593142 846694648 846735895 846594691 846432567
3889.4 846432567 846424878 846464396 846484840 846527040 846562028 846563041 846505225 846362710 846211255 846145630 846185446
3911.9 846185446 846291244 846414030 846489072 846490026 846432447 846340775 846299350 846361637 846449316 846467018 846420467
3934.3 846420467 846342564 846262038 846247554 846326172 846424460 846471071 846435249 846333385 846288919 846372187 846448362
3956.7 846448362 846415997 846365392 846341908 846346378 846435845 846575797 846672475 846726954 846797526 846875250 846914113
3979.2 846914113 846960008 847050011 847057879 846972466 846947908 846968472 846982539 847035885 847106159
3997.5 847106159
##END=$$ End of the data block
