##TITLE=$$ Begin of the data block
##JCAMP-DX=5.00 $$ ACD/SpecManager v 10.08
##SPECTROMETER/DATA SYSTEM=Alpha
##DATE=09 Apr 2014 11:14:46
##DATA TYPE=INFRARED SPECTRUM
##DATA CLASS=XYDATA
##ORIGIN=
##OWNER=
##NPOINTS=1765
##FIRSTX=399.75695801
##LASTX=3997.56933594
##MAXX=3997.56933594
##MINX=399.75695801
##MAXY=0.87918800
##MINY=0.44887614
##XFACTOR=1.0000000000
##YFACTOR=1.000000000000000e-9
##FIRSTY=0.74353212
##DELTAX=2.03957629
##XUNITS=1/CM
##YUNITS=ARBITRARY UNITS
##XYDATA=(X++(Y..Y))
399.8G43532121r7811J872838q66592l837586l001749Q63313K665282P06076j956224
418.1G39879668j622141R36449J96516l041625l430187K14815L022909R56178l351987
436.5G33760595l562689P31111L324509N33938l324687k838433J001000K683759J77026
454.8G32486129k609968j953900R54985J326919j397312l217339j389623J631379J366616
473.2G27197886j939118l062010n07534K108753J274466j779019k621591k14458J826823
491.5G22284198N04613k212823k474963j25230J588285J72734k311646k163291K94745
509.9G15556622J290202m05729k228022j800716J84000P43389q95739k440691j729726
528.3G08273590k9087L19480q68797j791715j023770L32296L77834q36551j471639
$$ plain form
399.8 743532121 743434310 745307148 744440556 740602970 737601221 738464534 741129816 741835892 739879668
418.1 739879668 738257527 739193976 739390492 736348867 732918680 733133495 736156404 737112582 733760595
436.5 733760595 730197906 730929017 734253526 734787464 731462777 728624344 729625344 732309103 732486129
454.8 732486129 729876161 727922261 728877246 730204165 728806853 725589514 724199891 725831270 727197886
473.2 727197886 725258768 722196758 721689224 723797977 725072443 723293424 720671833 720457375 722284198
491.5 722284198 722788811 720575988 718101025 717975795 719564080 719736814 717425168 715261877 715556622
509.9 715556622 716846824 716441095 714213073 712412357 712596357 713339746 712444007 710003316 708273590
528.3 708273590 708244503 708563983 707695186 705903471 704879701 705211997 705589831 704753280 703281641
546.6G03281641o19471K78175j84000j273215j492142p09474j23024o62446j491368
565F97004676j408756q48234q72075j510143j891852j522601q92102q32141j289367
583.3F85937405j537502j210392p40647r00865j483261j385868o36041n46157j513422
601.7F75983250k188265j499355k46108J33038n21958q76844P3850J723469K555310
620F75136387K253533K140403K863884L445982K924920J814901J434625K171337K667785
638.4F96853757J692116K5928k20299J578510L122032K056003m66407j081705J278043
656.7G04837978L993094M064321K249241J207412K133071L789246K231836O05762J031101
675.1G26143062K608955L200769J826883K09689M43220K034247K533078J057446m76539
$$ plain form
546.6 703281641 702662170 702940345 702756345 701483130 699990988 699281514 699158490 698496044 697004676
565 697004676 695595920 694747686 693875611 692365468 690473616 688951015 688058913 687226772 685937405
583.3 685937405 684399903 683189511 682448864 681547999 680064738 678678870 678042829 677496672 675983250
601.7 675983250 673794985 672295630 672049522 672182560 671660602 670783758 670857608 672581077 675136387
620 675136387 677389920 679530323 682394207 685840189 688765109 690580010 692014635 694185972 696853757
638.4 696853757 698545873 698571801 698351502 699930012 703052044 705108047 704641640 703559935 704837978
656.7 704837978 708831072 712895393 715144634 716352046 718485117 722274363 724506199 725111961 726143062
675.1 726143062 728752017 731952786 733779669 733989358 734432578 736466825 738999903 740057349 739580810
693.5G39580810j0371J731217K169192O47068o42956J94788K188802K728403J160681
711.8G49747634k34604N73635K443850K767503J144052j48118O85752K467751K673924
730.2G62121379Q92640n48840L16381K211810K447486P06017n84066M07815K359926
748.5G70330548K553284Q36313k68996P02918K393067K533972Q73268l75629M66764
766.9G80045509K007604J851857J0729j218200m63963R06348P69914q71301j857221
785.2G81181276p58827J227021J896620J044095O90162K148569M041671M280508K939999
803.6G98691094J944005K503097L416479K862811J128793R4533N38707J127481M20749
821.9H12727749j179278k168774j885176j328528j708805k654493k889514k038181
$$ plain form
693.5 739580810 739570439 741301656 743470848 744117916 743474960 743669748 745858550 748586953 749747634
711.8 749747634 749513030 750086665 752530515 755298018 756442070 756293952 756979704 759447455 762121379
730.2 762121379 763014019 762465179 762781560 764993370 767440856 768146873 767562807 767970622 770330548
748.5 770330548 772883832 773720145 773451149 774154067 776547134 779081106 779954374 779578745 780045509
766.9 780045509 782053113 783904970 783915699 782697499 782233536 783139884 783909798 783038497 781181276
785.2 781181276 780422449 781649470 783546090 784590185 785280347 787428916 791470587 795751095 798691094
803.6 798691094 800635099 803138196 806554675 809417486 810546279 810640812 811179519 812307000 812727749
821.9 812727749 811548471 809379697 807494521 806165993 804457188 801802695 798913181 796875000
838.3G96875000j185119j388252k115071j970529n64099J071096K003968K584457L582060
856.6G98893511M820466N446017N114019M378378L971637L865719L386139K344609
872.9H32220495J442373J190185J174629P51674j01387q31426r61721q12649j021803
891.3H33050370j329720r98199n0723P93337J021147Q15809P59065J002789R69469
909.6H36033344J39177j040995j617372j505971j512527j968205k146066j381099j13666
928H24886620O37174M49478l099J30355O49393O32346j56761q82446q10445l79205
948.4H25153410o29663j755118k804459l011941k862275l408790m876911o306053o831467
966.8G92666733o836533p198394p863879p812142o499171m726708l736139l737271
$$ plain form
838.3 796875000 795689881 794301629 792186558 790216029 789651930 790723026 792726994 795311451 798893511
856.6 798893511 803713977 809159994 814274013 818652391 822624028 826489747 829875886 832220495
872.9 832220495 833662868 834853053 836027682 836779356 836677969 835846543 834884822 834072173 833050370
891.3 833050370 831720650 830722451 830671728 831465065 832486212 833302021 834061086 835063875 836033344
909.6 836033344 836172521 835131526 833514154 832008183 830495656 828527451 826381385 825000286 824886620
928 824886620 825523794 825973272 825970173 826100528 826749921 827382267 827225506 826343060 825532615 825153410
948.4 825153410 824523747 822768629 819964170 816952229 814089954 810681164 805804253 799498200 792666733
966.8 792666733 785830200 778631806 770767927 762955785 756456614 751729906 747993767 744256496
983.1G44256496l784120l125488k131641j680136j987994k251506j677870o71387k91467
1001.4G26654887q62837j674592j971364j973689k447903l452063m183411l969133
1017.7G06119895l201425k879262l290773l733813l462971k687752k224982k336800
1034.1F82302117k460837k022505j236379r51707j473546k058030k001404j444876
1050.4F68652833r94266q77082o19531K07961J159370J340628N04851o79672j454413
1068.7F67240679j752019k053022k618432l072441k971828k571582k543450l077626
1085F46580279l709555l804505l256321k482175j774967j053035j69158O18636R07064
1103.4F31856263O36995J66535j19567k49863n49912j267851k399742l571808l965021
$$ plain form
983.1 744256496 740472376 737346888 735215247 733535111 731547117 729295611 727617741 726946354 726654887
1001.4 726654887 725792050 724117458 722146094 720172405 717724502 714272439 710089028 706119895
1017.7 706119895 702918470 700039208 696748435 693014622 689551651 686863899 684638917 682302117
1034.1 682302117 679841280 677818775 676582396 675630689 674157143 672099113 670097709 668652833
1050.4 668652833 667658567 666781485 666161954 666369915 667529285 668869913 669374764 668695092 667240679
1068.7 667240679 665488660 663435638 660817206 657744765 654772937 652201355 649657905 646580279
1085 646580279 642870724 639066219 635809898 633327723 631552756 630499721 630330563 630949199 631856263
1103.4 631856263 632493258 632659793 632540226 632290363 631740451 630472600 628072858 624501050 620536029
1121.8F20536029k942919j280189o8426R99868J630902J237035R84847J601339K390563
1140.1F25089049K756179K613723K164245J717507J454652J394272J492858J657784
1156.4F40340269J925110K414525L091753L861308M650294N307794N684972N738199
1172.7F73014224N554020N289316N036831M704237M132211L370345K560377J733959
1189.1G05395520R08434J29700m15623m43280Q6427Q87453J523972J807749J912117
1207.4G11792469J958311J797139J270235O50167M17650O25193Q44002P29978M66764
1225.8G20551908N06103R51529J358449J319349J048565J031101J376867J655400J355707
1244.1G31154978O74129L37779N16892O67333M02034j1802J0669O89745J492501J775681
$$ plain form
1121.8 620536029 617593110 616312921 616244495 617244363 618875265 620112300 621097147 622698486 625089049
1140.1 625089049 627845228 630458951 632623196 634340703 635795355 637189627 638682485 640340269
1156.4 640340269 642265379 644679904 647771657 651632965 656283259 661591053 667276025 673014224
1172.7 673014224 678568244 683857560 688894391 693598628 697730839 701101184 703661561 705395520
1189.1 705395520 706303954 706433654 706018031 705574751 705661178 706548631 708072603 709880352 711792469
1207.4 711792469 713750780 715547919 716818154 717468321 717885971 718511164 719355166 720085144 720551908
1225.8 720551908 721058011 722009540 723367989 724687338 725735903 726767004 728143871 729799271 731154978
1244.1 731154978 731829107 732166886 732683778 733351111 733753145 733741343 733752012 734441757 735934258 737709939
1264.5G37709939J685620J869798K568900L213108L157079K638578K457381K934813
1280.8G58235216L480435L397941K855897K594173K918422L280461K990663K164185
1297.2G81917393J611114J792490K176464J904964J013875M39942P12931J225889J099289
1315.5G93894351M35709J00911N83708J306177J357197P40946K83360M87268Q96216
1333.9H00085843P47859P15n84006k30849N96524Q09907K28286k25127P3910O23107
1354.3H02126169N51701j34707o29961n74887l27766m06802r33706j284898r60886
1372.6G97424257n69582q12829j822591l202021l392577j344025R94027R40859k35438
1391G87980080m39048j94967n21481j548111k163411j859665j483321j419425j602769
$$ plain form
1264.5 737709939 739395559 741265357 743834257 747047365 750204444 752843022 755300403 758235216
1280.8 758235216 761715651 765113592 767969489 770563662 773482084 776762545 779753208 781917393
1297.2 781917393 783528507 785320997 787497461 789402425 790416300 790856242 791569173 792795062 793894351
1315.5 793894351 794330060 794430971 795014679 796320856 797678053 798418999 798702359 799189627 800085843
1333.9 800085843 800833702 800834417 800250411 800019562 800616086 801425993 801654279 801429152 801503062 802126169
1354.3 802126169 802677870 802543163 801913202 801338315 801010549 800603747 799670041 798385143 797424257
1372.6 797424257 796854675 796041846 794219255 791017234 787624657 786280632 787274659 788215518 787980080
1391 787980080 787541032 787346065 786824584 785276473 783113062 781253397 779770076 778350651 776747882
1409.3G76747882j753747j354396n46754j93357q06570j185358p32243k23279M6611
1427.7G69998789j40131m27127o4015P19607R54568N46754N11527Q32021J393735J821220
1448.1G76146948J720310J630723K129138L654480M489898K894640K477467L279984
1464.4G98423588L577411L211976L542482M386127L913999K830029K274692J813948
1480.7H23974252J336813J008808R26733M85599n44369r67681q56638j148939j738787
1499.1H22475791j870394j486838j386404k955138l760100l000557k499819k088010
1515.4H03428531j858294j621425j785100j998544j785576j810551j550555j172662
1531.7G89845824j275182j083850l92437l06070j060665j019776o08921k06470R6261
$$ plain form
1409.3 776747882 774994135 773639739 773092985 772899628 772093058 770907700 770175457 769952178 769998789
1427.7 769998789 769858658 769431531 769367516 770087123 771041691 771588445 772099972 772931993 774325728 776146948
1448.1 776146948 777867258 779497981 781627119 785281599 789771497 792666137 795143604 798423588
1464.4 798423588 802000999 805212975 808755457 813141584 817055583 819885612 822160304 823974252
1480.7 823974252 825311065 826319873 827246606 827732205 827187836 826220155 825363517 824214578 822475791
1499.1 822475791 820605397 819118559 817732155 814777017 811016917 808016360 805516541 803428531
1515.4 803428531 801570237 799948812 798163712 796165168 794379592 792569041 791018486 789845824
1531.7 789845824 788570642 787486792 787094355 786788285 785727620 784707844 784098923 783892453 783988714
1550.1G83988714L88265P85589J149118J058877n69940j086474p05420p04587j336038
1568.4G82968104k469480k541363k362192l551722m234790m062772m281402m387379
1584.7G55077004m526734m889369n262673n331278n213558n096496n172371n416215
1601.1G14168310n436897n086780m880070n213559n402923m903674m801452n504668
1617.4F72938287m630923l847241m266024l966510l363073l101170k272129j220167
1633.7F46271050n39541j49966L09408R42052J739144L147721L852785K809048L532648
1652F61914349N330324L725409L290415M134715M930794M947185M470647N347073O193101
1670.4G04284012N054057N106926N828440N329430N080700N870283P351458O049692
$$ plain form
1550.1 783988714 784376979 785162568 786311686 787370563 786800623 785714149 785008729 784304142 782968104
1568.4 782968104 780498624 777957261 775595069 772043347 767808557 763745785 759464383 755077004
1584.7 755077004 750550270 745660901 740398228 735066950 729853392 724756896 719584525 714168310
1601.1 714168310 708731413 703644633 698764563 693551004 688148081 683244407 678442955 672938287
1617.4 672938287 668307364 664460123 660194099 656227589 652864516 649763346 647491217 646271050
1633.7 646271050 645731509 645581543 645890951 646833003 648572147 651719868 655572653 658381701 661914349
1652 661914349 667244673 670970082 674260497 678395212 683326006 688273191 692743838 698090911 704284012
1670.4 704284012 709338069 714444995 720273435 725602865 730683565 736553848 743905306 749954998
1686.7G49954998N067826N433559M986048N557418O448388O494999O995439N206347
1703G96145022M278898M520834L918290L477275L270269L200769L280818K533496J834989
1721.4H26460660J792728J811326J848817K117216K209485K199054J630127J295626
1737.7H41365039J818359K016008J745224J658976J797140J867711J506150J060903
1754H54835510J056552J130760J132190J118064Q32558P21276Q87811J092910J040280
1772.4H63847911N49555K75791M63605O82294O58274N44846M75585N74410P89941P38680
1792.8H69600892L74377K86698M22001M78685L43800K43783K93612L83437L96073K94864
1813.2H73118222K40206K41697K64287K95580L43084L54648L28839K56121N5194M1961
$$ plain form
1686.7 749954998 755022824 760456383 765442431 770999849 777448237 783943236 790938675 796145022
1703 796145022 800423920 804944754 808863044 812340319 815610588 818811357 822092175 824625671 826460660
1721.4 826460660 828253388 830064714 831913531 834030747 836240232 838439286 840069413 841365039
1737.7 841365039 843183398 845199406 846944630 848603606 850400746 852268457 853774607 854835510
1754 854835510 855892062 857022822 858155012 859273076 860105634 860826910 861714721 862807631 863847911
1772.4 863847911 864397466 864673257 865136862 865819156 866477430 867022276 867497861 868072271 868862212 869600892
1792.8 869600892 869975269 870261967 870683968 871162653 871506453 871750236 872043848 872427285 872823358 873118222
1813.2 873118222 873358428 873600125 873864412 874159992 874503076 874857724 875186563 875442684 875497878 875539839
1833.6H75539839K11478K40325J69218K36094K96593J64687O5804Q2254R1374Q7858
1854H77185524J15811J63436J57774Q4460J12474K63512L11315P4088j45971j04607
1874.4H78217816N7221J81138J62065K5452p7486L6180K30014J38342q9466j25289
1894.7H78755987k2888J12056J33693k9742j36853J0252K02954J21415j10626j47581
1915.1H78888667K6464J67787J05083j22785k98858j81377P5877J35481o7115k33888
1935.5H78495336j04309J50323J49608j68145l60012j92046P7784R6679j75953l63052
1955.9H77606213k29835K2351P4804j06156k60830j93894P16M3690j57178l42428k25246
1978.4H76232207M7445J03057j12176k87652j84298M6313M4882k05815l51965k20776
$$ plain form
1833.6 875539839 875751317 875991642 876160860 876396954 876693547 876858234 876924038 877006292 877097666 877185524
1854 877185524 877301335 877464771 877622545 877707005 877819479 878082991 878394306 878468394 878322423 878217816
1874.4 878217816 878275037 878456175 878618240 878643692 878566206 878602386 878832400 878970742 878881276 878755987
1894.7 878755987 878733099 878845155 878978848 878949106 878812253 878822505 879025459 879146874 879036248 878888667
1915.1 878888667 878915131 879082918 879188001 879065216 878766358 878584981 878660858 878796339 878729224 878495336
1935.5 878495336 878391027 878541350 878690958 878522813 878162801 877970755 878048539 878145218 877969265 877606213
1955.9 877606213 877376378 877398729 877473533 877367377 877106547 876912653 876913369 876957059 876799881 876457453 876232207
1978.4 876232207 876279652 876382709 876270533 875982881 875798583 875844896 875889778 875683963 875331998 875111222
1998.8H75111222J6213N4061j26958k82347k25067k8312M1127j09911k69711k24352
2019.2H73955965n1916k741j55330k92301k05636J8596P6115j13189k62201j55150
2039.6H72812212N1796O9261j08362k32279j44124K6882M7505j13249k23756j24693
2060H72061193M8697Q9943l9577j60873j12653M8280R2983m6193j53304q5115M5300
2082.4H71788681O2346j1027m8280k1934J9371J4961k5511k1040K6584P2181P1704
2104.8H71928036L0577O855N36R954J2756k39J2577L7491N9247Q8394R4235P9334N6922
2131.3H72416675L3856M5359O0677M4882L9995P4923J04487J15395J00493N2095K7179
2153.8H73116016M0353P5876J27316J41144P2002K0325O3420J22726J07526L9280J6570
$$ plain form
1998.8 875111222 875127435 875181496 875054538 874772191 874547124 874518812 874559939 874450028 874180317 873955965
2019.2 873955965 873904049 873901308 873745978 873453677 873248041 873266637 873342752 873229563 872967362 872812212
2039.6 872812212 872864008 872933269 872824907 872592628 872448504 872475386 872522891 872409642 872185886 872061193
2060 872061193 872109890 872199833 872160256 871999383 871886730 871935010 872027993 871981800 871828496 871743381 871788681
2082.4 871788681 871851027 871840000 871791720 871769786 871789157 871804118 871778607 871757567 871784151 871856332 871928036
2104.8 871928036 871958613 871965468 871966004 871975958 871988714 871988475 872001052 872038543 872097790 872186184 872280419 872359753 872416675
2131.3 872416675 872450531 872495890 872556567 872601449 872641444 872716367 872820854 872936249 873036742 873088837 873116016
2153.8 873116016 873156369 873232245 873359561 873500705 873572707 873593032 873656452 873779178 873886704 873925984 873942554
2176.2H73942554O0081J07229Q8454L2603M0531R5189J09017O2704L874J669N2870
2198.6H74596775Q1837M2617l3796m0292O2465J40250Q5771k6524o3002K6166J22190
2221.1H74994457N7757r4235j03176L7611J34766Q7917o0618j29581p510J17302N3108
2243.5H75087798j12057j37448K6464J46031M6194j27912j44839j9193Q3447M5180
2263.9H74893665r0658j40548J6212J85728J18375n1141n5909J01447J84358O4373
2284.3H75225902j26243j72496m5955N6863j6034k04801k54274o6399P8916l6836k67505
2306.7H74171138l42608j72078K4676n4002l35514m70698l10183p5936j10924l80040
2327.1H71943831m03523l9339J69158k3425k50160k31207J2517L79384P11143N57780
$$ plain form
2176.2 873942554 874002635 874109864 874198318 874230921 874271452 874366641 874475658 874538362 874542236 874543905 874596775
2198.6 874596775 874678612 874721229 874687433 874647141 874709606 874849856 874935627 874909103 874846101 874872267 874994457
2221.1 874994457 875052214 874957979 874854803 874892414 875027180 875115097 875054479 874924898 874917388 875034690 875087798
2243.5 875087798 874975741 874838293 874864757 875010788 875056982 874929070 874784231 874765038 874848485 874893665
2263.9 874893665 874803007 874662459 874678671 874864399 874982774 874931633 874875724 874977171 875161529 875225902
2284.3 875225902 875099659 874927163 874881208 874938071 874922037 874717236 874462962 874396563 874475479 874438643 874171138
2306.7 874171138 873828530 873656452 873681128 873627126 873291612 872820914 872510731 872434795 872323871 871943831
2327.1 871943831 871540308 871500969 871670127 871646702 871396542 871165335 871177852 871557236 872268379 872826159
2347.5H72826159o2466o27577q05616o90461n49912k13921K82526N17845N50270N88536
2367.9H71815383O57917Q53657R77636Q15510N95093N35309N66900N27263L21448P2717
2388.3H77738833O676J25885J95682P8142q9765q9168P2002J65820N4360j28508j27017
2410.8H78002942O3538J69158L4690j67429j61052M2260J47759J1504j68979j44601
2431.2H77829790O0141J74701M2677j77502j92523L9100J77980J0729k10107j80840
2451.5H77574146L1054J33633K6763j33753j50382N245R6142m1008k04921j63376J9431
2474H77192974J07765n126j56879j38223L993P0572l8266k05457j91808K980J07289
2496.4H76749814k1816k06172j82331K4438J26064j7047k17795k33651n6147J03891
$$ plain form
2347.5 872826159 872763693 872136116 871330500 870640039 870090127 869876206 870158732 870676577 871226847 871815383
2367.9 871815383 872473300 873326957 874304593 875120103 875715196 876250505 876817405 877344668 877666116 877738833
2388.3 877738833 877745509 877871394 878067076 878145218 878055453 877966285 878038287 878204107 878258467 878129959 878002942
2410.8 878002942 878066480 878235638 878270328 878102899 877941847 877984107 878131866 878143370 877974391 877829790
2431.2 877829790 877889931 878064632 878107309 877929807 877737284 877776384 877954364 877965093 877754986 877574146
2451.5 877574146 877605200 877738833 877765596 877631843 877481461 877486706 877582848 877541840 877336919 877173543 877192974
2474 877192974 877300739 877295613 877138734 877000511 877004504 877075076 877036810 876831353 876639545 876642525 876749814
2496.4 876749814 876727998 876521826 876339495 876363933 876489997 876472950 876255155 876021504 875965357 876069248
2516.8H76069248M4584j57177j87219J3352J27196p927k03312k31325o2704Q8334K5093
2539.2H75518143j47164j79588l9042O3122l5227k07960j87993k146P0572l6836j70409
2561.7H74645472j76371k5093Q4936m4345k66672k89440j05679J3769p5996j90973
2582.1H73569608j89364j05918j5080n7816k27630l25859k16842m0114p6115k80559
2602.5H72034311l27527j51098m7266j44899k63811k86221k13981j28746j46806k47896
2622.9H70076060l08275k28941j23203j76191k68102k27094j38700j36495j87218k52962
2643.3H68028879l01182k40743j61827j87456k50459k59817k00093j37984j33872j52290
2663.7H66003156j63794j99616k49624k42055j98543j89662j65820j41501k29776l09348
$$ plain form
2516.8 876069248 876113832 875956655 875769436 875782788 875909984 875902057 875698745 875467420 875404716 875493050 875518143
2539.2 875518143 875370979 875191391 875152349 875215471 875180244 874972284 874784291 874782145 874852717 874815881 874645472
2561.7 874645472 874469101 874444008 874528944 874484599 874217927 873928487 873822808 873836577 873760581 873569608
2582.1 873569608 873380244 873274326 873259246 873201430 872973800 872647941 872431099 872390985 872314870 872034311
2602.5 872034311 871706784 871555686 871508420 871363521 871099710 870813489 870599508 870470762 870323956 870076060
2622.9 870076060 869767785 869538844 869415641 869239450 868971348 868744254 868605554 868469059 868281841 868028879
2643.3 868028879 867727697 867486954 867325127 867137671 866887212 866627395 866427302 866289318 866155446 866003156
2663.7 866003156 865839362 865639746 865390122 865148067 864949524 864759862 864594042 864452541 864222765 863913417
2684.1H63913417k66731k32756k44856k47478k36094k38538k71857k74122k08616j78754
2704.5H61513615k62618l39568l30150k86460k42293k46227k76565k66016k37107k13027
2724.8H58813584k48611l57092l93092l21210k00986j54615l04282m24325k93791r4653
2745.2H56020927j07169l16381m41015l48628j91807k01583l81768m83692l92496k48313
2765.6H52908075k18570l16143l82245l30865l09348l82543m97639n78523m61042k36153
2786H49195004k00511m04775o05702n58376l63768l41117n58495p30873o54280m87387
2806.4H44289720m56095n99801p04050n98073n18382o04331o98209p38442p10964o37055
2826.8H38024318o55949q04067r23872r22143r12249j121879j557708j930058k091586
$$ plain form
2684.1 863913417 863646686 863413930 863169074 862921596 862685502 862446964 862175107 861900985 861692369 861513615
2704.5 861513615 861250997 860911429 860581279 860294819 860052526 859806299 859529734 859263718 859026611 858813584
2724.8 858813584 858564973 858207881 857814789 857493579 857292593 857137978 856833696 856409371 856115580 856020927
2745.2 856020927 855913758 855597377 855156362 854807734 854615927 854414344 854032576 853548884 853156388 852908075
2765.6 852908075 852689505 852373362 851991117 851660252 851350904 850968361 850470722 849892199 849431157 849195004
2786 849195004 848994493 848589718 847984016 847425640 847061872 846720755 846162260 845431387 844777107 844289720
2806.4 844289720 843833625 843233824 842529774 841931701 841413319 840808988 840110779 839372337 838661373 838024318
2826.8 838024318 837368369 836564302 835640430 834718287 833806038 832684159 831126451 829196393 827104807
2845.2H27104807k071798j911759j611412j176834p49171m54783l91841o32763r80020
2863.5H17124426j189708j271189j229763j090347j057685j070797q98659p05898p05600
2881.9H07904780q01027q51691q13961p90894q83639r85145j031697j084685j130462
2900.2G99531579j171291j238108j276910j294255j449168j761079k015113k054513
2916.6G87271142j873255j523852j108468p66098m47750j27256M232O7889L16203O66261
2937G82479048R65953J197874J269281J074493P39276M73798L04341L8862k41875k00272
2957.4G88100779N1439J65820J15097R5129J90913L04520L70860L46542K69472L46065
2977.8G90356636M57704K78056L5524P6175K50578L57687K44558r6023k96056l31640
$$ plain form
2845.2 827104807 825033009 823121250 821509838 820333004 819583833 819129050 818737209 818104446 817124426
2863.5 817124426 815934718 814663529 813433766 812343419 811285734 810214937 809316278 808610380 807904780
2881.9 807904780 807103753 806252062 805438101 804647207 803763568 802778423 801746726 800662041 799531579
2900.2 799531579 798360288 797122180 795845270 794551015 793101847 791340768 789325655 787271142
2916.6 787271142 785397887 783874035 782765567 781999469 781551719 781424463 781428695 781496584 781812787 782479048
2937 782479048 783445001 784642875 785912156 786986649 787725925 788199723 788504064 788542926 788301051 788100779
2957.4 788100779 788152218 788318038 788433135 788528264 788719177 789023697 789394557 789741099 790010571 790356636
2977.8 790356636 790814340 791092396 791127920 791204095 791454673 791812360 792056918 791960895 791664839 791333199
2998.1G91333199m40360n46515o09695o02127m45365l06905l98814o71387q97646r44138
3018.5G85470247q95500q79407r37998r68635q63552p74145q14140j003981j187920
3036.9G77144969j025439p96318r62615j290083j349151j136720j057029j221955j328945
3055.3G66976714j324236j257181j133144j066625j039505j087785j236022j271903
3071.6G57560313j158417r97304r06706j003504j191616j332104j366139j270115j182676
3089.9G47151732j281440j453578j438678j240015j173257j329661j426220j366198
3106.2G36442685j339316j460672j484692j307964j288295j478672j700997j902998
3122.6G24479079j908898j714349j594424j666904j785099j786411j692235j702607
$$ plain form
2998.1 791333199 790892839 790346324 789736629 789134502 788689137 788382232 787983418 787312031 786414385 785470247
3018.5 785470247 784574747 783695340 782757342 781788707 780925155 780151010 779336870 778332889 777144969
3036.9 777144969 776119530 775323212 774360597 773070514 771721363 770584643 769527614 768305659 766976714
3055.3 766976714 765652478 764395297 763262153 762195528 761156023 760068238 758832216 757560313
3071.6 757560313 756401896 755404592 754497886 753494382 752302766 750970662 749604523 748334408 747151732
3089.9 747151732 745870292 744416714 742978036 741738021 740564764 739235103 737808883 736442685
3106.2 736442685 735103369 733642697 732158005 730850041 729561746 728083074 726382077 724479079
3122.6 724479079 722570181 720855832 719261408 717594504 715809405 714022994 712330759 710628152
3138.9G10628152j900196k001405j928747j904964j842499j737118j879990k184868
3155.2F95248365k278983k173364k073646k017677k046644k165854k216757k150655
3171.5F78124785k104640k141773k221704k256930k236068k224684k225220k217233
3187.8F60496533k206266k198696k200782k242566k300679k311588k270281k213299
3204.1F42552376k163530k150297k186656k204895k135455k056480k106726k210379
3220.5F25337958k221286k138317k029836j965463j921296j892328j996279k107799
3236.8F09065354k050400j950383j837432j680494j645684j782894j863241j740277
3253.1E94514549j581907j590670j666546j663923j653969j621187j491368j391351
$$ plain form
3138.9 710628152 708727956 706726551 704797804 702892840 701050341 699313223 697433233 695248365
3155.2 695248365 692969382 690796018 688722372 686704695 684658051 682492197 680275440 678124785
3171.5 678124785 676020145 673878372 671656668 669399738 667163670 664938986 662713766 660496533
3187.8 660496533 658290267 656091571 653890789 651648223 649347544 647035956 644765675 642552376
3204.1 642552376 640388846 638238549 636051893 633846998 631711543 629655063 627548337 625337958
3220.5 625337958 623116672 620978355 618948519 616983056 615061760 613169432 611173153 609065354
3236.8 609065354 607014954 605064571 603227139 601546645 599900961 598118067 596254826 594514549
3253.1 594514549 592932642 591341972 589675426 588011503 586357534 584736347 583244979 581853628
3269.4E81853628j503289j699149j752675j717865j679003j664341j711786j734376
3285.7E68391144j650095j559615j607776j756310j875103j938998j901269j755297
3302E54346681j671970j791001k037108k240479k310991k249241k194464k199948k149760
3320.4E35501719k065897k081275k258420k448738k427161k306938k216339k124846
3336.7E17572105k223432k446950k539932k577007k485156k256036k321064k628506
3353D98094022k675682k468407k325267k333075k322405k155990k026975k190262k495915
3371.4D77100044k507358k183229j913548j837492j854300j803011j578688j236499
3387.7D62185919r31412r71108j307577j353056r44763o81579r83745j323461j095742
$$ plain form
3269.4 581853628 580350339 578651190 576898515 575180650 573501647 571837306 570125520 568391144
3285.7 568391144 566741049 565181434 563573658 561817348 559942245 558003247 556101978 554346681
3302 554346681 552674711 550883710 548846602 546606123 544295132 542045891 539851427 537651479 535501719
3320.4 535501719 533435822 531354547 529096127 526647389 524220228 521913290 519696951 517572105
3336.7 517572105 515348673 512901723 510361791 507784784 505299628 503043592 500722528 498094022
3353 498094022 495418340 492949933 490624666 488291591 485969186 483813196 481786221 479595959 477100044
3371.4 477100044 474592686 472409457 470495909 468658417 466804117 465001106 463422418 462185919
3387.7 462185919 461254507 460283399 458975822 457622766 456678003 455996424 455012679 453689218 452593476
3406.1D52593476o89745n37098n31375o25342o19740l51578j79380j80691k384L31640
3426.5D49207783N54859N28276N26637O94424O32286L49790L86715P85679J154184
3444.8D54820633J268595J199842J243502J382679J521289J738697J930118J869291
3461.1D66974646J850158K205431K396524J989573J508922J567334J955420K303570
3477.4D82751578K347738K062738K016633K287686K290040K152890K307862K524913
3493.8E00742078K577901K485811K488852K590060K410829K156198K322376K683282
3510.1E20457387K855778K728402K480507K525389K843500L138959L038704K756238
3526.4E42824864K788365K926469L033221L252983L296435L090322L236115L656685
$$ plain form
3406.1 452593476 451903731 451366633 450835258 450209916 449590176 449238598 449059218 448878527 448876143 449207783
3426.5 449207783 449762642 450290918 450817555 451511979 452144265 452494055 452880770 453666449 454820633
3444.8 454820633 456089228 457289070 458532572 459915251 461436540 463175237 465105355 466974646
3461.1 466974646 468824804 471030235 473426759 475416332 476925254 478492588 480448008 482751578
3477.4 482751578 485099316 487162054 489178687 491466373 493756413 495909303 498217165 500742078
3493.8 500742078 503319979 505805790 508294642 510884702 513295531 515451729 517774105 520457387
3510.1 520457387 523313165 526041567 528522074 531047463 533890963 537029922 540068626 542824864
3526.4 542824864 545613229 548539698 551572919 554825902 558122337 561212659 564448774 568105459
3542.7E68105459L759742L359973L087581L314733L521621L472031L527462L745675
3559E95894277L822804L723263L868819M464805M441082L895402L883898M193724M382670
3577.4F32570744M576325M718304M638850M670441M866839M720926M398823M553556
3593.7F69714808M917622N036295M965186M786729M593552M624724M936218M980862
3610G08555996M892528M850090M586399M766762N067348M349709L667056L882111M925727
3628.4G49543726N100310L983259L680408L698409L581107L572106L450036L211856
3644.7G79821217L435612M202604L688276K358615K263367K764941K625107K106011
3661H03265750J801253J794100J939237K107680J970350J601041J603603J476407J140058
$$ plain form
3542.7 568105459 571865201 575225174 578312755 581627488 585149109 588621140 592148602 595894277
3559 595894277 599717081 603440344 607309163 611773968 616215050 620110452 623994350 628188074 632570744
3577.4 632570744 637147069 641865373 646504223 651174664 656041503 660762429 665161252 669714808
3593.7 669714808 674632430 679668725 684633911 689420640 694014192 698638916 703575134 708555996
3610 708555996 713448524 718298614 722885013 727651775 732719123 737068832 740735888 744617999 749543726
3628.4 749543726 754644036 758627295 762307703 766006112 769587219 773159325 776609361 779821217
3644.7 779821217 783256829 787459433 791147709 793506324 795769691 798534632 801159739 803265750
3661 803265750 805067003 806861103 808800340 810908020 812878370 814479411 816083014 817559421 818699479
3679.4H18699479J085043J212180J457810J808167J621902Q01086N30541O66440P36475
3697.7H28619123Q39173R33826P44999N93424O88970Q71896Q84474O06477M08769M00602
3718.1H35591733M22597M10557L81828K86042K69056M87029Q02994R12368O81520K41339
3738.5H40487063j00017j31011K07603M78447L85940L35932K54094J74225K12550K09749
3758.9H42514575J02698Q6665J70827J92285J43468Q5593J06215K41935M22597L61681
3779.3H44428539P5162k8909l695K5332Q4937J53780K56061L26753K11715Q9765P0274
3801.7H45689714J2994j7286j8298n1499P153J90377L35634L22997J79470l9041j01924
3824.2H46510291k7954n3168q4817J15514L95536L25024n1916j99198j08302P928N0187
$$ plain form
3679.4 818699479 819784522 820996702 822454512 824262679 825884581 826685667 827216208 827882648 828619123
3697.7 828619123 829458296 830392122 831137121 831730545 832419515 833291411 834175885 834782362 835191131 835591733
3718.1 835591733 836014330 836424887 836806715 837092757 837361813 837848842 838651836 839564204 840245724 840487063
3738.5 840487063 840387046 840256035 840463638 840942085 841328025 841663957 841918051 842092276 842304826 842514575
3758.9 842514575 842617273 842703938 842874765 843067050 843210518 843296111 843402326 843644261 844066858 844428539
3779.3 844428539 844503701 844474792 844471097 844496429 844581366 844735146 844991207 845317960 845529675 845619440 845689714
3801.7 845689714 845702708 845685422 845667124 845615625 845622778 845813155 846148789 846471786 846651256 846612215 846510291
3824.2 846510291 846482337 846429169 846344352 846459866 846855402 847180426 847128510 846929312 846821010 846828938 846879125
3846.6H46879125K563o9440j25944N8174J37090J4842Q285J0908m7088p868P1585N0426
3871.1H46982658l4154k7060L9637O6400J19209K04384P8559k01166k07960l9756M410
3893.5H46985161k6941J3053Q3626Q0526k683j11222j51574j08302j3232R8109J61171
3915.9H47007692J09434R54l7611m4405o6340n4896J5735P3076o080j16825p0989N9485
3940.4H46869230R9063M1545o020k5273m2796k6226J4544M1782O8188O0260p808m4703
3964.9H47041786M112R1196J44243R5784K9803M8339N5850M1842Q1539O2645m2379
3987.3H47654760j02341n6386N7518J01090O5326
3997.5H47719967
$$ plain form
3846.6 846879125 846881688 846812248 846686304 846744478 846881568 846896410 846904695 846915603 846868515 846860647 846932232 846982658
3871.1 846982658 846948504 846921444 846961081 847027481 847146690 847351074 847429633 847228467 847020507 846980751 846985161
3893.5 846985161 846958220 846971273 847054899 847135425 847132742 847021520 846869946 846761644 846748412 846846521 847007692
3915.9 847007692 847117126 847118080 847080469 847036064 846969724 846914828 846930563 847003639 846997559 846880734 846809745 846869230
3940.4 846869230 846968293 847009838 847003818 846978545 846935749 846909523 846924067 846965849 847034037 847094297 847086489 847041786
3964.9 847041786 847045898 847137094 847281337 847377121 847406924 847455263 847511113 847552955 847634494 847697139 847654760
3987.3 847654760 847552419 847496033 847553551 847654641 847719967
3997.5 847719967
##END=$$ End of the data block
