##TITLE=$$ Begin of the data block
##JCAMP-DX=5.00 $$ ACD/SpecManager v 10.08
##SPECTROMETER/DATA SYSTEM=Alpha
##DATE=09 Apr 2014 11:14:46
##DATA TYPE=INFRARED SPECTRUM
##DATA CLASS=XYDATA
##ORIGIN=
##OWNER=
##NPOINTS=1765
##FIRSTX=399.75695801
##LASTX=3997.56933594
##MAXX=3997.56933594
##MINX=399.75695801
##MAXY=0.87939370
##MINY=0.44845849
##XFACTOR=1.0000000000
##YFACTOR=1.000000000000000e-9
##FIRSTY=0.74212664
##DELTAX=2.03957629
##XUNITS=1/CM
##YUNITS=ARBITRARY UNITS
##XYDATA=(X++(Y..Y))
$$ plain form
399.8 742126644 741982460 743397832 742253304 738331556 735804737 737174630 739728212 739951074 737394571
418.1 737394571 735291600 736230493 736912072 734453022 731058538 730858445 733701289 734793842 731613934
436.5 731613934 728133559 728867829 732257485 732775569 729431391 726866663 728034675 730547071 730536997
454.8 730536997 727860510 726038098 727282941 728829324 727465212 724270105 723006129 724695206
471.1 724695206 726007640 723985672 720858693 720283747 722258031 723464310 721765041 719232082 719097793
489.5 719097793 720981121 721484661 719216943 716629863 716427207 718031704 718324244 716273487 714322031
507.9 714322031 714547575 715724230 715366423 713214159 711410403 711466968 712055087 711184859 708952069
526.2 708952069 707345366 707277179 707463861 706447661 704718649 703919172 704336941 704609334 703608334
$$ packed form
399.8G42126644j44184J415372j144528l921748k526819J369893K553582K22862k556503
418.1G37394571k102971R38893O81579k459050l394484k00093K842844J092553l179908
436.5G31613934l480375P34270L389656N18084l344178k564728J168012K512396j0074
454.8G30536997k676487j822412J244843J546383j364112l195107j263976J689077
471.1G24695206J312434k021968l126979n74946J974284J206279j699269k532959j34289
489.5G19097793J883328N03540k267718k587080k02656J604497K92540k050757j951456
507.9G14322031K25544J176655l57807k152264j803756N6565N88119q70228k232790
526.2G08952069j606703o8187J86682j016200j729012p99477M17769K72393j001000
$$ plain form
544.6 703608334 702063739 701600492 702081144 701877236 700504065 699009955 698346317 698213339 697468162
562.9 697468162 695860445 694359004 693574071 692929089 691649139 689900160 688490212 687601328 686571360
581.3 686571360 685069501 683497488 682430387 681820214 680946946 679467499 678094983 677464426 676870883
599.6 676870883 675308406 673154175 671775639 671668828 671817958 671184540 670226038 670283020 672020137
618 672020137 674584091 676783323 678905249 681828439 685350657 688334167 690139472 691577733 693819582
636.3 693819582 696537912 698213756 698237002 698130369 699824274 702903330 704861224 704357386 703234911
654.7 703234911 704487860 708491743 712503135 714673817 715890408 718161583 722174346 724478543
671 724478543 725022435 725974679 728601336 731931150 733760357 733787358 734191895 736365676 738952100
$$ packed form
544.6G03608334j544595m63247M80652k03908j373171j494110o63638j32978p45177
562.9F97468162j607717j501441p84933o44982j279950j748979j409948q88884j029968
581.3F86571360j501859j572013j067101o10173q73268j479447j372516o30557n93543
599.6F76870883j562477k154231j378536j06811J49130o33418r58502N6982J737117
618F72020137K563954K199232K121926K923190L522218K983510J805305J438261K241849
636.3F93819582K718330J675844K3246j06633J693905L079056J957894n03838j122475
654.7G03234911J252949M003883M011392K170682J216591K271175M012763K304197
671G24478543N43892R52244K626657L329814J829207K7001M04537K173781K586424
$$ plain form
689.4 738952100 739932597 739331007 739204407 740912378 743197083 743988454 743422091 743670881 745892704
707.7 745892704 748599648 749721229 749495804 750113606 752595723 755397499 756527126 756304204 756940961
726.1 756940961 759450078 762184024 763067186 762462258 762733936 764935732 767375529 768061876 767480612
744.4 767480612 767906964 770286858 772932887 773836613 773464262 774109602 776594162 779144764 779942572
762.8 779942572 779568851 780064166 782035172 783863366 783875644 782664180 782245040 783183753 783912539
781.2 783912539 783019304 781248868 780590951 781797171 783557594 784503937 785234094 787493169 791572630
799.5 791572630 795763671 798598230 800496161 802981794 806399524 809274435 810435832 810597479 811180890
817.9 811180890 812290549 812636375 811352015 809128523 807272017 806000352 804328620 801686943 798839867
$$ packed form
689.4G38952100R80497o01590j26600J707971K284705P91371n66363K48790K221823
707.7G45892704K706944J121581k25425O17802K482117K801776J129627k22922O36757
726.1G56940961K509117K733946Q83162o04928K71678K201796K439797O86347n81264
744.4G67480612M26352K379894K646029R03726l72351O45340K484560K550602P97808
762.8G79942572l73721M95315J971006J828194J2278j211464m19140R38713P28786
781.2G83912539q93235j770436o57917J206220J760423R46343P30157K259075M079461
799.5G91572630M191041K834559J897931K485633L417730K874911J161397J61647N83411
817.9H11180890J109659L45826j284360k223492j856506j271665j671732k641677k847076
$$ plain form
836.2 798839867 796872497 795735538 794375062 792268157 790294468 789709151 790748358 792714179 795203924
854.6 795203924 798697293 803535998 809082747 814295053 818690538 822625697 826465368 829795241
870.9 829795241 832060814 833446383 834597886 835794330 836620569 836538911 835649371 834611952 833778083
889.3 833778083 832822323 831550002 830549598 830500722 831327736 832410514 833285570 834048629 834990740
907.6 834990740 835884273 835983157 834935904 833326817 831854939 830417395 828540683 826415062 824962556
926 824962556 824808478 825476348 825943112 825914502 826000929 826588213 827170670 826998413 826088667 825241685
946.4 825241685 824835002 824188948 822467029 819701850 816701353 813876033 810509264 805645287 799334109
964.7 799334109 792497575 785676062 778490961 770629525 762813032 756304681 751588821 747864902
$$ packed form
836.2G98839867j967370j136959j360476k106905j973689n85317J039207J965821K489745
854.6G95203924L493369M838705N546749N212306M395485L935159L839671L329873
870.9H29795241K265573J385569J151503J196444Q26239q1658q89540j037419q33869
889.3H33778083r55760j272321j000404m8876Q27014J082778Q75056P63059R42111
907.6H34990740Q93533R8884j047253j609087j471878j437544j876712k125621j452506
926H24962556j54078O67870M66764k8610Q6427N87284N82457j72257r09746q46982
946.4H25241685m06683o46054j721919k765179l000497k825320l366769m863977o311178
964.7G99334109o836534o821513p185101p861436p816493o508351m715860l723919
$$ plain form
981 747864902 744116127 740306795 737141788 734967113 733262897 731270194 729027927 727377236 726736307
999.4 726736307 726439178 725527525 723807335 721827090 719861031 717411578 713963747 709804356 705875874
1017.7 705875874 702732384 699876547 696527183 692738652 689301312 686666846 684480429 682159245
1034.1 682159245 679693162 677710116 676556170 675654054 674204350 672162056 670147121 668658793
1050.4 668658793 667596936 666647494 666013062 666256428 667439163 668812513 669360399 668674767 667174041
1068.7 667174041 665409207 663418174 660884917 657837212 654838204 652259529 649732411 646643698
1085 646643698 642899632 639089227 635859132 633382440 631594300 630544841 630371511 630978942 631892145
1103.4 631892145 632538080 632718503 632611871 632380188 631870806 630604506 628147900 624554157 620611370
$$ packed form
981G47864902l748775l809332l165007k174675j704216j992703k242267j650691o40929
999.4G26736307k97129r11653j720190j980245j966059k449453l447831m159391l928482
1017.7G05875874l143490k855837l349364l788531l437340k634466k186417k321184
1034.1F82159245k466083j983046j153946r02116j449704k042294k014935j488328
1050.4F68658793j061857r49442o34432K43366J182735J373350N47886o85632j500726
1068.7F67174041j764834j991033k533257l047705k999008k578675k527118l088713
1085F46643698l744066l810405l230095k476692j788140j049459j73330O07431R13203
1103.4F31892145O45935J80423j06632k31683n09382j266300k456606l593743l942787
$$ plain form
1121.8 620611370 617642760 616286278 616166174 617183745 618867934 620124757 621090531 622673929 625049829
1140.1 625049829 627776980 630382061 632580042 634330392 635795236 637177289 638632298 640250981
1156.4 640250981 642162025 644580364 647677064 651538610 656180322 661465049 667118967 672834992
1172.7 672834992 678385735 683685958 688724756 693412900 697517276 700846195 703374207 705127537
1189.1 705127537 706090569 706255615 705848694 705418050 705529690 706421316 707891941 709619820 711522937
1207.4 711522937 713540375 715377033 716676533 717363536 717792809 718404353 719222903 719912112 720349133
1225.8 720349133 720870614 721851051 723231077 724568725 725617111 726662397 728069901 729716897 731064320
1244.1 731064320 731773198 732140899 732664406 733338118 733731508 733688891 733695507 734408617 735905051 737654030
$$ packed form
1121.8F20611370k968610j356482j20104J017571J684189J256823R65774J583398K375900
1140.1F25049829K727151K605081K197981J750350J464844J382053J455009J618683
1156.4F40250981J911044K418339L096700L861546M641712N284727N653918N716025
1172.7F72834992N550743N300223N038798M688144M104376L328919K528012J753330
1189.1G05127537R63032J65046m06921m30644J11640Q91626J470625J727879J903117
1207.4G11522937K017438J836658J299500O87003M29273O11544Q18550O89209M37021
1225.8G20349133N21481R80437J380026J337648J048386J045286J407504J646996J347423
1244.1G31064320P08878L67701N23507O73712L93390m2617O616P13110J496434J748979
$$ plain form
1264.5 737654030 739299893 741148412 743708074 746897042 750035226 752680063 755151629 758102238
1280.8 758102238 761593699 764986873 767840683 770447850 773392498 776703238 779700041 781849444
1297.2 781849444 783468783 785283625 787440300 789310455 790341139 790828109 791576862 792816222 793906152
1315.5 793906152 794328630 794425070 795011580 796319604 797684491 798429251 798712790 799209237 800102234
1333.9 800102234 800845563 800856292 800291717 800096691 800709963 801500976 801719487 801497519 801572680 802201331
1354.3 802201331 802733958 802555263 801896572 801347733 801087677 800697923 799722850 798420191 797496617
1372.6 797496617 796957135 796106577 794234335 791034460 787676692 786355317 787343144 788278639 788059890
1391 788059890 787631929 787414193 786872745 785350561 783206582 781328321 779829562 778412223 776801348
$$ packed form
1264.5G37654030J645863J848519K559662L188968L138184K644837K471566K950609
1280.8G58102238L491461L393174K853810K607167K944648L310740K996803K149403
1297.2G81849444J619339J814842K156675J870155J030684M86970P48753J239360J089930
1315.5G93906152M22478R6440N86510J308024J364887P44760K83539M96447Q92997
1333.9H00102234P43329J0729n64575j95026O13272P91013K18511k21968P5161O28651
1354.3H02201331N32627j78695o58691n48839k60056l89754r75073j302659r23574
1372.6G97496617n39482q50558j872242l199875l357768j321375R87827R35495k18749
1391G88059890m27961k17736n41448j522184k143979j878261j498759j417339j610875
$$ plain form
1409.3 776801348 775038958 773703754 773181617 772990048 772185802 771005094 770269573 770046711 770076871
1427.7 770076871 769902468 769450188 769386172 770139039 771127760 771661460 772145510 772987247 774390638 776170492
1448.1 776170492 777843475 779462397 781610906 785298228 789810359 792712152 795186222 798476517
1464.4 798476517 802086413 805301964 808807373 813164473 817111135 820003271 822310090 824104965
1480.7 824104965 825408340 826411784 827348351 827830136 827275574 826313198 825472593 824328184 822571814
1499.1 822571814 820694208 819210410 817785859 814743996 810975552 808013558 805526137 803437769
1515.4 803437769 801593721 799977839 798183084 796197176 794475436 792730331 791172683 789955914
1531.7 789955914 788676202 787624300 787244618 786923468 785885155 784901321 784281194 784043908 784130752
$$ packed form
1409.3G76801348j762390j335204n22137j91569q04246j180708p35521k22862L0160
1427.7G70076871j74403m52280o4016P52867R88721N33700M84050Q41737J403391J779854
1448.1G76170492J672983J618922K148509L687322M512131K901793K474070L290295
1464.4G98476517L609896L215551L505409M357100L946662K892136K306819J794875
1480.7H24104965J303375J003444R36567M81785n54562r62376q40605j144409j756370
1499.1H22571814j877606j483798j424551l041863l768444k961994k487421k088368
1515.4H03437769j844048j615882j794755j985908j721740j745105j557648j216769
1531.7G89955914j279712j051902l79682l21150j038313r83834o20127k37286Q6844
$$ plain form
1550.1 784130752 784517884 785282791 786408126 787455082 786939085 785917878 785225749 784493148 783118844
1568.4 783118844 780669749 778193951 775876582 772327363 768052459 763953269 759664357 755299032
1584.7 755299032 750787914 745864987 740551531 735193551 729938626 724767566 719554543 714159727
1601.1 714159727 708741188 703622878 698688745 693446398 688052297 683158875 678318322 672723770
1617.4 672723770 668055534 664234221 659982264 655979216 652562737 649430871 647150934 645928323
1633.7 645928323 645404398 645292163 645642698 646619380 648373663 651529491 655420363 658277988 661833286
1652 661833286 667177558 670941889 674277782 678448737 683401644 688375771 692883015 698262155 704461098
1670.4 704461098 709488571 714562178 720382631 725727737 730826795 736720979 744100213 750153363
$$ packed form
1550.1G84130752L87132P64907J125335J046956n15997j021207o92129p32601j374304
1568.4G83118844k449095k475798k317369l549219m274904m099190m288912m365325
1584.7G55299032m511118m922927n313456n357980n254925n171060n213023n394816
1601.1G14159727n418539n118310m934133n242347n394101m893422m840553n594552
1617.4F72723770m668236l821313m251957m003048l416479l131866k279937j222611
1633.7F45928323n23925j12235L50535R76682J754283L155828L890872K857625L555298
1652F61833286N344272L764331L335893M170955M952907M974127M507244N379140O198943
1670.4G04461098N027473N073607N820453N345106N099058N894184P379234O053150
$$ plain form
1686.7 750153363 755187035 760562301 765516460 771073163 777501583 783958614 790980577 796260238
1703 796260238 800571740 805076599 808983624 812473655 815741599 818909943 822183013 824754059 826604843
1721.4 826604843 828384459 830203295 832094729 834241569 836433768 838592231 840225637 841548324
1737.7 841548324 843360305 845349133 847084880 848757625 850581169 852451742 853953540 855039418
1754 855039418 856110811 857241750 858401358 859545469 860350370 861038268 861934602 863040268 864066482
1772.4 864066482 864591718 864856243 865336239 866031408 866679072 867216051 867699325 868277490 869047403 869744718
1792.8 869744718 870099306 870409667 870858610 871351242 871714652 871969104 872263193 872654319 873031020 873264551
1813.2 873264551 873490274 873779655 874071479 874369025 874712408 875049472 875362694 875632644 875721633 875764489
$$ packed form
1686.7G50153363N033672N375266M954159N556703O428420O457031P021963N279661
1703G96260238M311502M504859L907025L490031L267944L168344L273070K571046J850784
1721.4H26604843J779616J818836J891434K146840K192199K158463J633406J322687
1737.7H41548324J811981J988828J735747J672745J823544J870573J501798J085878
1754H55039418J071393J130939J159608J144111Q04901O87898Q96334J105666J026214
1772.4H64066482N25236K64525M79996O95169O47664N36979M83274N78165P69913O97315
1792.8H69744718L54588L10361M48943M92632L63410K54452K94089L91126L76701K33531
1813.2H73264551K25723K89381K91824K97546L43383L37064L13222K69950Q8989M2856
$$ plain form
1833.6 875764489 875927269 876144767 876344740 876592517 876860857 876994669 877041876 877129912 877239108 877329051
1854 877329051 877452016 877642989 877826393 877915204 878013074 878261566 878561795 878637671 878489733 878355503
1874.4 878355503 878410757 878637493 878826082 878851175 878777444 878811300 879028440 879169762 879091382 878963351
1894.7 878963351 878940642 879068553 879225791 879216671 879079401 879053593 879216313 879337788 879249454 879118860
1915.1 879118860 879143894 879295707 879393697 879258633 878951371 878790021 878875077 878978193 878878415 878643632
1935.5 878643632 878556967 878721058 878874719 878704250 878323734 878109038 878178239 878275156 878119946 877776504
1955.9 877776504 877549887 877562106 877597094 877468824 877247453 877103925 877112985 877127409 876942396 876620173
1976.3 876620173 876439571 876506388 876596868 876455963 876169920 876010418 876046836 876059651 875827134 875464141
$$ packed form
1833.6H75764489J62780K17498J99973K47777K68340J33812M7207Q8036J09196Q9943
1854H77329051J22965J90973J83404Q8811R7870K48492L00229P5876j47938j34230
1874.4H78355503N5254K26736J88589K5093p3731L3856K17140J41322p8380j28031
1894.7H78963351k2709J27911J57238r120j37270k5808J62720J21475q8334j30594
1915.1H79118860K5034J51813R7990j35064l07262j61350Q5056J03116r9778k34783
1935.5H78643632q6665J64091J53661j70469l80516k14696O9201R6917j55210l43442
1955.9H77776504k26617J2219L4988j28270k21371j43528R060J4424j85013l22223
1976.3H76620173j80602O6817R0480j40905k86043j59502L6418J2815k32517l62993
$$ plain form
1996.7 875464141 875258386 875299275 875352681 875194311 874904811 874720335 874720752 874760449 874651909 874396622 874189496
2019.2 874189496 874139428 874130607 873981178 873704255 873508871 873514533 873562634 873436093 873177409 873015821 873049080
2041.6 873049080 873113453 873010695 872771919 872617364 872640908 872686386 872582257 872394562 872304380 872334719
2062 872334719 872374058 872308910 872162402 872083426 872147918 872228265 872161806 872016907 871970713 872035444 872110009
2084.4 872110009 872125864 872073054 872013927 872017145 872052729 872040689 871987641 871972859 872031033 872104168 872147799 872162342
2108.9 872162342 872155428 872177184 872225523 872251570 872270823 872301161 872336805 872413635 872522891 872611940 872670710
2131.3 872670710 872700870 872748971 872833371 872897267 872937202 872992873 873069763 873176277 873283923 873330832 873332202
2153.8 873332202 873362362 873470366 873616338 873727322 873781741 873836637 873950303 874085248 874168396 874185443
$$ packed form
1996.7H75464141k05755M0889N3406j58370k89500j84476M17L9697j08540k55287k07126
2019.2H74189496n0068q821j49429k76923j95384N662M8101j26541k58684j61588L3259
2041.6H73049080O4373j02758k38776j54555K3544M5478j04129j87695r0182L0339
2062H72334719L9339o5148j46508p8976O4492Q0347o6459j44899m6194O4731P4565
2084.4H72110009J5855n2810n9127L218L5584j2040n3048j4782N8174P3135M3631J4543
2108.9H72162342o914K1756M8339K6047J9253L0338L5644P6830J09256Q9049N8770
2131.3H72670710L0160M8101Q4400O3896L9935N5671P6890J06514J07646M6909J370
2153.8H73332202L0160J08004J45972J10984N4419N4896J13666J34945Q3148J7047
$$ plain form
2174.2 874185443 874194741 874258578 874381483 874495149 874536991 874554753 874619484 874713421 874776483 874783874 874782324 874854207
2198.6 874854207 874985456 875040650 874969721 874910712 874994457 875153959 875235081 875190735 875101924 875122011 875276864
2221.1 875276864 875373781 875300109 875191033 875213087 875339925 875402153 875306666 875172198 875181258 875304103 875355601
2243.5 875355601 875263214 875150979 875184596 875327826 875352800 875191212 875032187 875026941 875135720 875186622 875076592
2265.9 875076592 874922633 874937594 875141442 875287175 875238061 875176489 875284791 875472784 875510395 875324667
2286.3 875324667 875126898 875134706 875268042 875289202 875100136 874857903 874770522 874817312 874779284 874526441 874203503
2308.8 874203503 874048412 874078870 874048054 873740911 873259902 872946680 872903943 872826636 872485399 872063458
2329.2 872063458 871929407 872075796 872128546 871944249 871679068 871589661 871920526 872648656 873234451 873193443
$$ packed form
2174.2H74185443R298O3837J22905J13666M1842J7762O4731R3937O3062P391j550P1883
2198.6H74854207J31249N5194p0929n9009Q3745J59502Q1122m4346q8811K0087J54853
2221.1H75276864R6917p3672j09076K2054J26838O2228r5487j34468R060J22845N1498
2243.5H75355601r2387j12235L3617J43230K4974j61588j59025n246J08779N0902j10030
2265.9H75076592j53959J4961K03848J45733m9114o1572J08302J87993L7611j85728
2286.3H75324667j97769P808J33336K1160j89066k42233q7381M6790l8028k52843l22938
2308.8H74203503j55091L0458l0816l07143m81009l13222m2737p7307l41237m21941
2329.2H72063458j34051J46389N2750j84297k65181q9407L30865P28130N85795m1008
$$ plain form
2349.6 873193443 872613549 871913433 871318758 870820284 870607913 870806754 871248007 871759474 872298181 872959018
2370 872959018 873841226 874753356 875468075 876038730 876603842 877200246 877743781 878066897 878121257 878101587
2390.4 878101587 878209412 878394067 878462017 878371954 878305554 878392696 878554106 878609240 878479183 878354788
2410.8 878354788 878428996 878593504 878615677 878474832 878357232 878383756 878475666 878469944 878342330 878243744 878294885
2433.2 878294885 878400266 878386796 878247261 878149211 878232777 878377318 878346980 878128469 877956271 878003240
2453.6 878003240 878147423 878150403 877965331 877796173 877836347 877976477 877960682 877763510 877591252 877594113 877683759
2476 877683759 877659023 877479792 877327800 877333224 877389550 877343059 877181947 877032459 877025008 877109110 877088726
2498.5 877088726 876895487 876715600 876738131 876864076 876842141 876625061 876413167 876393318 876516640 876555264
$$ packed form
2349.6H73193443n79894p00116n94675m98474k12371J98841M41253N11467N38707O60837
2370H72959018Q82208R12130P14719N70655N65112N96404N43535L23116N4360j9670
2390.4H78101587J07825J84655O7950r0063o6400Q7142J61410N5134j30057j24395
2410.8H78354788P4208J64508K2173j40845j17600K6524R1910n722j27614r8586N1141
2433.2H78294885J05381j3470j39535r8050Q3566J44541l0338k18511j72198M6969
2453.6H78003240J44183K980j85072j69158M0174J40130j5795j97172j72258K861Q9646
2476H77683759k4736j79231j51992N424N6326m6491j61112j49488p451Q4102k0384
2498.5H77088726j93239j79887K2531J25945k1935k17080k11894j9849J23322L8624
$$ plain form
2518.9 876555264 876384854 876170218 876152515 876262665 876237988 876030445 875819564 875781655 875884831 875910401
2539.2 875910401 875756323 875577033 875549674 875621319 875584006 875377595 875180960 875147045 875192702 875137866 874953568
2561.7 874953568 874781489 874753475 874809802 874738276 874484658 874241650 874176502 874230206 874197185 873984575 873711288
2584.1 873711288 873560429 873565197 873536587 873312593 873010814 872837961 872796476 872705877 872442663 872137249
2604.5 872137249 871968269 871863961 871685982 871442258 871178985 870966017 870843172 870686889 870412529 870136440
2624.9 870136440 869965851 869832695 869638205 869372010 869105995 868937314 868827701 868648887 868377745 868107498
2645.3 868107498 867896616 867714703 867529929 867310107 867038310 866779208 866605878 866497755 866382122 866227388
2665.7 866227388 866023660 865781903 865551651 865347624 865168929 865020514 864843905 864570141 864277542 864058971
$$ packed form
2518.9H76555264j70410k14636j7703J10150k4677k07543k10881l7909J03176K5570
2539.2H75910401j54078j79290k7359P1645l7313k06411j96635l3915M5657n4836j84298
2561.7H74953568j72079k8014N6327p1526k53618k43008o5148N3704l3021k12610k73287
2584.1H73711288j50859M768k8610k23994l01779j72853m1485r0599k63214l05414
2604.5H72137249j68980j04308j77979k43724k63273k12968j22845j56283k74360k76089
2624.9H70136440j70589j33156j94490k66195k66015j68681j09613j78814k71142k70247
2645.3H68107498k10882j81913j84774k19822k71797k59102j73330j08123j15633j54734
2665.7H66227388k03728k41757k30252k04027j78695j48415j76609k73764k92599k18571
$$ plain form
2686.1 864058971 863849938 863596976 863325715 863084674 862864435 862602949 862333715 862120092 861918867 861666441
2706.5 861666441 861380935 861082137 860800564 860568523 860304236 859950840 859605730 859363079 859203398 858985186
2726.9 858985186 858595192 858165860 857861161 857665658 857467294 857162178 856786072 856499374 856409252 856361091
2747.3 856361091 856097281 855654120 855257750 854998052 854757249 854381919 853925943 853550136 853278100 853050530
2767.7 853050530 852805912 852496862 852156222 851798356 851393402 850917935 850368559 849877000 849574208 849352658
2788.1 849352658 848967552 848387957 847862005 847501755 847132385 846575618 845871568 845212400 844699264 844245017
2808.5 844245017 843677163 842982411 842347324 841818750 841253221 840560615 839795291 839083731 838452339 837787390
2828.9 837787390 836989343 836084127 835171402 834268987 833138943 831526041 829574168 827532053 825483859
$$ packed form
2686.1H64058971k09033k52962k71261k41041k20239k61486k69234k13623k01225k52426
2706.5H61666441k85506k98798k81573k32041k64287l53396l45110k42651j59681k18212
2726.9H58985186l89994m29332l04699j95503j98364l05116l76106k86698r0122m8161
2747.3H56361091k63810m43161l96370k59698k40803l75330m55976l75807k72036k27570
2767.7H53050530k44618l09050l40640l57866m04954m75467n49376m91559l02792k21550
2788.1H49352658l85106n79595n25952l60250l69370n56767p04050o59168n13136m54247
2808.5H44245017n67854o94752o35087n28574n65529o92606p65324p11560o31392o64949
2828.9H37787390p98047r05216r12725r02415j130044j612902j951873k042115k048194
$$ plain form
2847.2 825483859 823555589 821943939 820790648 820087492 819670200 819243014 818519711 817481935 816306710
2865.6 816306710 815092623 813914537 812861204 811828852 810734749 809756815 808989882 808304727 807577670
2883.9 807577670 806781590 805939019 805047452 804111063 803159237 802167833 801118433 800025344 798867047
2902.3 798867047 797635138 796358943 795032024 793555677 791806281 789806843 787754416 785890579
2918.6 785890579 784376502 783263385 782498002 782051206 781923592 781938672 781996608 782284021 782941520 783910871
2939 783910871 785106480 786363125 787437260 788215220 788714647 789016187 789076209 788866222 788678110 788718462
2959.4 788718462 788866758 788989067 789102495 789290488 789585829 789956033 790317833 790623844 790987611 791415572
2979.8 791415572 791675985 791753709 791863501 792081654 792402804 792677820 792636931 792350948 791984320 791497409
$$ packed form
2847.2H25483859j928270j611650j153291p03156m17292m27186p23303j037776j175225
2865.6H16306710j214087j178086j053333j032352j094103r77934p66933o85155p27057
2883.9H07577670p96080q42571q91567r36389r51826r91404j049400j093089j158297
2902.3G98867047j231909j276195j326919j476347j749396j999438k052427j863837
2918.6G85890579j514077j113117p65383m46796j27614J5080N7936K87413O57499R69351
2939G83910871J195609J256645J074135P77960M99427L01540O0022k09987j88112M0352
2959.4G88718462J48296J22309J13428J87993K95341L70204L61800L06011L63767M27961
2979.8G91415572K60413P7724J09792K18153L21150K75016m0889k85983l66628m86911
$$ plain form
3000.2 791497409 790923417 790305316 789708555 789282799 788993597 788587809 787899196 787010908 786101699 785235763
3020.6 785235763 784358084 783400059 782393813 781507552 780783117 780043244 779068053 777898252 776878774
3038.9 776878774 776033461 775002956 773690164 772374272 771262288 770199776 768976808 767641366
3055.3 767641366 766324759 765099168 763992608 762954593 761903763 760756612 759507895 758275092
3071.6 758275092 757147133 756149232 755208254 754167974 752984762 751695931 750346899 749051452 747830629
3089.9 747830629 746541560 745133281 743748486 742524385 741344213 739981234 738498151 737111509
3106.2 737111509 735787392 734337568 732852757 731522918 730205417 728732824 727056921 725171983
3122.6 725171983 723276138 721541584 719914496 718258679 716496766 714697599 712979615 711268723
$$ packed form
3000.2G91497409n73992o18101n96761m25756k89202m05788o88613q88288r09209q65936
3020.6G85235763q77679r58025j006246q86261p24435p39873r75191j169801j019478
3038.9G76878774q45313j030505j312792j315892j111984j062512j222968j335442
3055.3G67641366j316607j225591j106560j038015j050830j147151j248717j232803
3071.6G58275092j127959r97901r40978j040280j183212j288831j349032j295447j220823
3089.9G47830629j289069j408279j384795j224101j180172j362979j483083j386642
3106.2G37111509j324117j449824j484811j329839j317501j472593j675903j884938
3122.6G25171983j895845j734554j627088j655817j761913j799167j717984j710892
$$ plain form
3138.9 711268723 709389925 707405984 705459952 703538656 701682448 699944675 698104143 695960343
3155.2 695960343 693687856 691490710 689404428 687382460 685295939 683092952 680878699 678724229
3171.5 678724229 676596761 674453735 672258079 670030951 667811930 665585339 663349807 661129594
3187.8 661129594 658919990 656688213 654431641 652168393 649898827 647619903 645346045 643101633
3204.1 643101633 640910685 638754070 636580467 634395599 632257938 630161405 628010213 625792265
3220.5 625792265 623607218 621495545 619426310 617414236 615497410 613618135 611621320 609498024
3236.8 609498024 607427001 605479300 603648961 601958036 600293577 598491848 596639931 594930232
3253.1 594930232 593349874 591758370 590112031 588456511 586805522 585190892 583689868 582263589
$$ packed form
3138.9G11268723j878798j983941j946032j921296j856208j737773j840532k143800
3155.2F95960343k272487k197146k086282k021968k086521k202987k214253k154470
3171.5F78724229k127468k143026k195656k227128k219021k226591k235532k220213
3187.8F61129594k209604k231777k256572k263248k269566k278924k273858k244412
3204.1F43101633k190948k156615k173603k184868k137661k096533k151192k217948
3220.5F25792265k185047k111673k069235k012074j916826j879275j996815k123296
3236.8F09498024k071023j947701j830339j690925j664459j801729j851917j709699
3253.1E94930232j580358j591504j646339j655520j650989j614630j501024j426279
$$ plain form
3269.4 582263589 580724776 579025865 577279866 575538874 573841810 572166264 570434809 568694115
3285.7 568694115 567043900 565482140 563873470 562120676 560277045 558366299 556435287 554625034
3302 554625034 552912414 551104009 549079835 546851933 544525325 542235732 540036321 537888765 535746157
3320.4 535746157 533625722 531499207 529199243 526725709 524279356 521927774 519675016 517506540
3336.7 517506540 515223801 512764215 510262489 507703960 505215049 502974629 500664651 498011470
3353 498011470 495294333 492818385 490513802 488176733 485841364 483690381 481620967 479333222 476783663
3371.4 476783663 474305719 472179621 470271438 468372941 466467977 464684784 463137656 461871713
3387.7 461871713 460879445 459861606 458510131 457138181 456229806 455573529 454602808 453329325 452278435
$$ packed form
3269.4E82263589j538813j698911j745999j740992j697064j675546j731455j740694
3285.7E68694115j650215j561760j608670j752794j843631j910746j931012j810253
3302E54625034j712620j808405k024174k227902k326608k289593k199411k147556k142608
3320.4E35746157k120435k126515k299964k473534k446353k351582k252758k168476
3336.7E17506540k282739k459586k501726k558529k488911k240420k309978k653181
3353D98011470k717137k475948k304583k337069k335369k150983k069414k287745k549559
3371.4D76783663k477944k126098j908183j898497j904964j783193j547128j265943
3387.7D61871713r92268j017839j351475j371950r08375o56277r70721j273483j050890
$$ plain form
3406.1 452278435 451586157 451029509 450500667 449868441 449190468 448779643 448604614 448458493 448466003 448778480
3426.5 448778480 449298739 449792385 450320214 451075315 451786280 452178806 452560186 453297436 454377949
3444.8 454377949 455608875 456801265 458046764 459483743 461077005 462862730 464813143 466648132
3461.1 466648132 468456566 470654875 473037302 475017607 476537287 478111237 480075836 482397377
3477.4 482397377 484778136 486892432 488918275 491168797 493476272 495709717 498070121 500567496
3493.8 500567496 503103077 505573094 508027375 510577500 512969255 515129745 517481029 520214260
3510.1 520214260 523116767 525883496 528411567 530965269 533791959 536899209 539953291 542769790
3526.4 542769790 545607328 548550606 551569939 554806530 558115304 561242044 564509511 568148017
$$ packed form
3406.1D52278435o92278n56648n28842o32226o77973m10825j75029j46121P510L12477
3426.5D48778480N20259M93646N27829P55101P10965L92526L81380P37250J080513
3444.8D54377949J230926J192390J245499J436979J593262J785725J950413J834989
3461.1D66648132J808434K198309K382427J980305J519680J573950J964599K321541
3477.4D82397377K380759K114296K025843K250522K307475K233445K360404K497375
3493.8E00567496K535581K470017K454281K550125K391755K160490K351284K733231
3510.1E20214260K902507K766729K528071K553702K826690L107250L054082K816499
3526.4E42769790K837538K943278L019333L236591L308774L126740L267467L638506
$$ plain form
3542.7 568148017 571871877 575218976 578293979 581630468 585183918 588668406 592258751 596108854
3559 596108854 599973500 603664756 607524872 612027824 616511703 620424628 624292433 628479123 632880390
3577.4 632880390 637459219 642171860 646843493 651603997 656554818 661294460 665730715 670356393
3593.7 670356393 675291121 680262983 685170472 689985275 694623649 699241936 704240501 709392309
3610 709392309 714354038 719164252 723741055 728492320 733519197 737881780 741576433 745454848 750393689
3628.4 750393689 755539119 759548545 763227284 766932786 770551801 774146199 777594984 780839741
3644.7 780839741 784305751 788422167 792009830 794335425 796578884 799360394 802016795 804129839
3661 804129839 805923223 807725132 809683383 811778188 813734949 815323889 816902041 818386853 819541752
$$ packed form
3542.7E68148017L723860L347099L075003L336489L553450L484488L590345L850103
3559E96108854L864646L691256L860116M502952M483879L912925L867805M186690M401267
3577.4F32880390M578829M712641M671633M760504M950821M739642M436255M625678
3593.7F70356393M934728M971862M907489M814803M638374M618287M998565N151808
3610G09392309M961729M810214M576803M751265N026877M362583L694653L878415M938841
3628.4G50393689N145430M009426L678739L705502L619015L594398L448785L244757
3644.7G80839741L466010M116416L587663K325595K243459K781510K656401K113044
3661H04129839J793384J801909J958251K094805J956761J588940J578152J484812J154899
$$ plain form
3679.4 819541752 820648134 821856976 823244095 824991524 826669037 827591121 828175843 828838944 829587281
3697.7 829587281 830421448 831267774 831916273 832480073 833210945 834101975 834910512 835510075 835964084 836373270
3718.1 836373270 836823583 837301433 837712049 837996304 838294983 838753164 839444578 840272427 840902746 841132164
3738.5 841132164 841096103 841059864 841277957 841678739 842009604 842356145 842684865 842936039 843194723 843383431
3758.9 843383431 843418062 843469262 843646348 843870580 844065905 844203949 844320953 844508708 844847202 845163524
3779.3 845163524 845235765 845229924 845284045 845350146 845420122 845536172 845760465 846067548 846278727 846363902 846450150
3801.7 846450150 846523166 846529186 846486270 846415937 846432984 846624851 846923590 847212195 847333968 847268760 847234964
3824.2 847234964 847253561 847188056 847090840 847201824 847578704 847936869 847959042 847733915 847584784 847620130
$$ packed form
3679.4H19541752J106382J208842J387119J747429J677513R22084N84722O63101P48337
3697.7H29587281Q34167Q46326O48499N63800P30872Q91030Q08537N99563M54009M09186
3718.1H36373270M50313M77850M10616K84255K98679M58181O91414Q27849O30319K29418
3738.5H41132164l6061l6239K18093M00782L30865L46541L28720K51174K58684J88708
3758.9H43383431L4631N1200J77086K24232J95325J38044J17004J87755L38494L16322
3779.3H45163524P2241n841N4121O6101O9976J16050K24293L07083K11179Q5175Q6248
3801.7H46450150P3016O020m2916p0333J7047J91867K98739K88605J21773o5208l3796
3824.2H47234964J8597o5505r7216J10984L76880L58165K2173k25127j49131L5346
$$ plain form
3844.6 847620130 847685158 847662807 847587645 847484589 847507894 847616076 847635210 847648680 847715259 847746551 847742677
3867 847742677 847798944 847859621 847777426 847658336 847668588 847796321 847944856 848049223 848070323 847961783 847824275
3889.4 847824275 847756267 847709298 847663999 847702742 847835541 847914696 847849131 847748160 847655773 847577691 847586095
3911.9 847586095 847645879 847730219 847839415 847841561 847721696 847638786 847641408 847665310 847715855 847801208 847852528
3934.3 847852528 847804844 847701430 847653508 847712874 847789824 847787201 847747803 847740054 847790122 847875357 847925723 847912610
3958.8 847912610 847885191 847869754 847842693 847836554 847938061 848098278 848174930 848205030 848285079 848367512 848425031
3981.2 848425031 848491073 848501742 848448694 848464489 848514497 848466754 848384380 848395169
3997.5 848395169
$$ packed form
3844.6H47620130O5028k2351p5162j03056K3305J08182J9134J3470O6579L1292l874
3867H47742677N6267O0677q2195j19090J0252J27733J48535J04367K1100j08540j37508
3889.4H47824275o8008m6969m5299L8743J32799P9155o5565j00971r2387p8082Q404
3911.9H47586095N9784Q4340J09196K146j19865q2910K622K3902N0545Q5353N1320
3934.3H47852528m7684j03414m7922N9366P6950k623l9398p749N0068Q5235N0366j3113
3958.8H47912610k7419j5437k7061o139J01507J60217P6652L0100Q0049Q2433N7519
3981.2H48425031O6042J0669n3048J5795N0008m7743q2374J0789
3997.5H48395169
##END=$$ End of the data block
