##TITLE=$$ Begin of the data block
##JCAMP-DX=5.00 $$ ACD/SpecManager v 10.08
##SPECTROMETER/DATA SYSTEM=Alpha
##DATE=09 Apr 2014 11:14:46
##DATA TYPE=INFRARED SPECTRUM
##DATA CLASS=XYDATA
##ORIGIN=
##OWNER=
##NPOINTS=1765
##FIRSTX=399.75695801
##LASTX=3997.56933594
##MAXX=3997.56933594
##MINX=399.75695801
##MAXY=0.87969249
##MINY=0.44821209
##XFACTOR=1.0000000000
##YFACTOR=1.000000000000000e-9
##FIRSTY=0.74167228
##DELTAX=2.03957629
##XUNITS=1/CM
##YUNITS=ARBITRARY UNITS
##XYDATA=(X++(Y..Y))
399.8G41672277m23252J345038q67605l771961k541482J408636K455950J9074k696991
418.1G36599684j980722J136482M53949k860249l330767K80023L187478J080453l202081
436.5G31364250l301978O78420K834261J99437l137231k447069J194239K788246K54988
454.8G30427563k854347k145529J155973J535654j323104l126681j114070J938819
471.1G24494278J336873k200544l118217k41697K423585J213848k237022k959311j97827
489.5G18513966J960873N87464k225519k525329r0122J621902J51157k285242k121508
507.9G13587642L37958J386821l88741k312839j800478J64151O57797p94410k240777
526.2G08597124j732529j00195K53856j029670j807809q95321L66330M41253p67529
$$ plain form
399.8 741672277 741249025 742594063 741726458 737954497 735413015 736821651 739277601 739296675 736599684
418.1 736599684 734618962 735755444 736209393 733349144 730018377 730298400 733485878 734566331 731364250
436.5 731364250 728062272 728740692 731574953 731774390 728637159 726190090 727384329 730172575 730427563
454.8 730427563 727573216 725427687 726583660 728119314 726796210 723669529 722555459 724494278
471.1 724494278 725831151 723630607 720512390 720270693 722694278 723908126 721671104 718711793 718513966
489.5 718513966 720474839 721062303 718836784 716311455 716221333 717843235 717994392 715709150 713587642
507.9 713587642 713925600 715312421 714923680 712610841 710810363 710974514 711632311 710837901 708597124
526.2 708597124 706864595 706764400 707018256 705988586 704180777 703285456 703651786 704093039 703325510
544.6G03325510j498640n65469K96235l47852j367271j357615n10574o5505p27356
562.9F97181463j628399j512766p55727o79791j396477j874149j420140o74009p81894
581.3F86458111j518011j822770j282036n75721o79613j291275j278340o93203o39438
599.6F76677704j451135k030790j406014j59859K53677n16474r94027p6949J586437
618F71882570K485812K223491K163351L006994L655196L031194J735866J357555K214551
636.3F93756580K673269J628875R060j11401J809776L262699J998424m91798j000523
654.7G03534961J295507L909111L989517K243281J221299K177060L979146K419174
671G24769056N76556Q58962K586305L332496J857936J72258N17905K128660K497852
$$ plain form
544.6 703325510 701826870 701261401 701557636 701209784 699842513 698484898 697974324 697908819 697181463
562.9 697181463 695553064 694040298 693284571 692604780 691208303 689334154 687914014 687240005 686458111
581.3 686458111 684940100 683117330 681835294 681259573 680579960 679288685 678010345 677317142 676677704
599.6 676677704 675226569 673195779 671789765 671629906 671883583 671367109 670373082 670296133 671882570
618 671882570 674368382 676591873 678755224 681762218 685417414 688448608 690184474 691542029 693756580
636.3 693756580 696429849 698058724 698067784 697956383 699766159 703028858 705027282 704535484 703534961
654.7 703534961 704830468 708739579 712729096 714972377 716193676 718370736 722349882 724769056
671 724769056 725345612 726204574 728790879 732123375 733981311 734153569 734671474 736800134 739297986
689.4G39297986R46701n59450l3855J720428K164960O72281n87940K93791K305925
707.7G46220827K779961J108944k50697O84917K550781K751767J041413k32697O44744
726.1G57299960K446174K653003Q46624n64098L79384K295732K452672N87940o65248
744.4G67732143M78924K445757K579510Q26955k95400P70390K528071K526164P25031
762.8G80317545n10752M16696K022803J842081j5318j149297l39150R56654P44879
781.2G84286141q90135j773477n92053J238108J670003Q62360P38024K278209M090429
799.5G91907609M201233K771437J895905K635359L466547K763808J055717R1076N39541
817.9H11328232J132608M13120j254142k205848j816333j286566j745999k624690k751887
$$ plain form
689.4 739297986 740244687 739685237 739651382 741371810 743536770 744209051 743621111 743914902 746220827
707.7 746220827 749000788 750109732 749859035 750543952 753094733 755846500 756887913 756655216 757299960
726.1 757299960 759746134 762399137 763245761 762681663 763061047 765356779 767809451 768397391 767732143
744.4 767732143 768211067 770656824 773236334 774063289 773767889 774538279 777066350 779592514 780317545
762.8 780317545 779806793 780223489 782246292 784088373 784073055 782923758 782584608 783541262 784286141
781.2 784286141 783396006 781622529 781030476 782268584 783938587 784800947 785538971 787817180 791907609
799.5 791907609 796108842 798880279 800776184 803411543 806878090 809641898 810697615 810788691 811328232
817.9 811328232 812460840 812873960 811619818 809413970 807597637 806311071 804565072 801940382 799188495
836.2G99188495j941979j170635j410723k162576j992941n29587J088440J918853K439499
854.6G95426846L503084M838764N482436N101144M348874M014015L935218L363371
870.9H30013752K212286J306772J165211J247824Q42988q5890r16958j055539q00848
889.3H33929598r01580j237452r99271p6175P90655J047254Q24094P00831R31442R17375
909.6H35926771J11997j015484j562715j455903j496911j993239k183556j416624j33633
928H24780703O21736M31955O794J61291O62624O03557k20001r50336q27193l34740
948.4H24936390o27935j798987k818406l005743k850831l417730m907966o311416o803096
966.8G92394280o810247p185579p823229p736861o447018m716992l747046l777862
$$ plain form
836.2 799188495 797246516 796075881 794665158 792502582 790509641 789980054 791068494 792987347 795426846
854.6 795426846 798929930 803768694 809251130 814352274 818701148 822715163 826650381 830013752
870.9 830013752 832226038 833532810 834698021 835945845 836788833 836702943 835785985 834730446 833929598
889.3 833929598 833028018 831790566 830791295 830715120 831505775 832553029 833377123 834077954 835009396 835926771
909.6 835926771 836038768 835023284 833460569 832004666 830507755 828514516 826330960 824914336 824780703
928 824780703 825402439 825834394 825841188 826002479 826665103 827268660 827048659 826098323 825271130 824936390
948.4 824936390 824308455 822509468 819691062 816685319 813834488 810416758 805508792 799197376 792394280
966.8 792394280 785584033 778398454 770575225 762838364 756391346 751674354 747927308 744149446
983.1G44149446l848016l142535k075315j631379k010286k306581j690983o80208l86060
1001.4G26378083r85682j716673j943648j951396k463043l483892m172086l891170
1017.7G05770493l105462k835631l324569l754556l389776k573669k176582k373875
1034.1F82236373k479970j959980j152098r03606j450896k025187j946331j425981
1050.4F68892324j029909r17852o44445K05278J166582J329482M59611p21871j445115
1068.7F67294085j703322j986444k558172l037393k949953k546727k507985l062785
1085F46941304l725171l818631l248036k464235j790046j078129j69158O27041R09686
1103.4F32184625O31153J84655o0975j88172n39899j330435k477408l588020l942013
$$ plain form
983.1 744149446 740301430 737158895 735083580 733452201 731441915 729135334 727444351 726764143 726378083
1001.4 726378083 725392401 723675728 721732080 719780684 717317641 713833749 709661663 705770493
1017.7 705770493 702665031 699829400 696504831 692750275 689360499 686786830 684610248 682236373
1034.1 682236373 679756403 677796423 676644325 675740719 674289823 672264636 670318305 668892324
1050.4 668892324 667862415 666944563 666300118 666505396 667671978 669001460 669461071 668739200 667294085
1068.7 667294085 665590763 663604319 661046147 658008754 655058801 652512074 650004089 646941304
1085 646941304 643216133 639397502 636149466 633685231 631895185 630817056 630647898 631274939 632184625
1103.4 632184625 632815778 633000433 632939458 632751286 632211387 630880952 628403544 624815524 620873511
1121.8F20873511k982319j398503j80066R95994J750111J346708R89675J541376K301336
1140.1F25237823K659738K582609K216399J762688J448870J382053J484096J638829
1156.4F40413105J902044K388776L079652L860891M625917N241692N585015N670309
1172.7F72767401N588054N359710N039572M660130M091322L316462K505720J740933
1189.1G05069304R56833J47939m23670m24564J34587R04560J488507J777649J937866
1207.4G11569011J998365J787126J238942O48260M53711O85453Q82149P20740M47809
1225.8G20431566N10991R60946J358271J325488J073539J090765J439154J662374J339614
1244.1G31192708O90877L77477N49495O96957M14312l4928J490P00116J475632J724303
$$ plain form
1121.8 620873511 617891192 616492689 616312623 617308617 619058728 620405436 621395111 622936487 625237823
1140.1 625237823 627897561 630480170 632696569 634459257 635908127 637290180 638774276 640413105
1156.4 640413105 642315149 644703925 647783577 651644468 656270385 661512077 667097092 672767401
1172.7 672767401 678355455 683715165 688754737 693414867 697506189 700822651 703328371 705069304
1189.1 705069304 706026137 706174076 705750406 705325842 705460429 706364989 707853496 709631145 711569011
1207.4 711569011 713567376 715354502 716593444 717241704 717695415 718380868 719263017 719983757 720431566
1225.8 720431566 720942557 721903503 723261774 724587262 725660801 726751566 728190720 729853094 731192708
1244.1 731192708 731883585 732261062 732810557 733507514 733921826 733886898 733888388 734588504 736064136 737788439
1264.5G37788439J609385J813888K564133L220021L134132K606630K472103K968847
1280.8G58177578L459037L349602K839267K608598K958238L326952L009915K167404
1297.2G81896591J635850J827240K183139J903236J033246M77910P80106J288056J098693
1315.5G94124067M03583R8288O10053J316846J340806P18177K82407N20110R19223
1333.9H00333560P38143k5034n95390j89960O32226P79629J88589k21133J18136O77705
1354.3H02436471N66006j69099o65128n42879k64406m24922j008153j306295q91984
1372.6G97729611n07235q66413j922548l224671l345668j316309R90689R49502k00153
1391G88286805l90828j80840n58794j593649k173722j831591j468181j435400j633703
$$ plain form
1264.5 737788439 739397824 741211712 743775845 746995866 750129998 752736628 755208731 758177578
1280.8 758177578 761636615 764986217 767825484 770434082 773392320 776719272 779729187 781896591
1297.2 781896591 783532441 785359681 787542820 789446056 790479302 790957212 791737318 793025374 794124067
1315.5 794124067 794527650 794625938 795235991 796552837 797893643 798611820 798894227 799414337 800333560
1333.9 800333560 801071703 801046669 800451279 800261319 800893545 801673174 801861763 801640630 801758766 802436471
1354.3 802436471 803002477 802833378 802168250 801625371 801360965 800936043 799927890 798621595 797729611
1372.6 797729611 797222376 796355963 794433415 791208744 787863076 786546767 787537456 788486958 788286805
1391 788286805 787895977 787715137 787156343 785562694 783388972 781557381 780089200 778653800 777020097
1409.3G77020097j776636j318514m86553j76251q12828j182199p32899k28583K8729
1427.7G70334363j91987m68731m4107P59304R27031M55737M43935Q33154J401007J779378
1448.1G76229084J678645J616597K148152L697812M488766K893210K523363L361404
1464.4G98637033L647863L225506L517866M344344L883660K837002K286792J815677
1480.7H24195743J349449J035988R54688M82559n77986r80437q56996j178860j766801
1499.1H22657347j846791j451492j375675k978563l770054k980768k466619k043069
1515.4H03744316j845300j660705j802146j946271j706957j757801j546860j185596
1531.7G90292680j267910j079976m33386l50892r83656r21905n83112k17199Q0347
$$ plain form
1409.3 777020097 775243461 773924947 773438394 773262143 772449315 771267116 770534217 770305634 770334363
1427.7 770334363 770142376 769673645 769629538 770388842 771315873 771771610 772215545 773048699 774449706 776229084
1448.1 776229084 777907729 779524326 781672478 785370290 789859056 792752266 795275629 798637033
1464.4 798637033 802284896 805510402 809028268 813372612 817256272 820093274 822380066 824195743
1480.7 824195743 825545192 826581180 827535868 828018427 827440441 826460004 825603008 824424148 822657347
1499.1 822657347 820810556 819359064 817983389 815004826 811234772 808254004 805787385 803744316
1515.4 803744316 801899016 800238311 798436165 796489894 794782937 793025136 791478276 790292680
1531.7 790292680 789024770 787944794 787511408 787160516 786176860 785254955 784671843 784454644 784534991
1550.1G84534991L80456P84695J121700J015485m95136r92239o70910p07268j358271
1568.4G83613503k475798k515078k328872l550888m279136m109979m307985m388273
1584.7G55657494m535079m941642n322099n360007n261004n192280n269587n476117
1601.1G14299679n455733n103528m936099n283654n441367m912854m830479n613625
1617.4F72722340m738093l874361m249633l984391l432572l151477k274930j235187
1633.7F45781696n74351j28328L62158R99629J805842L220677L944755K895415L582656
1652F61890149N377650L798962L345311M167139M970551N013168M545509N407632O223917
1670.4G04739988N064785N114854N859613N367458N086362N852640P358491O076336
$$ plain form
1550.1 784534991 784915447 785700142 786821842 787837327 787342191 786349952 785679042 784971774 783613503
1568.4 783613503 781137705 778622627 776293755 772742867 768463731 764353752 760045767 755657494
1584.7 755657494 751122415 746180773 740858674 735498667 730237663 725045383 719775796 714299679
1601.1 714299679 708843946 703740418 698804319 693520665 688079298 683166444 678335965 672722340
1617.4 672722340 667984247 664109886 659860253 655875862 652443290 649291813 647016883 645781696
1633.7 645781696 645207345 645079017 645441175 646440804 648246646 651467323 655412078 658307493 661890149
1652 661890149 667267799 671066761 674412072 678579211 683549762 688562930 693108439 698516071 704739988
1670.4 704739988 709804773 714919627 720779240 726146698 731233060 737085700 744444191 750520527
1686.7G50520527N057633N376518M920244N503357O426751O521941P030606N231857
1703G96589434M294098M538297L947377L473401L234268L187597L317773K594292J849890
1721.4H27026427J767337J798928J871824K163947K213895K111971J596392J356005
1737.7H41906726J837731J967132J698851J634062J796901J893640J543343J089871
1754H55368257J061439J127184J133024J118183Q34227P30813R17077J110673J011967
1772.4H64412844N33462L00944M93407O80327O26326M98116M28438N66244Q21173P54297
1792.8H70115578L67403K90811M21942M72605L55780K74777L40820M07934L55542K33352
1813.2H73636544K22325K48969K50578K85327L49224L57270L56853L04580P2121K146
$$ plain form
1686.7 750520527 755578160 760954678 765874922 771378279 777805030 784326971 791357577 796589434
1703 796589434 800883532 805421829 809369206 812842607 816076875 819264472 822582245 825176537 827026427
1721.4 827026427 828793764 830592692 832464516 834628463 836842358 838954329 840550721 841906726
1737.7 841906726 843744457 845711589 847410440 849044502 850841403 852735043 854278386 855368257
1754 855368257 856429696 857556880 858689904 859808087 860642314 861373127 862290204 863400877 864412844
1772.4 864412844 864946306 865247250 865740657 866420984 867047310 867545426 867973864 868540108 869361281 870115578
1792.8 870115578 870482981 870773792 871195734 871668339 872024119 872298896 872639716 873047650 873403192 873636544
1813.2 873636544 873858869 874107838 874358416 874643743 874992967 875350237 875707090 876011670 876083791 876085937
1833.6H76085937J34766K04861K08497K85685L16143J61529N7459P8559Q0228P0035
1854H77683699J17958J74284J51932P2181J06514K64644L10362P2419j27732q3685
1874.4H78742576N5790J75595J53661N841o3181P8320K35796J35601o1631r8288o557
1896.8H79353523J12832J08421n8592j37329K1219J87636R1672j25945j32680M3154
1917.2H79463911J46389Q2195j27435k88546j53482P9274J11223q5056k37286r3639
1937.6H78897548J58071J58787j53363l60965k00749O7353R0421j63019l44992k08020
1958H77941072L0577N4717j16348k64645k04324k98L0338j85728l34561j74701Q3745
1980.4H76859844Q9287j52170k94924j57058O8784M4226k31981l67045j99557M5836
$$ plain form
1833.6 876085937 876220703 876425564 876634061 876919746 877235889 877397418 877454877 877533436 877613664 877683699
1854 877683699 877801657 877975941 878127873 878200054 878306568 878571212 878881574 878953993 878826261 878742576
1874.4 878742576 878798366 878973961 879127622 879133463 879070282 879148602 879384398 879519999 879458368 879360080 879353523
1896.8 879353523 879466355 879574776 879516184 879378855 879400074 879587710 879679382 879553437 879420757 879463911
1917.2 879463911 879610300 879692495 879565060 879276514 879123032 879202306 879313529 879228473 878991187 878897548
1937.6 878897548 879055619 879214406 879061043 878700078 878499329 878566682 878657103 878494084 878149092 877941072
1958 877941072 877971649 878026366 877910018 877645373 877441049 877440751 877471089 877285361 876950800 876776099 876859844
1980.4 876859844 876949131 876796961 876502037 876344979 876413763 876457989 876226008 875858963 875659406 875705242
2000.8H75705242L2365j94609k91824j64926P152M1962j14560k95758k47002m6253
2021.2H74431789J9133j11878k53916k05517l039N3346j30177k63571j43588N3406
2041.6H73445988O2823j06394k34127j54138K0146L8505j26839k12431r0420M9889
2062H72693002N3883o5327j63078j09911L4630O8367m2141r8169k3603N9664M6730
2084.4H72454047j7822m1782j4365K4319K8252j5557n4359l3736M6432Q6248N7160
2106.9H72518837M0710K2948K980J3948K7656M0293N1141M6492N3465P3135P8797O1989
2131.3H73032391N1677O4314O2585M9054N0187O0976Q4877J27435J29819P1525J5855
2153.8H73800695J7166O8903J12653J07467N5850N4895J19508J29878O9440Q404R298
$$ plain form
2000.8 875705242 875737607 875542998 875251174 875086248 875093400 875135362 875020802 874725044 874478042 874431789
2021.2 874431789 874450922 874339044 874085128 873879611 873876572 873929918 873799741 873536170 873392582 873445988
2041.6 873445988 873508811 873402417 873168290 873014152 873034298 873072803 872945964 872733533 872643113 872693002
2062 872693002 872746885 872681558 872518480 872408569 872443199 872511566 872469425 872371256 872347653 872407317 872454047
2084.4 872454047 872436225 872394443 872380078 872404397 872432649 872417092 872362733 872328997 872375429 872461677 872518837
2106.9 872518837 872559547 872582495 872585475 872599423 872627079 872667372 872718513 872765005 872818470 872891605 872970402 873032391
2131.3 873032391 873084068 873148382 873210967 873260021 873310208 873371184 873456061 873583496 873713315 873784840 873800695
2153.8 873800695 873817861 873886764 873999417 874106884 874162734 874217629 874337137 874467015 874536455 874544859 874554157
2176.2H74554157R1851J57356J03414J6570K6465R3102J19388Q2553J9252K861N3466
2198.6H75320435R4473N5969m6075n8710Q2195J53064M0472p8857o3121N4180J26302
2221.1H75680327N4837p6831r4831M7684J70231R5665r4294j56880k265J55270Q0526
2243.5H75859439j18374j49787K0564J29819J7583j30117j02401M5181J12950m708
2263.9H75680149j43171j16944N3167J85788R6261q3506p4446J12951K16186P2658
2284.3H75999093j53482j64032J8776J24633J9669j88291k15947l2366O3479o2287
2304.7H75409245k52962l08096j62244J3292m5478k96951m41074k77400p391m1187
2325.1H73589754l13342l60786o4671J37627k5988k45035j93536P6592L85284N77331
$$ plain form
2176.2 874554157 874646008 874803364 874906778 874923348 874949813 875042915 875162303 875244856 875264108 875266969 875320435
2198.6 875320435 875414908 875470877 875424802 875366092 875448287 875601351 875641823 875562966 875499845 875554025 875680327
2221.1 875680327 875735164 875658333 875563502 875611186 875781417 875877082 875782788 875625908 875623643 875778913 875859439
2243.5 875859439 875741065 875591278 875611842 875741661 875759244 875629127 875526726 875571907 875684857 875680149
2263.9 875680149 875536978 875420034 875473201 875658989 875755250 875671744 875597298 875710249 875926435 875999093
2284.3 875999093 875845611 875681579 875700355 875824988 875844657 875656366 875440419 875408053 875471532 875409245
2304.7 875409245 875156283 874848187 874685943 874699235 874653757 874356806 873915732 873638332 873630941 873589754
2325.1 873589754 873276412 872915626 872850955 872988582 872962594 872717559 872524023 872600615 872985899 873563230
2345.5H73563230M08769o2824n04255o65188n72920m33206j58191K30551M29213M53591
2365.9H72688770M70996N55158P90357R14038P33375N37276N20230N83708N28991K71201
2386.3H78594100J7703n662J25587J67310M1485r6321n7877J19687J96933N1618j40190
2408.7H79014373j16706O1572J38759K2531j52827j46091M6432J34051k1159j78516
2429.1H78802419j09911P7307J37091J1086j43707j17004R8408J75118n6982k73287
2449.5H78600538j75119P2718J51277n96j75953j36257O1334J03414p2122k08735j30296
2471.9H78090203N9485R8706p0751k15531j42693L9339Q6844m5598k08973j95861J2636
2494.4H77507806J20938k5094k02417j73390K4199J10209m5120k18511j67251M4942
$$ plain form
2345.5 873563230 873971999 873909175 873404920 872739732 872166812 871733606 871575415 871805966 872235179 872688770
2365.9 872688770 873159766 873714924 874505281 875419319 876152694 876689970 877210200 877793908 878322899 878594100
2386.3 878594100 878611803 878606141 878731728 878899038 878940523 878844202 878786325 878906012 879102945 879154563 879014373
2408.7 879014373 878897667 878959239 879097998 879120529 878967702 878821611 878868043 879002094 878980935 878802419
2429.1 878802419 878692508 878769815 878906906 878917992 878774285 878657281 878755689 878930807 878873825 878600538
2449.5 878600538 878425419 878498137 878649414 878648818 878472865 878336608 878397942 878501356 878429234 878220499 878090203
2471.9 878090203 878149688 878248394 878177643 877962112 877819419 877858758 877945602 877900004 877691031 877495170 877507806
2494.4 877507806 877628744 877603650 877401233 877227843 877252042 877362251 877317131 877098620 876931369 876976311
2514.8H76976311J27197j3769j85490j95145j7345J01208k8014k00927j81317q95J11104
2537.2H76492918r895j92642j81079p629P9572n0008k04087j60694p331L4094p4327
2559.6H75718892j93656j73569j8417O3061r0122k93314k54393m7207N5730k6166j78993
2582.1H74561846k43783j44720j4484o1273k43008l06428j59323k2590j13905k97248
2602.5H72955084l06964j56462p9930j69814k60353k51591j87337j22786j47343k38657
2622.9H71033847k73704k16127j51276j77860k58685k51114j56105j26779j89244k72930
2643.3H68960023l07322k50160j61171j47701k34603k84136k15888j34766j29759j58906
2663.7H66935611j70350j99914k22981j91868j71601j89960j74284j35661j98900k96116
$$ plain form
2514.8 876976311 877103508 877089739 876904249 876709104 876691759 876792967 876764953 876564026 876382709 876381814 876492918
2537.2 876492918 876483023 876290381 876109302 876101673 876181245 876131237 875927150 875766456 875759125 875793219 875718892
2559.6 875718892 875525236 875351667 875333250 875396311 875306189 875012875 874758482 874711275 874767005 874740839 874561846
2582.1 874561846 874318063 874173343 874158859 874097586 873854578 873548150 873388827 873366237 873252332 872955084
2602.5 872955084 872648120 872491658 872411728 872241914 871981561 871729970 871542633 871419847 871272504 871033847
2622.9 871033847 870760143 870544016 870392740 870214880 869956195 869705081 869548976 869422197 869232953 868960023
2643.3 868960023 868652701 868402541 868241370 868093669 867859066 867574930 867359042 867224276 867094517 866935611
2663.7 866935611 866765261 866565347 866342366 866150498 865978897 865788937 865614653 865478992 865280092 864983976
2684.1H64983976k96891k65777k47121k42531k29538k23457k67566k89619k39551j79350
2704.5H62502575k18451l01004l04102k46227k16842k88606l56972l09110k26140j82330
2724.8H59852791k50518m16101m45127k97308j47641j40488l20256m25756k75194r0718
2745.2H57043684j04487k73526l97444l75569k69055k54452l78549m47512l50833k09153
2765.6H53983104j92165l07620l91662l58343l29614m02450n05150n22196m07815k57075
2786H50309014k69532m61459n81086m74155l23653m00722o47247p40885n81742m08828
2806.4H45419705m28021o15776p30693o10471m82499n35846o91652p91610p22289o03556
2826.8H39207292o37591q20637j002252j017869r11176j063168j548767j934111k044380
$$ plain form
2684.1 864983976 864687085 864421308 864174187 863931656 863702118 863478661 863211095 862921476 862681925 862502575
2704.5 862502575 862284124 861983120 861679018 861432791 861215949 860927343 860570371 860261261 860035121 859852791
2724.8 859852791 859602273 859186172 858741045 858443737 858296096 858155608 857835352 857409596 857134402 857043684
2745.2 857043684 856939197 856665671 856268227 855892658 855623603 855369151 854990602 854543090 854192257 853983104
2765.6 853983104 853790939 853483319 853091657 852733314 852403700 852001250 851496100 850973904 850566089 850309014
2786 850309014 850039482 849578023 848996937 848522782 848199129 847798407 847151160 846410275 845828533 845419705
2806.4 845419705 844991684 844375908 843645215 843034744 842552245 842016399 841324747 840533137 839810848 839207292
2826.8 839207292 838569701 837749064 836746812 835728943 834817767 833754599 832205832 830271721 828227341
2845.2H28227341k031863j913726j612186j192272p63953m27007l95656o91831r81152
2863.5H18217695j127005j249850j271963j129091j030266j033246r33648p49230o87659
2881.9H09005737p36117p77960q20696q65579r00984r65118j028657j063347j106918
2900.2H00740361j175344j255631j301050j318872j451552j718760j970410k048075
2916.6G88500667j856804j508296j155317q08656m33326j15871L0935J25527L18110
2934.9G83096969O19888R58801J226544J279473J076103P57754M87566K93254L2962
2953.3G89829314k05577j63793L0935J23262TJ49072K10344K66910L46065L67701K86221
2975.7G91363716L38018M46498K85328R3937J52528K61545L21329K16186j22905l20613
$$ plain form
2845.2 828227341 826195478 824281752 822669566 821477294 820713341 820286334 819890678 819198847 818217695
2863.5 818217695 817090690 815840840 814568877 813439786 812409520 811376274 810442626 809693396 809005737
2881.9 809005737 808269620 807491660 806670964 805805385 804904401 803939283 802910626 801847279 800740361
2900.2 800740361 799565017 798309386 797008336 795689464 794237912 792519152 790548742 788500667
2916.6 788500667 786643863 785135567 783980250 783171594 782738268 782622397 782653332 782778859 783096969
2934.9 783096969 783716857 784675658 785902202 787181675 788257778 789015532 789503098 789796352 789829314
2953.3 789829314 789623737 789459944 789490879 789614141 789737403 789886475 790096819 790363729 790709794 791077495 791363716
2975.7 791363716 791701734 792148232 792433560 792527497 792680025 792941570 793262899 793479085 793356180 793035567
2996.1G93035567l39508m33326n19872n74052n75781m18425k84493m00841o72042q64625
3016.5G87952602r07600q97467r02057r69112j017332q77440p11441p46190r74119
3034.9G79949844j147986j002430q18611r90987j315593j364470j139521j055003j219093
3053.2G69896150j334131j325607j237452j101435j040578j027047j075626j215338
3069.5G60538936j268447j171291r86159q73327r95338j207113j340389j402259j326323
3087.9G49968290j187682j237154j377046j358330j226604j206875j367152j472950
3104.2G39534497j380622j308262j426816j472533j335979j326680j473784j660586
3120.5G28149235j854956j892567j762986j630306j623750j762032j838386j735568
$$ plain form
2996.1 793035567 792696059 792262733 791742861 791168809 790593028 790174603 789890110 789489269 788817227 787952602
3016.5 787952602 787045002 786147535 785245478 784276366 783259034 782381594 781670153 780923963 779949844
3034.9 779949844 778801858 777799428 776980817 775989830 774674237 773309767 772170246 771115243 769896150
3053.2 769896150 768562019 767236412 765998960 764897525 763856947 762829900 761754274 760538936
3069.5 760538936 759270489 758099198 757113039 756239712 755244374 754037261 752696872 751294613 749968290
3087.9 749968290 748780608 747543454 746166408 744808078 743581474 742374599 741007447 739534497
3104.2 739534497 738153875 736845613 735418797 733946264 732610285 731283605 729809821 728149235
3120.5 728149235 726294279 724401712 722638726 721008420 719384670 717622638 715784252 714048684
3136.8G14048684j704574j884878k016186j990438j927972j801550j679838j828551
3153.2F99214697k178013k337397k236425k079666k023757k099692k175093k141237
3169.5F81943417k105534k153874k210498k237201k232551k217114k215982k229392
3185.8F64341271k232373k207875k187431k218902k310038k360046k316713k251625
3202.1F46256268k215028k179444k167225k198040k201498k167999k131880k150833
3218.4F28844321k216637k214492k109170k040326k037049j954019j876890j980067
3234.7F12415671k102255k076030j995504j890361j722217j637936j797139j910925
3251.1E97283304j741469j581907j630009j718342j693308j620174j568973j501381
$$ plain form
3136.8 714048684 712344110 710459232 708443046 706452608 704524636 702723086 701043248 699214697
3153.2 699214697 697036684 694699287 692462862 690383196 688359439 686259747 684084654 681943417
3169.5 681943417 679837883 677684009 675473511 673236310 671003759 668786645 666570663 664341271
3185.8 664341271 662108898 659901023 657713592 655494690 653184652 650824606 648507893 646256268
3202.1 646256268 644041240 641861796 639694571 637496531 635295033 633127034 630995154 628844321
3218.4 628844321 626627684 624413192 622304022 620263696 618226647 616272628 614395738 612415671
3234.7 612415671 610313416 608237386 606241882 604351521 602629304 600991368 599194229 597283304
3251.1 597283304 595541835 593959928 592329919 590611577 588918269 587298095 585729122 584227741
3267.4E84227741j429975j477421j634597j757980j807689j761139j690268j702488
3283.7E70966184j707911j646281j596748j634777j760483j876414j952707j957000
3300E56833863j811325j662672j759291k058923k281427k306819k247989k212525k185225
3318.4E38307667k147198k122819k152801k311230k458334k422273k341687k286017
3334.7E20065308k211213k276719k455890k545178k595544k523542k294302k334833
3351E00828087k637148k715259k534420k386212k375215k349705k188951k062231k200037
3369.3D79378909k527058k578736k241045j950413j858055j866877j824737j614869
3385.7D62917119j254141r06020r66251j346320j389623r69619o95109r72867j303047
$$ plain form
3267.4 584227741 582797766 581320345 579685748 577927768 576120079 574358940 572668672 570966184
3283.7 570966184 569258273 567611992 566015244 564380467 562619984 560743570 558790863 556833863
3300 556833863 555022538 553359866 551600575 549541652 547260225 544953406 542705417 540492892 538307667
3318.4 538307667 536160469 534037650 531884849 529573619 527115285 524693012 522351325 520065308
3334.7 520065308 517854095 515577376 513121486 510576308 507980764 505457222 503162920 500828087
3351 500828087 498190939 495475680 492941260 490555048 488179833 485830128 483641177 481578946 479378909
3369.3 479378909 476851851 474273115 472032070 470081657 468223602 466356725 464531988 462917119
3385.7 462917119 461662978 460756958 459790707 458444387 457054764 456085145 455390036 454417169 453114122
3404D53114122j075685o56605n33163n86242o70790o53357m09066j87487j29640J5021
3424.4D48227108L09616N31405N19097N57601P52241O75797L73423M02481P93189J125067
3444.8D54267025J214802J161188J231998J417309J600027J813412J949191J825571
3461.1D66480523J787663K178341K413809K016515J528442J577705J958251K308994
3477.4D82250243K349884K088427K069563K312332K307177K186835K335399K565473
3493.8E00465333K644778K521813K463996K573609K431274K165854K323866K700984
3510.1E20291507K883077K775848K541542K545416K826691L176749L140092K778649
3526.4E42959571K711236K919317L136992L348470L329456L107965L273010L678083
$$ plain form
3404 453114122 452038437 451381832 450848669 450262427 449591637 448938280 448529214 448341727 448212087 448227108
3424.4 448227108 448536724 449068129 449587226 450144827 450897068 451572865 451946288 452348769 453141958 454267025
3444.8 454267025 455481827 456643015 457875013 459292322 460892349 462705761 464654952 466480523
3461.1 466480523 468268186 470446527 472860336 474876851 476405293 477982998 479941249 482250243
3477.4 482250243 484600127 486688554 488758117 491070449 493377626 495564461 497899860 500465333
3493.8 500465333 503110111 505631924 508095920 510669529 513100803 515266657 517590523 520291507
3510.1 520291507 523174584 525950432 528491974 531037390 533864081 537040830 540180922 542959571
3526.4 542959571 545670807 548590124 551727116 555075586 558405042 561513007 564786017 568464100
3542.7E68464100L741145L351391L104508L331661L549874L528476L629326L857017
3559E96557498L860474L716528L934920M576981M459679L849566L851175M198611M426718
3577.4F33432150M622817M772603M739523M801214M955471M757523M456103M623592
3593.7F71160996M968226N051792M952311M830599M706263M720986N043328N120456
3610G10554957M928589M795134M574716M796386N097389M376710L692984L944576M989028
3628.4G51750469N066514L959120L730773L764928L605902L539622L443897L301143
3644.7G82162368L517509M135668L562033K261818K153873K719939K675116K152383
3661H05340707J833678J814365J936197K067685J905561J585126J609623J461089J142204
$$ plain form
3542.7 568464100 572205245 575556636 578661144 581992805 585542679 589071155 592700481 596557498
3559 596557498 600417972 604134500 608069420 612646401 617106080 620955646 624806821 629005432 633432150
3577.4 633432150 638054967 642827570 647567093 652368307 657323778 662081301 666537404 671160996
3593.7 671160996 676129222 681181014 686133325 690963924 695670187 700391173 705434501 710554957
3610 710554957 715483546 720278680 724853396 729649782 734747171 739123881 742816865 746761441 751750469
3628.4 751750469 756816983 760776103 764506876 768271804 771877706 775417328 778861225 782162368
3644.7 782162368 785679877 789815545 793377578 795639396 797793269 800513208 803188324 805340707
3661 805340707 807174385 808988750 810924947 812992632 814898193 816483319 818092942 819554031 820696235
3679.4H20696235J123488J228451J395882J740634J657188Q79228N55098O60181P47562
3697.7H30683947Q15451Q33511P11858O44803P20859Q88467R20296O23226L69370L60191
3718.1H37571979M49657M68254L57568J99259K45273N19991Q41260Q89241N33283J63436
3738.5H42239201l3319p3612J98543M89831M08352L13878K49147K24054K41518J75357
3758.9H44432950P8499J22488K05815J78516Q6605N2393J40547K68579L71456L03388
3779.3H46241236O7949k1040M3511P5698P5877J19328K26736L13819K42114Q8691j1086
3801.7H47462833J2159N1916k2411n8055J09017K61008K31386K02476J26899o7413
3822.1H48309815r1553r775l1769m2022J63675M05073K86877o5684j68979n0009O4016
$$ plain form
3679.4 820696235 821819723 823048174 824444056 826184690 827841878 828721106 829276204 829936385 830683947
3697.7 830683947 831499398 832332909 833044767 833689570 834410429 835298896 836219192 836842418 837211788 837571979
3718.1 837571979 838021636 838489890 838847458 839046717 839291990 839811981 840653241 841542482 842075765 842239201
3738.5 842239201 842205882 842132270 842330813 842820644 843228996 843542874 843792021 844016075 844257593 844432950
3758.9 844432950 844511449 844633937 844839752 845018268 845104873 845157266 845297813 845566392 845937848 846241236
3779.3 846241236 846309185 846288145 846331656 846407354 846483231 846602559 846829295 847143114 847385228 847473919 847462833
3801.7 847462833 847474992 847526908 847504497 847446442 847555459 847816467 848047853 848250329 848377228 848309815
3822.1 848309815 848218262 848208487 848176718 848134696 848298371 848703444 848990321 848924637 848755658 848705649 848769665
3844.6H48769665K2352r1076j48118j51634N4896J53780P1108P7069O7770k9444n1737
3867H48744631J7345Q6188L0398m4882m77P2837J06573J12236K3484j37746j52111
3889.4H48858476n2035J5914K6763L5465M4047k086p8022j15931j02341m1605O0201
3911.9H48648846J20700J13070O6161j0908n9128n5611j0490O8187J02938K9027q9526
3934.3H48923266j35779p5520J2935O7949O4611Q703m2618o4313j2398M1187M0889
3956.7H48828912O3360N4001k1755l0399N3942J08302P0095k146K0683J36435J56999
3979.2H49438429R2029Q0586M6909m4108o8187l4750p212K6524N6863
3997.5H49587083
$$ plain form
3844.6 848769665 848792017 848700941 848552823 848401189 848456085 848609865 848680973 848758042 848825812 848796368 848744631
3867 848744631 848761976 848848164 848878562 848833680 848833203 848906040 849012613 849124849 849148333 849010587 848858476
3889.4 848858476 848806441 848822355 848849118 848884583 848928630 848926544 848848522 848732591 848630250 848588645 848648846
3911.9 848648846 848769546 848882616 848948777 848937869 848878741 848823130 848812640 848880827 848983765 849012792 848923266
3934.3 848923266 848787487 848711967 848724902 848792851 848857462 848866165 848823547 848759234 848746836 848788023 848828912
3956.7 848828912 848892272 848946273 848924518 848894119 848948061 849056363 849126458 849124312 849144995 849281430 849438429
3979.2 849438429 849530458 849611044 849657953 849613845 849545658 849510908 849503696 849530220 849587083
3997.5 849587083
##END=$$ End of the data block
