##TITLE=$$ Begin of the data block
##JCAMP-DX=5.00 $$ ACD/SpecManager v 10.08
##SPECTROMETER/DATA SYSTEM=Alpha
##DATE=09 Apr 2014 11:14:46
##DATA TYPE=INFRARED SPECTRUM
##DATA CLASS=XYDATA
##ORIGIN=
##OWNER=
##NPOINTS=1765
##FIRSTX=399.75695801
##LASTX=3997.56933594
##MAXX=3997.56933594
##MINX=399.75695801
##MAXY=0.86462581
##MINY=0.39384991
##XFACTOR=1.0000000000
##YFACTOR=1.000000000000000e-9
##FIRSTY=0.72207230
##DELTAX=2.03957629
##XUNITS=1/CM
##YUNITS=ARBITRARY UNITS
##XYDATA=(X++(Y..Y))
399.8G22072303j619816j402020j255989r36329n18918k74718k46585m4763K6047p30395
420.2G15068817r33468l65317j90854l92199k13623J28627m75764j142383j46150O97732
440.5G12035418k02954p96974o5625L38435o0200k19584L64960L18765r19461j244664
460.9G09548116n36084k71023n29468m93288l19064q25345j178682n01513N3584l12209
481.3G04635024o93440k72036Q1420m57943p74323k91706k74062q81791p39097J5437
501.7G00347483k36213j038253p46251m4822o31035j514732r75192k57075q26239j329005
522.1F92748666q40962n30124j055419j221955n54741l72648j027941j131893m47750
540.5F85565233l40998j046479j095295m21643n51402j161933r43900n72741r86456
$$ plain form
399.8 722072303 720452487 719050467 717794478 716858149 716339231 716064513 715817928 715773165 715799212 715068817
420.2 715068817 714135349 713770032 713579178 713186979 712973356 713101983 712626219 711483836 711337686 712035418
440.5 712035418 711832464 711035490 710969865 711308300 711248100 711028516 711393476 711712241 710792780 709548116
460.9 709548116 709012032 708741009 708211541 707718253 707399189 706573844 705395162 704893649 704947233 704635024
481.3 704635024 703941584 703669548 703750968 703293025 702518702 702226996 701952934 701071143 700332046 700347483
501.7 700347483 700111270 699073017 698326766 698281944 697650909 696136177 695160985 694903910 694077671 692748666
522.1 692748666 691907704 691377580 690322161 689100206 688545465 688172817 687144876 686012983 685565233
540.5 685565233 685224235 684177756 683082461 682660818 682109416 680947483 680003583 679430842 678444386
558.8F78444386j336098r12845n54979j147449j736045j359403j021564j375735j492023
577.2F67508245j014472q94248j279414j246988o31691n58257j122295j051784n69344
595.6F59139752r27627j730799j780928j570105j953304k065122j170158m69685p68065
613.9F46703959p39754O73890K116442K366126K421796L020167L291428K720535K502501
632.3F65077090K955258K787531J864075J421511J687944J694441J445174J744330
648.6F80677354K012909J252234N31852J308799K721071L008485K431035J871943J737357
666.9F97553039K375602K500117K417684K393663J834333J594185K061129K104342
683.3G14834094J469791J210570J461268J384377R31502Q44717J088440J004994P15315
$$ plain form
558.8 678444386 677108288 676195443 675640464 674493015 672756970 671397567 670376003 669000268 667508245
577.2 667508245 666493773 665599525 664320111 663073123 662441432 661883175 660760880 659709096 659139752
595.6 659139752 658212125 656481326 654700398 653130293 651176989 649111867 647941709 647472024 646703959
613.9 646703959 645964205 646638095 648754537 651120663 653542459 656562626 659854054 662574589 665077090
632.3 665077090 668032348 670819879 672683954 674105465 675793409 677487850 678933024 680677354
648.6 680677354 682690263 683942497 684474349 685783148 688504219 691512704 693943739 695815682 697553039
666.9 697553039 699928641 702428758 704846442 707240105 709074438 710668623 712729752 714834094
683.3 714834094 716303885 717514455 718975723 720360100 721291602 722136319 723224759 724229753 724945068
701.6G24945068Q96454J330197J341760J219213J483321J778305J634002J402616J581252
720G37612188J828372J639605J421332J543463J627981J361013J193106J406550J412332
738.3G51045942J025856Q94189J250684J527071J450002J364529J501978J550197J374126
756.7G62984574J308977J374603J275122R58204P89404Q48353Q10742N41091K31862
775G71122932O7473q7142l22938l73423j19388J15394K58208O84976J506984K208710
795.4G75061786K478600K776146L297805L381908K877653K544045K493501K127707
811.7G97039151J409054J019418J006007N69284k84433p78317r97961j561940k178549
830.1G95241714k161265j818657j885712k034306j649499j275063j486421j484573
$$ plain form
701.6 724945068 725841522 727171719 728513479 729732692 731216013 732994318 734628320 736030936 737612188
720 737612188 739440560 741080165 742501497 744044960 745672941 747033954 748227060 749633610 751045942
738.3 751045942 752071798 752965987 754216671 755743742 757193744 758558273 760060251 761610448 762984574
756.7 762984574 764293551 765668154 766943276 767901480 768690884 769539237 770349979 770891070 771122932
775 771122932 771190405 771103263 770780325 770406902 770287514 770402908 770661116 771346092 772853076 775061786
795.4 775061786 777540386 780316532 783614337 786996245 789873898 792417943 794911444 797039151
811.7 797039151 798448205 799467623 800473630 801042914 800758481 799980164 798982203 797420263 795241714
830.1 795241714 793080449 791261792 789376080 787341774 785692275 784417212 782930791 781446218
846.4G81446218n73217O17921J580119K641976L836930M546940M601359M586459M647791
864.8H07932496M162490L195405K640188K559126K162516J399398J027226R45985L55661
883.1H26380491m58061o72698o06478r00030j052081m78685K37524M36545M94122Q87573
903.5H24268222J102626N94497J3232q6427m13298j290620j878678j810968j698017
921.9H18800569j703561j223445k70664L60906L87132L52740N11527L66867j16289
940.2H17465782k84254j62959m38571j105667j517593j728058k353013l197849l663957
958.6H03013861m055559m932046n955160o600261p105291p779181q055567p384479
974.9G51146317o404341n814910n263805m454851l834009l600061l252805k531409
$$ plain form
846.4 781446218 780873001 781490922 783071041 785713017 789549947 794096887 798698246 803284705 807932496
864.8 807932496 812094986 815290391 817930579 820489705 822652221 824051619 825078845 826024830 826380491
883.1 826380491 825922430 825249732 824643254 823743224 822691143 822212458 822449982 822886527 823380649 824268222
903.5 824268222 825370848 825965345 825978577 825892150 825478852 824188232 822309554 820498586 818800569
921.9 818800569 817097008 815873563 815602899 815963805 816350937 816703677 817215204 817582071 817465782
940.2 817465782 817181528 817018569 816579998 815474331 813956738 812228680 809875667 806677818 803013861
958.6 803013861 798958302 794026256 788071096 781470835 774365544 766586363 758530796 751146317
974.9 751146317 744741976 738927066 733663261 729208410 725374401 721774340 718521535 715990126
991.2G15990126j928329j674950j290143p00235m95851q21114j173973j473010k153456
1009.6G04279065l032565l438056l409147l465473l559173l362417l154874l269970
1025.9F77587390l359199l114760k827048k762079k663314k334059k052545k061546
1042.2F56412840k166689k139508k107263k125144j890421j238227m87029M8935L88146
1060.6F44695640M72128L1948q42631j709223k353131k827287l124237l145516k971768
1078.9F28225923k862454k924681l047168l164172l265083l209412k751708k003849
1095.2F04997396j417279j141369r77934q31425q49127j011134j140237j202464j292765
1113.6E95133662j493633j900911k529800k965808k650082j838624r27091N47707J861632
$$ plain form
991.2 715990126 714061797 712386847 711096704 710396469 709900618 709079504 707905531 706432521 704279065
1009.6 704279065 701246500 697808444 694399297 690933824 687374651 684012234 680857360 677587390
1025.9 677587390 674228191 671113431 668286383 665524304 662860990 660526931 658474386 656412840
1042.2 656412840 654246151 652106643 649999380 647874236 645983815 644745588 644258559 644307494 644695640
1060.6 644695640 645167768 645199716 644357085 642647862 640294731 637467444 634343207 631197691 628225923
1078.9 628225923 625363469 622438788 619391620 616227448 612962365 609752953 607001245 604997396
1095.2 604997396 603580117 602438748 601460814 600629389 599780262 598769128 597628891 596426427 595133662
1113.6 595133662 593640029 591739118 589209318 586243510 583593428 581754804 580827713 581375420 583237052
1132E83237052J892865J600146J839280K162814K221883K044677J753152J554370J541912
1150.3E99848151J621187J703024J863003K199769K626419L100693L716886M471123
1166.6F21150255N138099N565882N815804N919516N858183N715370N531729N228996
1182.9F65923834M778445M136324L344416K575338J898110J359761J067817J062632
1199.3F86146677J312971J702845K079785K330303K324462K039313J670241J426697
1215.6G01033294J284123J150190J087964J150966J265585J333535J365364J454949
1231.9G11125970J599550J659155J620591J605987J547992J319528J023054P94113
1248.2G22295940N78761L27110J86920K73765M70817P14659J129151J699090K139807
$$ plain form
1132 583237052 585129917 586730063 588569343 590732157 592954040 594998717 596751869 598306239 599848151
1150.3 599848151 601469338 603172362 605035365 607235134 609861553 612962246 616679132 621150255
1166.6 621150255 626288354 631854236 637670040 643589556 649447739 655163109 660694838 665923834
1182.9 665923834 670702279 674838603 678183019 680758357 682656467 684016228 685084045 686146677
1199.3 686146677 687459648 689162493 691242278 693572581 695897043 697936356 699606597 701033294
1215.6 701033294 702317417 703467607 704555571 705706537 706972122 708305657 709671021 711125970
1231.9 711125970 712725520 714384675 716005266 717611253 719159245 720478773 721501827 722295940
1248.2 722295940 722874701 723201811 723388731 723662496 724133313 724847972 725977123 727676213 729816020
1266.6G29816020K316713K501488K789557K886951K778649K767801K921820L012597
1282.9G51791596K972782L021956L118276K982855K692819K502620K366185K084732
1299.2G73533821J743674J566232J441002J121103P67470O85394O81757N02348M37200
1317.6G82480001O34850P88092P70152P75575Q89302Q30233M48942J01864J12176K16723
1338G88047910L3021j33455R7752L20494J90913J9610R716r4712m09663n67257m78804
1360.4G87035525o89566j246393j389444j164853j071036j208663j370013j508594
1376.7G77386963k292335l978908m546523j984000J565218K175569P43747k8670o04987
1395.1G68436074j325369j702726j809716k020776k306104k109587j734733j728237
$$ plain form
1266.6 729816020 732132733 734634221 737423778 740310729 743089378 745857179 748778999 751791596
1282.9 751791596 754764378 757786334 760904610 763887465 766580284 769082904 771449089 773533821
1299.2 773533821 775277495 776843727 778284729 779405832 780173302 780858696 781540453 782042801 782480001
1317.6 782480001 783114851 783902943 784673095 785448670 786337972 787168205 787617147 787719011 787831187 788047910
1338 788047910 788080931 787947476 788045228 788365722 788556635 788576245 788585961 788491249 788081586 787514329 787035525
1360.4 787035525 786345959 785099566 783710122 782545269 781474233 780265570 778895557 777386963
1376.7 777386963 775094628 771115720 766569197 764585197 766150415 768325984 769069731 769041061 768436074
1395.1 768436074 767110705 765407979 763598263 761577487 759271383 757161796 755427063 753698826
1411.4G53698826j639366j124025p61270j053214j180709p32541n04195n80550m56214
1429.7G45666742n6445K18272M14729O38604P41542Q66711R02176J256108J930892
1448.1G52579331J982391J753569K215028L997743N002975L041447K649426L822386
1464.4G77044296L958822L078639L589630N197823M624367K876878K370775K139806
1480.7H04881036J532436R91225J033783P95424l58343r17197o22212p87497j693070
1499.1H04855585j917720j443565j343608k595961l211975k638519k411723k265870
1515.4G87026644j929820j502752j658201k016008j750529j561999j622022j551151
1531.7G73434162j327574j089811q57890o66678q29637j049578j071275o81817q8751
$$ plain form
1411.4 753698826 752059460 750935435 750174165 749120951 747940242 747207701 746703506 746122956 745666742
1429.7 745666742 745610297 745828569 746243298 746881902 747623444 748490155 749392331 750648439 752579331
1448.1 752579331 754561722 756315291 758530319 762528062 767531037 770572484 773221910 777044296
1464.4 777044296 781003118 784081757 787671387 792869210 797493577 800370455 802741230 804881036
1480.7 804881036 806413472 807404697 808438480 809233904 808875561 807958364 807336152 806548655 804855585
1499.1 804855585 802937865 801494300 800150692 797554731 794342756 791704237 789292514 787026644
1515.4 787026644 785096824 783594072 781935871 779919863 778169334 776607335 774985313 773434162
1531.7 773434162 772106588 771016777 770158887 769492209 768662572 767612994 766541719 765859902 765771151
1550.1G65771151J36315L3319J26779O81103N9545j189292j234352j032532j302123
1568.4G62049913k069115k312243k383650l300070l827989l658891l821969m195273
1584.7G36480713m605413m836440m982710n194187n518377n603313n468488n543887
1601.1F94727898n697012n576194n479812n742669n792261n344510n468845o188095
1617.4F49438500n063653m069745m344225m220665l744185l247797k332926j405954
1633.7F21009350n79179J9074M75645J204371K059520L775418M830718L282785M352927
1652F40430629P674396M894138L373146M316509N646824N773723M641116N283535O597578
1670.4F88631594N513549N443215O112218N250693M789233N886316Q134008O373524
$$ plain form
1550.1 765771151 765907466 765940785 766067564 766748667 766808212 765618920 764384568 763352036 762049913
1568.4 762049913 759980798 757668555 755284905 751984835 748156846 744497955 740675986 736480713
1584.7 736480713 731875300 727038860 722056150 716861963 711343586 705740273 700271785 694727898
1601.1 694727898 689030886 683454692 677974880 672232211 666439950 661095440 655626595 649438500
1617.4 649438500 644374847 640305102 635960877 631740212 627996027 624748230 622415304 621009350
1633.7 621009350 620430171 620449245 620924890 622129261 624188781 627964199 632794917 636077702 640430629
1652 640430629 648105025 652999163 656372309 660688818 666335642 672109365 676750481 682034016 688631594
1670.4 688631594 694145143 699588358 705700576 710951269 715740502 721626818 729760826 736134350
1686.7G36134350M597843M930317M608155N450129O492377O307959P101894N398154
1703G81021178M373789M624009L770768L253937L232718L425479L877699K977490J736403
1721.4H12293470J707196K027035K064764K106369K045631K597869K392471J330793
1737.7H28565598J606643K005815J814246J691282J751065J888812J642823J085103
1754H42051387J071513J203238J077414J078665Q06868O56128Q79109J001299R99570
1772.4H50825191O72102L06010L84569N61714N28276M97282M63783L79205N81384Q17954
1792.8H56017470M26293J52111L30269N12779L56257J67727K43008L83735L82245K14040
1813.2H59185934J69993K58445K43485J78814L12209M63963L19362K36630K09391O9320
$$ plain form
1686.7 736134350 740732193 745662510 750270665 755720794 762213171 768521130 775623024 781021178
1703 781021178 785394967 790018976 793789744 797043681 800276399 803701878 807579577 810557067 812293470
1721.4 812293470 814000666 816027701 818092465 820198834 822244465 824842334 827234805 828565598
1737.7 828565598 830172241 832178056 833992302 835683584 837434649 839323461 840966284 842051387
1754 842051387 843122900 844326138 845403552 846482217 847289085 847945213 848824322 849825621 850825191
1772.4 850825191 851497293 851803303 852187872 852749586 853277862 853775144 854238927 854618132 855199516 856017470
1792.8 856017470 856443763 856595874 856926143 857438922 857795179 857962906 858205914 858589649 858971894 859185934
1813.2 859185934 859355927 859614372 859857857 860036671 860348880 860812843 861132205 861368835 861578226 861647546
1833.6H61647546O6996J44243J57416K09749L64661K92659M3988o437j6153K9743J86085
1856H63120496K38240J20223L8683J21295K14875K31028J17183j5200m8160p2062j3828
1878.4H64052773J14977Q8215k7776L0637K20358J46628j08123m0531J02102j4186
1898.8H64565074j08420P391J15990L7790m2737j550k2947j13249l2962J06037N9962
1921.3H64570379p3373j82927j16229m3928j37628j23262J6511n424j38760o7830M5299
1943.7H63742828j12891k64764j63316j0252q8692k45154j98364q0586j36375j97888
1964.1H62244546o5267o55j73092k77877j67370p6592j45376j85251m9710K1756j10865
1986.5H61014247j80364n2035l9935k63393l15547j38104o5565j60575j80423r3400
$$ plain form
1833.6 861647546 861714542 861858785 862016201 862225950 862590611 862883270 862927258 862920821 862904668 862934411 863120496
1856 863120496 863358736 863478959 863517642 863638937 863853812 864084840 864202023 864186823 864138663 864066601 864052773
1878.4 864052773 864167750 864255965 864228189 864258826 864479184 864625812 864517689 864477158 864579260 864565074
1898.8 864565074 864456654 864464045 864580035 864617825 864575088 864573538 864550591 864437342 864404380 864510417 864570379
1921.3 864570379 864497006 864314079 864197850 864153922 864016294 863893032 863909543 863904119 863765359 863697529 863742828
1943.7 863742828 863629937 863365173 863201857 863191605 863102913 862857759 862659395 862578809 862442434 862244546
1964.1 862244546 862179279 862178624 862005532 861727655 861560285 861483693 861338317 861153066 861103356 861125112 861014247
1986.5 861014247 860833883 860781848 860741913 860478520 860162973 860024869 859959304 859798729 859618306 859524906
2006.9H59524906j24157k30551j76191l6001o0320k20001k40206j14501j35303k25007
2027.3H57962668j31369k3186j06931k11119j44959o3240j22786j80066r9301k4736
2047.7H56854975o8545j29700j01149n3704p9989j04725o3122k2888o5923j14321p8679
2070.2H55972230k3961l2365n8472m2498l6359n5790l7134K1816L4093l7670q0704
2092.6H55623186k5690P331k2709j7226L0935L1531k6763n2511j7762J0490J2517K1219
2117.1H55574548L8028L1173k444Q285M7386L8028m590k443N9664P0810L3975M8041
2141.5H55940461P4268M1544K6524P3612P6175J3411j7345K3722Q1182Q8215O4790
2164H56486559P8440Q4400L8802K3842N9843P2480M2557K7597N4837O4253L2187K1815
$$ plain form
2006.9 859524906 859400749 859170198 858994007 858958006 858897686 858677685 858437479 858322978 858187675 857962668
2027.3 857962668 857831299 857808113 857701182 857490063 857345104 857281864 857159078 856979012 856879711 856854975
2047.7 856854975 856786430 856656730 856555581 856501877 856421888 856317163 856254041 856231153 856165230 856050909 855972230
2070.2 855972230 855948269 855915904 855857432 855814934 855778575 855722785 855685651 855707467 855741560 855703890 855623186
2092.6 855623186 855597496 855604827 855582118 855564892 855595827 855627358 855600595 855548084 855530322 855540812 855553329 855574548
2117.1 855574548 855612576 855643749 855641305 855649590 855696976 855735004 855730414 855727971 855787635 855858445 855892420 855940461
2141.5 855940461 856014729 856056273 856082797 856156409 856232584 856245995 856228650 856252372 856333554 856421769 856486559
2164 856486559 856564999 856649399 856688201 856712043 856771886 856844366 856886923 856914520 856969357 857033610 857065797 857087612
2188.4H57087612M2856M9591K8789Q464J7166R656j5497J9908O0439K4497l0219l5346
2212.9H57267916p868N544K0802L4690j014l6478J252M9233L9220o258l2246p272m17
2239.4H57327104l9757m8041l3379m3213l8922j2100k7358o3300n5015m1008n3466
2261.9H56871545k3901M8518M6849j1921k5212l1531k7776L1412O8128M3273p451n2810
2286.3H56929123j01924j76847j84774o2585K9326m0412j74046k20597k12967k77817
2306.7H55506480l37899k68936j48058j45495l14415m50193l70980k48968k99871l66748
2327.1H52554917k67088j43826j91629l46422l79205k16663P9751O22630J154185N86748
2347.5H53453398n84126j111984r45747o15179k89441k9742L45468P16746Q03411Q59797
$$ plain form
2188.4 857087612 857130468 857180059 857208848 857217312 857234478 857244134 857228637 857248545 857308984 857333481 857303262 857267916
2212.9 857267916 857260048 857265592 857286394 857321084 857320070 857283592 857284844 857334077 857373297 857367039 857334793 857327521 857327104
2239.4 857327104 857287347 857239306 857205927 857162714 857123792 857111692 857084334 857021034 856966019 856925011 856871545
2261.9 856871545 856847644 856896162 856943011 856931090 856905878 856874347 856846571 856877983 856946111 856989384 856981933 856929123
2286.3 856929123 856827199 856650352 856465578 856402993 856432319 856391907 856217861 855997264 855784297 855506480
2306.7 855506480 855168581 854899645 854751587 854606092 854291677 853841484 853470504 853221536 852921665 852554917
2327.1 852554917 852287829 852144003 851952374 851605952 851226747 851010084 851089835 851712465 852866650 853453398
2347.5 853453398 852869272 851757288 850811541 850196362 849906921 849877179 850222647 850939393 851742804 852602601
2367.9H52602601Q67665P99894Q61705R05633P50064N71669M69028L12329J17719K4915
2388.3H58283222K9981R2685J03355M17k8670L5465J5735l8922K146N4002p689p6234
2412.8H58465493j7762L7610l3617q8692l5941l0995r2506m0174O6340K4557j01447
2435.2H58152866j11162j9074J073q6427r2506J3709n186j05917q2493k2173n3406
2457.7H57589304j01923o2585j9431p2420j07646m2737k0384j12713j48058o3300j0192
2480.1H56827915n2750r0838o5744o6995j20461j14263n4895o1691j16766j08659m3452
2502.5H55931401n6565j46031j26421m1902p7844j34170n5313J9908o7711j70469j15872
2525H54959011l8326p0274r8645o9261o3956j21474j49727p3850k7656j08004j87814
$$ plain form
2367.9 852602601 853470266 854270160 855131865 856037498 856787562 857359231 857828259 858140588 858258307 858283222
2388.3 858283222 858313203 858405888 858509243 858509660 858480990 858516455 858532190 858493268 858495414 858549416 858541727 858465493
2412.8 858465493 858447731 858485341 858451724 858363032 858327091 858296096 858203590 858163416 858229756 858254313 858152866
2435.2 858152866 858041704 858022630 858023703 857937276 857844770 857858479 857853293 857747376 857664883 857642710 857589304
2457.7 857589304 857487381 857424796 857405365 857332945 857225299 857182562 857162178 857049465 856901407 856838107 856827915
2480.1 856827915 856775165 856684327 856618583 856551588 856431127 856316864 856261969 856200278 856083512 855974853 855931401
2502.5 855931401 855874836 855728805 855602384 855560482 855482638 855348468 855293155 855313063 855245352 855074883 854959011
2525 854959011 854920685 854850411 854751766 854682505 854618549 854497075 854347348 854273498 854245842 854137838 853950024
2547.4H53950024j42694n7042n6266p6771o3002q0586j17480j12176q1599j02461j79886
2569.8H52880061j83583r8228p6115j44541j77026j24038j12474j77025j85013j47760
2590.2H51454258j65999k01285k05219k03550k06530k11954k10046j93596k14160k64287
2610.6H49377632k29239j76847k31684k73227k26379j87218k07901k57850k67565k32041
2631H47087681k33829k55644k19107j79410k11715k55406k27213j93179k42710l03388
2651.4H44766080k73287k30849k66194k80976k12491j72555k26498k59995k05994j84059
2671.8H42453182k52784k52544j62781j95563l20196l41594k78771k65360k85446k58565
2692.2H39839578k32816k52485k97249l15070k74539k46763k61426k81334l05712l32117
$$ plain form
2547.4 853950024 853807330 853750288 853694022 853617251 853554249 853473663 853356183 853244007 853162408 853059947 852880061
2569.8 852880061 852696478 852598250 852522135 852377594 852200568 852076530 851964056 851787031 851602018 851454258
2590.2 851454258 851288259 851086974 850881755 850678205 850471675 850259721 850049675 849856079 849641919 849377632
2610.6 849377632 849148393 848971546 848739862 848466635 848240256 848053038 847845137 847587287 847319722 847087681
2631 847087681 846853852 846598208 846379101 846199691 845987976 845732570 845505357 845312178 845069468 844766080
2651.4 844766080 844492793 844261944 843995750 843714774 843502283 843329728 843103230 842843235 842637241 842453182
2671.8 842453182 842200398 841947854 841785073 841589510 841269314 840927720 840648949 840383589 840098143 839839578
2692.2 839839578 839606762 839354277 839057028 838741958 838467419 838220656 837959230 837677896 837372184 837040067
2712.6H37040067l25501k85208k62201k50519k11894j96815k96414m33743m18424k95282
2733H34064066k26676k32995k68995k82169k62618k68340k77936k69235l15785l61502
2753.4H31297815l30210l09765l56436l82662l27587k81691l16442l51309l24130l19004
2773.8H27998579l99054m72664m57824m24325m26769l88384l32117l75629m73976n00679
2794.2H23747158m55022m85182n95748o13689n75126n80847n93841o31034o81937o84500
2814.6H17850232o57797o34610o35088p02977p98047q17060p99477q42691r23991r85205
2835H10053289j058042j289368j694262k045095k264380k370894k184034j682341j154601
2853.3G94310272p96259n60760m67241o04391q28326r89139j128554j220584j165211
$$ plain form
2712.6 837040067 836714566 836429358 836167157 835916638 835704744 835507929 835211515 834777772 834359348 834064066
2733 834064066 833837390 833604395 833335400 833053231 832790613 832522273 832244337 831975102 831659317 831297815
2753.4 831297815 830967605 830657840 830301404 829918742 829591155 829309464 828993022 828641713 828317583 827998579
2773.8 827998579 827599525 827126861 826669037 826244712 825817943 825429559 825097442 824721813 824247837 823747158
2794.2 823747158 823292136 822806954 822211206 821597517 821022391 820441544 819847703 819216669 818534732 817850232
2814.6 817850232 817192435 816557825 815922737 815219760 814421713 813604653 812805176 811962485 811038494 810053289
2835 810053289 808995247 807705879 806011617 803966522 801702142 799331248 797147214 795464873 794310272
2853.3 794310272 793514013 792953253 792486012 791881621 791053295 790064156 788935602 787715018 786549807
2871.7G86549807j050234j006127r31918p77543o79433p31707q71181r64523r98735
2890.1G78538406j015186j030624j092613j208425j274883j234115j194715j290202
2906.4G69197643j472652j654983j873851k094388k140700j954914j658499j274109
2922.7G55073547q40306m23849q4579K1518R9838L95536P22349R54032J165509J304209
2943.1G58387804J192093Q09193L94046J55151m4584k53916k33889M77J99437K70307
2963.5G60876119L05534L97443M88520N13315N20945N01334N05388N13911L40105J48236
2983.9G65110850J88530L15428L66151K54989m1128k88248m28199n33820n48601n66125
3004.3G63829827n96285n13315m00543m75347p09534q83937r49442r75370r55701r32694
$$ plain form
2871.7 786549807 785499573 784493446 783561528 782783985 782104552 781372845 780501664 779537141 778538406
2890.1 778538406 777523220 776492596 775399983 774191558 772916675 771682560 770487845 769197643
2906.4 769197643 767724991 766070008 764196157 762101769 759961069 758006155 756347656 755073547
2922.7 755073547 754233241 753809392 753724813 753746331 753846169 754241705 754964054 755918086 757083595 758387804
2943.1 758387804 759579897 760389090 760783136 760938287 760893703 760639787 760405898 760406375 760605812 760876119
2963.5 760876119 761181653 761579096 762067616 762580931 763101876 763603210 764108598 764622509 764962614 765110850
2983.9 765110850 765299380 765614808 765980959 766235948 766194820 765906572 765478373 764944553 764395952 763829827
3004.3 763829827 763233542 762720227 762319684 761844337 761134803 760250866 759301424 758326054 757370353 756437659
3024.7G56437659j008093j045764r33885q75950j052439j254022j165569j025081j149118
3043G46927738j336038j360536j283884j295149j377761j371920j375974j415968j336634
3061.4G34773874j189530j118183j258254j497447j507819j310527j146317j143157
3077.7G24602640j294673j412153j425386j462340j472652j428246j498998j625835
3094G12982357j587987j428128j397729j571357j665652j533985j485765j651644j672507
3112.4F98987603j475274j443684j685262j986563k152086k081632j898945j849353
3128.7F84414804j965344k050638j979053j827896j841307k117991k318144k235770
3145F68078661k109170k049625k018988k145350k389610k492010k442956k364755k323568
$$ plain form
3024.7 756437659 755429566 754383802 753449917 752573967 751521528 750267506 749101937 748076856 746927738
3043 746927738 745591700 744231164 742947280 741652131 740274370 738902450 737526476 736110508 734773874
3061.4 734773874 733584344 732466161 731207907 729710460 728202641 726892114 725745797 724602640
3077.7 724602640 723307967 721895814 720470428 719008088 717535436 716107190 714608192 712982357
3094 712982357 711394370 709966242 708568513 706997156 705331504 703797519 702311754 700660110 698987603
3112.4 698987603 697512329 696068645 694383383 692396820 690244734 688163102 686264157 684414804
3128.7 684414804 682449460 680398822 678419769 676591873 674750566 672632575 670314431 668078661
3145 668078661 665969491 663919866 661900878 659755528 657365918 654873908 652430952 650066197 647742629
3163.4F47742629k326369k327502k349854k410709k475381k497852k474129k448976
3179.7F28431857k454043k481401k526700k571643k560436k528429k554357k579332
3196F08175516k543270k504528k502143k528131k539397k516925k482593k440631k417505
3214.3E85700393k412319k397180k426088k463698k391279k304912k268016k153814
3230.7E66883087k027809k116442k297640k291083k139628j974881j842618j840353
3247E50352633j952708j957893j818538j734435j803399j895964j865863j773119j700044
3265.3E33850670j629293j602411j696110j799524j848578j892090j875878j839637
3281.6E19667149j862944j887738j844526j764118j777172j916647k061904k170622
$$ plain form
3163.4 647742629 645416260 643088758 640738904 638328195 635852814 633354962 630880833 628431857
3179.7 628431857 625977814 623496413 620969713 618398070 615837634 613309205 610754848 608175516
3196 608175516 605632246 603127718 600625575 598097444 595558047 593041122 590558529 588117898 585700393
3214.3 585700393 583288074 580890894 578464806 576001108 573609829 571304917 569036901 566883087
3230.7 566883087 564855278 562738836 560441196 558150113 556010485 554035604 552192986 550352633
3247 550352633 548399925 546442032 544623494 542889059 541085660 539189696 537323833 535550714 533850670
3265.3 533850670 532221377 530618966 528922856 527123332 525274754 523382664 521506786 519667149
3281.6 519667149 517804205 515916467 514071941 512307823 510530651 508614004 506552100 504381478
3298E04381478k168894k007186j873315j954913k234369k469212k493859k435892k417326
3316.3D84326512k390623k333940k289623k317041k471178k612114k590448k496004
3332.6D64825541k381951k280712k393305k604962k623915k606571k552331k369731
3348.9D45012063k419740k694041k743661k515972k332032k363115k407759k205283
3365.3D25330460j996279k147793k436787k388865k056092j868308j857936j809329
3381.6D08769071j635641j399964j143724q98629r33677j235872j233250p64847m82440
3399.9C99041027p73639j111984r40025n36978l43651l49730m43876m60565k30670
3418.3C93849909J3233N0962J48385M54277P10279O96361P29203R22263Q31067N38856
$$ plain form
3298 504381478 502212584 500205398 498332083 496377170 494142801 491673589 489179730 486743838 484326512
3316.3 484326512 481935889 479601949 477312326 474995285 472524107 469911993 467321545 464825541
3332.6 464825541 462443590 460162878 457769573 455164611 452540696 449934125 447381794 445012063
3348.9 445012063 442592323 439898282 437154621 434638649 432306617 429943502 427535743 425330460
3365.3 425330460 423334181 421186388 418749601 416360736 414304644 412436336 410578400 408769071
3381.6 408769071 407133430 405733466 404589742 403691113 402757436 401521564 400288314 399523467 399041027
3399.9 399041027 398267388 397155404 396215379 395678401 395334750 394985020 394541144 394080579 393849909
3418.3 393849909 393863142 393914104 394062489 394516766 395227045 395923406 396652609 397574872 398405939 398944795
3438.7C98944795N96911R41574J246512J489550J490623J408279J545340J745760J924813
3457D11334157K082586K050758K055227K376438K565205K186894J683056J747549K162159
3475.4D30244029K441644K483934K349675K294093K465040K560705K466231K497077
3491.7D49802428K696634K857566K703488K527296K779842K828657K395719K442122
3508D71033752K960980L161997K927571K683044K732545K967119L312558L337920L074139
3526.4D98191625L127128L250539L230095L422677L602267L394484L347099L671706
3542.7E25237620L998399L882289L378629L396690L874064L831565L600895L838659
3559E55038810L968894L576577L942609N577504N402327L825426L703594M345060M626214
$$ plain form
3438.7 398944795 399541706 400483280 401729792 403219342 404709965 406118244 407663584 409409344 411334157
3457 411334157 413416743 415467501 417522728 419899166 422464371 424651265 426334321 428081870 430244029
3475.4 430244029 432685673 435169607 437519282 439813375 442278415 444839120 447305351 449802428
3491.7 449802428 452499062 455356628 458060116 460587412 463367254 466195911 468591630 471033752
3508 471033752 473994732 477156729 480084300 482767344 485499889 488467008 491779566 495117486 498191625
3526.4 498191625 501318753 504569292 507799387 511222064 514824331 518218815 521565914 525237620
3542.7 525237620 529236019 533118308 536496937 539893627 543767691 547599256 551200151 555038810
3559 555038810 559007704 562584281 566526890 572104394 577506721 581332147 585035741 589380801 594007015
3577.4E94007015M786909M768193M385590M756749O111681N642951M069924M409909
3593.7F32938921N396307N347550N168557N041301M395545M321039N414128N678415
3610F73701763N160153M964411M369915N068242O194115M449129K406836K647161O126702
3628.4G15088427P292688L813624K983630L504515L416478L367901K911568K099812
3644.7G44478643K827167O002784N959749J703501R20296L006875K854646J589358
3661G69343019J337826R85145R32932K557576K836525Q88110K469658L255845O65366
3679.4G85272002K8849J06871j5676J291871L327727K320290L49700N4300K85030P12871
3699.8G93733835J619876J218736k80559l97027J270950K844393J283765o66141o25015
$$ plain form
3577.4 594007015 598793924 603562117 607947707 612704456 618816137 624459088 628529012 632938921
3593.7 632938921 638335228 643682778 648851335 653892636 658288181 662609220 668023348 673701763
3610 673701763 678861916 683826327 688196242 693264484 699458599 703907728 706314564 708961725 715088427
3628.4 715088427 722381115 726194739 729178369 732682884 736099362 739467263 742378831 744478643
3644.7 744478643 747305810 753308594 759268343 760971844 761892140 764899015 767753661 769343019
3661 769343019 770680845 771665990 772598922 775156498 777993023 778881133 781350791 784606636 785272002
3679.4 785272002 785300851 785407722 785392046 786683917 790011644 792331934 792681634 792735934 793020964 793733835
3699.8 793733835 795353711 796572447 796291888 795894861 797165811 800010204 801293969 800627828 800002813
3718.1H00002813J56522O05464O77645O37293j95980q50022K54751K242863K534687
3736.5H06066036J49727k136409j340628J992583J237929p24077J529634J851380p68364
3754.8H07857811j052618M85599O63996m68969l08097K59698O38842P89822j93894
3773.2H08672190p86186j09136R56774N79953k93791K8074J37985j70589l26753l99708
3793.6H08288813J39176J63079J11639J491309M95851m58420P75576j73271j616359
3811.9H09217393q67724J018882O73175M35710J489639k56598j086056n24521m26233
3830.3H09673667j12116j01328L03209J398623R09984n1499k79784j016855k054811
3848.6H08669090j846492J977324M416764q7201k292097j417577J94728P28250m06266
$$ plain form
3718.1 800002813 800159335 800764799 801442444 802079737 801883757 801033735 801288486 803531349 806066036
3736.5 806066036 806215763 804079354 802738726 804731309 805969238 805245161 806774795 808626175 807857811
3754.8 807857811 806805193 807290792 807954788 807485819 807177722 807437420 808076262 808866084 808672190
3773.2 808672190 807886004 807776868 808733642 809313595 809019804 809047878 809185863 809015274 808688521 808288813
3793.6 808288813 808427989 808591068 808702707 810194016 810689867 810231447 811007023 810833752 809217393
3811.9 809217393 808349669 809368551 810041726 810477436 811967075 811710477 810624421 810099900 809673667
3830.3 809673667 809561551 809460223 809763432 811162055 812072039 812020540 811740756 810723901 808669090
3848.6 808669090 806822598 808799922 813216686 813129485 810837388 809419811 809614539 810342789 809936523
3867H09936523k8967J173615L95298m38154j116156m78030P90120J93238M01676R6857
3887.4H10926020r18209K92837N43893j090587j128554K52426J086056J228034N85914
3905.7H11777830o19650r15646o41048n20647R5070P70688K99394l54707p7189P6294
3926.1H09890389m17649j10150P44403L89516m87208o22511k27869L44277K41339k30909
3946.5H09513628P0990K89440n5671j98126j11222n8830R8407K00630j6332j64568
3966.9H09568346n7877K1697K9683O1750K3723l398Q2433R8467j1682r0897n1320o139
3991.4H09664786l3856j967Q2195
3997.5H09711158
$$ plain form
3867 809936523 809907556 811081171 811476469 811038315 809922159 809444129 810234249 810427487 810829163 810926020
3887.4 810926020 810007811 810300648 810844541 809753954 808625400 808877826 809963882 811191916 811777830
3905.7 811777830 811158180 810242534 809601486 809080839 809175909 809946597 810245991 809891284 809814095 809890389
3926.1 809890389 809472740 809362590 810106993 810496509 810009301 809386790 809158921 809503198 809744537 809513628
3946.5 809513628 809584618 809874058 809818387 809620261 809509039 809450209 809548616 809749246 809732914 809568346
3966.9 809568346 809510469 809532166 809561849 809623599 809647322 809643924 809726357 809824824 809813142 809722245 809670925 809664786
3991.4 809664786 809630930 809628963 809711158
3997.5 809711158
##END=$$ End of the data block
