##TITLE=$$ Begin of the data block
##JCAMP-DX=5.00 $$ ACD/SpecManager v 10.08
##SPECTROMETER/DATA SYSTEM=Alpha
##DATE=09 Apr 2014 11:14:46
##DATA TYPE=INFRARED SPECTRUM
##DATA CLASS=XYDATA
##ORIGIN=
##OWNER=
##NPOINTS=1765
##FIRSTX=399.75695801
##LASTX=3997.56933594
##MAXX=3997.56933594
##MINX=399.75695801
##MAXY=0.86480457
##MINY=0.39364237
##XFACTOR=1.0000000000
##YFACTOR=1.000000000000000e-9
##FIRSTY=0.72069979
##DELTAX=2.03957629
##XUNITS=1/CM
##YUNITS=ARBITRARY UNITS
##XYDATA=(X++(Y..Y))
399.8G20699787j789510j118422q60572p34090n12481m12941l23176J09076M1425r53138
420.2G14145958p98761M2378J92345k22087m19438l54707q24213j363635m65751P95483
440.5G10727572N26906k95222p2062K20179k29358m50731K47479M74572o62088j068950
460.9G09418297m86613l93092p07150o34730k89380o08087r94980l70502J80780l91483
481.3G04723060r89020l91662J05858n50389p84219j45137k25961r38296q35598j71125
501.7F99797511l54946q99910n19395k265o73116j458287r28342l66152r62555j244366
522.1F92388177n58794l92258j236021j387596n03302k52724q37922r47058o11425
540.5F85661077o80983j142203j091600m72426n03302j143277j083135n70119q61287
$$ y = [720699787, 718910277, 717791855, 716931283, 716197193, 715684712, 715271771, 714948595, 715057671, 715099096, 714145958, 713347197, 713389575, 713581920, 713359833, 712940395, 712585688, 711761475, 710397840, 709932089, 710727572, 711254478, 710959256, 710887194, 711107373, 710878015, 710427284, 710674763, 711149335, 710487247, 709418297, 708931684, 708538592, 707831442, 707196712, 706907332, 706299245, 705304265, 704933763, 705114543, 704723060, 703734040, 703342378, 703448236, 702897847, 702113628, 701968491, 701742530, 700804234, 699968636, 699797511, 699442565, 698542655, 698023260, 698020995, 697347879, 695889592, 694961250, 694595098, 693632543, 692388177, 691829383, 691437125, 690201104, 688813508, 688310206, 688057482, 687219560, 686272502, 685661077, 684980094, 683837891, 682746291, 682273865, 681770563, 680627286, 679544151, 678974032, 678112745]
558.8F78112745j329660r24051n48422j122475j619339j128793q68499j532316j731336
577.2F67307854j105607r75311j338362j144886n46277o49095j223981j072049n18441
595.6F58733845p84636j599610j778721j601756j911402k137184j475215o87659o03378
613.9F46154284l63528Q84533K089262K295434K467036L132940L276288K624512K421737
632.3F64982498K816915K641142J881778J625120J855314J697183J388192J670182
648.6F80558324J909256J244902O50764J352608K660096K970040K423584J898706J822472
666.9F97490752K501845K531409K299428K279282J907170J729071K084434K053916
683.3G14877307J443923J264810J530648J372993Q59976Q07285J092076R64940O87957
$$ y = [678112745, 676783085, 675859034, 675310612, 674188137, 672568798, 671440005, 670571506, 669039190, 667307854, 666202247, 665226936, 663888574, 662743688, 662197411, 661548316, 660324335, 659252286, 658733845, 657949209, 656349599, 654570878, 652969122, 651057720, 648920536, 647445321, 646757662, 646154284, 645790756, 646675289, 648764551, 651059985, 653527021, 656659961, 659936249, 662560761, 664982498, 667799413, 670440555, 672322333, 673947453, 675802767, 677499950, 678888142, 680558324, 682467580, 683712482, 684363246, 685715854, 688375950, 691345990, 693769574, 695668280, 697490752, 699992597, 702524006, 704823434, 707102716, 709009886, 710738957, 712823391, 714877307, 716321230, 717586040, 719116688, 720489681, 721349657, 722156942, 723249018, 724213958, 724901915]
701.6G24901915R63747J440346J387179J128733J405478J837015J684129J367748J585126
720G37701416J868546J599014J378417J580834J658917J374662J193642J327038J321912
738.3G51004398J034856J020729J381994J509249J402735J401663J491070J468957
754.6G61715651J308441J279652J369119J266896R54330Q26538R35674Q83936N12541
773G71052778J62601O0320n7757l34561m45842j77503J22786L10719P43866J496791
793.4G72934198K111197K444148K865910L342093L357708K919674K689183K598822
809.7G95262933J996577J216590J054585J147330N93066l91245r04441j084745j606285
828.1G97284365k100885k019346j773238j911760k070844j674890j287878j484096
$$ y = [724901915, 725865662, 727306008, 728693187, 729821920, 731227398, 733064413, 734748542, 736116290, 737701416, 739569962, 741168976, 742547393, 744128227, 745787144, 747161806, 748355448, 749682486, 751004398, 752039254, 753059983, 754441977, 755951226, 757353961, 758755624, 760246694, 761715651, 763024092, 764303744, 765672863, 766939759, 767894089, 768720627, 769656301, 770540237, 771052778, 771215379, 771275699, 771217942, 770883381, 770437539, 770260036, 770382822, 770693541, 771437407, 772934198, 775045395, 777489543, 780355453, 783697546, 787055254, 789974928, 792664111, 795262933, 797259510, 798476100, 799530685, 800678015, 801271081, 800879836, 799975395, 798890650, 797284365, 795183480, 793164134, 791390896, 789479136, 787408292, 785733402, 784445524, 782961428]
844.4G82961428j404226m79877N96762J492560K631247L901958M571975M572510M571975
862.7H03416312M671037M162252L136694K587557K531231K129197J422286J129567
879.1H25186133R85623L18646m59552o75320o25432q82447j028358m57466K59757M15444
899.4H23037028M29511Q18372J073182O49035Q7142r4593m51088j301527j880586j792550
919.8H20573926j684010j724780j246273k74837L25858L35515L68714N65172M01496
938.2H17640781r3698k85864k12133n03242j118302j474560j682102k348304l246546
956.6H06676030l715634m070401m948199n943120o525159p063865p793546q068502
972.9G58547604p408440o422043n801678n229473m379809l790795l659070l315389
$$ y = [782961428, 781557202, 781077325, 781674087, 783166647, 785797894, 789699852, 794271827, 798844337, 803416312, 808087349, 812249601, 815386295, 817973852, 820505083, 822634280, 824056566, 825186133, 826171756, 826490402, 826030850, 825355530, 824730098, 823847651, 822819293, 822361827, 822621584, 823037028, 823466539, 824284911, 825358093, 826007128, 826094270, 825999677, 825548589, 824247062, 822366476, 820573926, 818889916, 817165136, 815918863, 815644026, 815969884, 816305399, 816674113, 817239285, 817640781, 817547083, 817261219, 817049086, 816545844, 815427542, 813952982, 812270880, 809922576, 806676030, 802960396, 798889995, 793941796, 787998676, 781473517, 774409652, 766616106, 758547604, 751139164, 744717121, 738915443, 733685970, 729306161, 725515366, 721856296, 718540907]
989.2G18540907k538145j924812j684607j303374p20740n37753q41737j162350j480460
1007.5G06346929k138019k960979l393353l444254l519297l579855l376424l120482
1023.9F80814266l181755l347040l202378k889216k726972k591849k295971k065718
1040.2F58513367k099216k158344k091646k086997k148211j929104j260340m87745
1056.5F44251764O3121M20928N18501P7605q30531j741111k392292k878905l163516
1074.8F34325564l110051k925337k848088k903104l021956l160774l288150l202379
1091.2F09865725k707124k014160j503408j201570r56952q03650q59320r88543j044750
1109.5E97786248j146198j353502j592219j954853k515078k911866k620756j871705
$$ y = [718540907, 716002762, 714077950, 712393343, 711089969, 710369229, 709831476, 708989739, 707827389, 706346929, 704208910, 701247931, 697854578, 694410324, 690891027, 687311172, 683934748, 680814266, 677632511, 674285471, 671083093, 668193877, 665466905, 662875056, 660579085, 658513367, 656414151, 654255807, 652164161, 650077164, 647928953, 645999849, 644739509, 644251764, 644314885, 644735813, 645254314, 645331919, 644501388, 642760277, 640367985, 637489080, 634325564, 631215513, 628290176, 625442088, 622538984, 619517028, 616356254, 613068104, 609865725, 607158601, 605144441, 603641033, 602439463, 601482511, 600678861, 599819541, 598830998, 597786248, 596640050, 595286548, 593694329, 591739476, 589224398, 586312532, 583691776, 581820071]
1125.8E81820071r80854N43296J895368J922846J606703J807332K121925K215564K071858
1144.2E95024109J782596J556695J527369J611232J703143J885295K200783K557873
1160.5F09849095L043056L724992M478276N145788N617201N854130N916953N859256
1176.8F49488747N703926N481541N179227M747569M111171L334582K598166J938165
1193.1F82583094J337230R74238J018166J351536J753032K124309K370835K321481
1209.5F95833921K009452J662850J422584J291156J187205J096368J126647J248360
1225.8G06878543J320362J369357J474500J609623J670361J641989J620888J549840
1242.1G19135463J321197J034438Q07107N73754L07799J77502K87414N11467P52449
$$ y = [581820071, 580839217, 581382513, 583277881, 585200727, 586807430, 588614762, 590736687, 592952251, 595024109, 596806705, 598363400, 599890769, 601502001, 603205144, 605090439, 607291222, 609849095, 612892151, 616617143, 621095419, 626241207, 631858408, 637712538, 643629491, 649488747, 655192673, 660674214, 665853441, 670601010, 674712181, 678046763, 680644929, 682583094, 683920324, 684894562, 685912728, 687264264, 689017296, 691141605, 693512440, 695833921, 697843373, 699506223, 700928807, 702219963, 703407168, 704503536, 705630183, 706878543, 708198905, 709568262, 711042762, 712652385, 714322746, 715964735, 717585623, 719135463, 720456660, 721491098, 722298205, 722871959, 723179758, 723357260, 723644674, 724156141, 724908590]
1260.4G24908590J117468J656294K112687K315163K530158K820909K877414K745807
1276.8G43084490K736807K889157L004133K996922L043532L127217K976180K677381
1293.1G66535819K516388K397657K090156J728296J558721J438260J119197P80403
1309.4G80164897P13230P11381N08010M15922O17861P83503P65205P77542R11415Q53002
1329.8G87221968M52757J03831J31965K43843M8339j32084R5189L08037J53005k5630
1350.2G88601220q35p0810l99768n86212m86314o66142j228034j372874j136780j071155
1370.6G81582296j216650j347184j496256k306759m013062m580557j960933J622617
1386.9G66283512K181888P22527l3855o10531j357436j739442j814365k010644k301812
$$ y = [724908590, 726026058, 727682352, 729795039, 732110202, 734640360, 737461269, 740338683, 743084490, 745821297, 748710454, 751714587, 754711509, 757755041, 760882258, 763858438, 766535819, 769052207, 771449864, 773540020, 775268316, 776827037, 778265297, 779384494, 780164897, 780878127, 781589508, 782097518, 782513440, 783131301, 783914804, 784680009, 785457551, 786368966, 787221968, 787674725, 787778556, 787910521, 788154364, 788202703, 788070619, 788165808, 788473845, 788626850, 788601220, 788600385, 788529575, 788129807, 787543595, 787057281, 786391139, 785163105, 783790231, 782653451, 781582296, 780365646, 779018462, 777522206, 775215447, 771202385, 766621828, 764660895, 766283512, 768465400, 769187927, 769154072, 768543541, 767186105, 765446663, 763632298, 761621654, 759319842]
1405.3G59319842k101541j714408j718164j642167j117349p72655j103341j213909
1421.6G47936308p23183m77731n54562m33802n9664J95264M11630O59406P41542Q44955
1442G48540163Q81732J224994J899243J993894J767755K207100M007995N027712L049016
1460.3G70599604K648353L821254L957093L063917L575981N247473M731953K926767
1476.6H00572395K357066K111733J521110R91643J018882P78556l60370r31025o58631
1495H07401359q13901j672685j881719j394272j263618k570272l284216k678692k405286
1513.4G89436698k255857j929760j486719j625716j978994j758992j618922j632691
1529.7G75149047j513183j308441j105308q89242o87421q26179j070560j102209o86586
$$ y = [759319842, 757218301, 755503893, 753785729, 752143562, 751026213, 750253558, 749150217, 747936308, 747213125, 746735394, 746180832, 745747030, 745687366, 745882630, 746294260, 746953666, 747695208, 748540163, 749421895, 750646889, 752546132, 754540026, 756307781, 758514881, 762522876, 767550588, 770599604, 773247957, 777069211, 781026304, 784090221, 787666202, 792913675, 797645628, 800572395, 802929461, 805041194, 806562304, 807553947, 808572829, 809351385, 808991015, 808059990, 807401359, 806587458, 804914773, 803033054, 801638782, 800375164, 797804892, 794520676, 791841984, 789436698, 787180841, 785251081, 783764362, 782138646, 780159652, 778400660, 776781738, 775149047, 773635864, 772327423, 771222115, 770332873, 769645452, 768819273, 767748713, 766646504, 765959918]
1548G65959918p8618J32680K6703J35064O89149N4180j172602j204729j010656j286268
1568.4G62244821k083540k339185k368033l276646l856957l690123l810525m171848
1584.7G36647964m608930m848957m990339n205750n534292n618274n495548n569399
1601.1F94776475n690217n564570n484223n747855n799234n347490n471230o210923
1617.4F49460733n092681m084885m343152m221081l752530l247082k321184j400471
1633.7F20997667o03020L934M92334J218200K065241L796518M860282L285647M335701
1652F40452504P661283M916191L405929M341543N682766N820513M672587N322933O627202
1670.4F88903451N474389N397379O125390N260766M770935N899191Q170783O354570
$$ y = [765959918, 765881300, 766013980, 766040683, 766175747, 766864896, 766919076, 765746474, 764541745, 763531089, 762244821, 760161281, 757822096, 755454063, 752177417, 748320460, 744630337, 740819812, 736647964, 732039034, 727190077, 722199738, 716993988, 711459696, 705841422, 700345874, 694776475, 689086258, 683521688, 678037465, 672289610, 666490376, 661142886, 655671656, 649460733, 644368052, 640283167, 635940015, 631718934, 627966404, 624719322, 622398138, 620997667, 620394647, 620398581, 620890915, 622109115, 624174356, 627970874, 632831156, 636116803, 640452504, 648113787, 653029978, 656435907, 660777450, 666460216, 672280729, 676953316, 682276249, 688903451, 694377840, 699775219, 705900609, 711161375, 715932310, 721831501, 730002284, 736356854]
1686.7G36356854M570425M913926M574597N416214O506205O348133P119775N372465
1703G81178594M328727M615307L803790L280878L224850L384351L842652K988637J763701
1721.4H12411487J724780K035498K074004K130389K072870K597571K380550J333475
1737.7H28760624J584887J956940J797915J717269J793504J899183J594841J037419
1754H42142582J058519J201689J062453J079142Q32200O62327Q58664R93133J021445
1772.4H50912154O88791L20613M18604N85556N19812M81784M49121L76821N97596Q28207
1792.8H56179059M33802J74999L49105N02586L35872J46687K28644M04417M03941J90616
1813.2H59349728J34825K52545K59042J90198L13163M54962L25025K61068J97530K7299
$$ y = [736356854, 740927279, 745841205, 750415802, 755832016, 762338221, 768686354, 775806129, 781178594, 785507321, 790122628, 793926418, 797207296, 800432146, 803816497, 807659149, 810647786, 812411487, 814136267, 816171765, 818245769, 820376158, 822449028, 825046599, 827427149, 828760624, 830345511, 832302451, 834100366, 835817635, 837611139, 839510322, 841105163, 842142582, 843201101, 844402790, 845465243, 846544385, 847376585, 848038912, 848897576, 849890709, 850912154, 851600945, 851921558, 852340162, 852925718, 853445530, 853927314, 854376435, 854753256, 855350852, 856179059, 856612861, 856787860, 857136965, 857639551, 857975423, 858122110, 858350754, 858755171, 859159112, 859349728, 859484553, 859737098, 859996140, 860186338, 860499501, 860954463, 861279488, 861540556, 861738086, 861765385]
1833.6H61765385M8041J61946J90735K45630L78907K56539k385k4974q821M1604J81615
1856H63234222K20537J09673L4272J06156K05517K65300J60575j6510o3479o8486l576
1878.4H64184201J08540Q9228p689L9518K32577J58191j08183l9041Q5772k5809r4414
1900.9H64622891q464P7784L8207l3617j3352l2186j15931r001J51217P9930q4281
1923.3H64673197j90854j29461q7559j65463j14739J8001j4842j33931n3764N0783
1943.7H63851368j09613k50577j54794k6345j03176k24948j50144m9591j46091k16782
1964.1H62419307o8664J8179j49786k91646k02715p8857j34468j99199p2002N245j16229
1986.5H61129165j94669q8155m8221k15351k50578j03176p8797k08139k38836j37329
$$ y = [861765385, 861813426, 861975372, 862166107, 862411737, 862790644, 863047183, 863044798, 863019824, 863011003, 863052607, 863234222, 863454759, 863564432, 863598704, 863704860, 863910377, 864175677, 864336252, 864319742, 864256263, 864187777, 864184201, 864292741, 864381969, 864374280, 864413798, 864646375, 864804566, 864696383, 864657342, 864743114, 864717305, 864622891, 864614427, 864692211, 864730418, 864696801, 864683449, 864651263, 864535332, 864526331, 864677548, 864757478, 864673197, 864482343, 864352882, 864265323, 864099860, 863985121, 864003122, 863988280, 863854349, 863800585, 863851368, 863741755, 863491178, 863336384, 863310039, 863206863, 862981915, 862831771, 862782180, 862636089, 862419307, 862350643, 862368822, 862219036, 861927390, 861724675, 861645818, 861511350, 861312151, 861240149, 861245394, 861129165, 860934496, 860846341, 860798120, 860582769, 860332191, 860229015, 860150218, 859942079, 859703243, 859565914]
2006.9H59565914j17362j88589j63794o5445r8288k07246j65880o2048j32501k31207
2027.3H58133554j39832m4346j23143j90020j14202o3658j32859j96933j16468j3769
2047.7H56998324n8829j43052j07169m4882q4341j19924n2929p629p8619j14620n8770
2070.2H56127560m6730r3222r2029k9743O914j0907j7822J013r835n0127n1975J311
2094.6H55734408J1504j7345L457M3809K0504n0902p1466k3544K6762L3200L1650N3227
2119.1H55795264M0710j5557j9610K9922L4273j2160K146P3016O9737L4988N7221P5996
2143.6H56165946K5510q94P3314J13964M4823r895M2439J02699P4446L1292M5598O3956
2168H56773198M9889N4121Q1420P5936L7015L2365O9797N3823j4842m947O3181O7532
$$ y = [859565914, 859448552, 859259963, 859096169, 859030724, 858932436, 858725190, 858559310, 858497262, 858364761, 858133554, 857993722, 857949376, 857826233, 857636213, 857522011, 857458353, 857325494, 857128561, 857012093, 856998324, 856939495, 856796443, 856689274, 856644392, 856560051, 856440127, 856387198, 856379569, 856300950, 856186330, 856127560, 856080830, 855987608, 855895579, 855865836, 855872750, 855861843, 855844021, 855845034, 855835199, 855785072, 855733097, 855734408, 855745912, 855728567, 855732024, 855775833, 855796337, 855745435, 855673969, 855650425, 855677187, 855710387, 855742037, 855795264, 855835974, 855820417, 855800807, 855830729, 855865002, 855852842, 855854988, 855928004, 855997741, 856032729, 856089950, 856165946, 856191456, 856190562, 856263876, 856377840, 856422663, 856412768, 856455207, 856557906, 856632352, 856663644, 856709242, 856773198, 856823087, 856877208, 856958628, 857034564, 857071579, 857103944, 857173741, 857227564, 857212722, 857207775, 857270956, 857338488]
2192.5H57338488L7670K7001J4305l57j3113l040K4915K9921J9252P391n304j5259
2217H57461870j6928J967K9504J6630j1802N901L6419K1219k1160j6928k145m3810
2241.5H57460737o4432l3677k7359l2305j3411j9908k7955k0146o1989r6083n4955
2263.9H57008517M589J8597K3782M0770j5736p0572J3948J07407P7784k0802r3162
2286.3H57095122r0003j05917j49131r9480m9174q3327j46628j75595j87695k84851
2306.7H55723321l71635l01599j55628j28388l12567n03540m21941j98305j93715l23653
2327.1H52812350k97845j72019j71065k83062l09289k23458l0160N30362J178205O87838
2347.5H53721857n06103j111388r60529o21915k80559J27316M58061O60658P32780
$$ y = [857338488, 857376158, 857403159, 857417464, 857417107, 857403994, 857400954, 857425869, 857455790, 857475042, 857482433, 857477129, 857461870, 857444942, 857446909, 857476413, 857493043, 857481241, 857487142, 857523561, 857544780, 857523620, 857506692, 857504547, 857460737, 857396305, 857362628, 857335269, 857302964, 857289553, 857269645, 857241690, 857221544, 857159555, 857063472, 857008517, 857013106, 857031703, 857055485, 857096255, 857080519, 857009947, 857023895, 857131302, 857209086, 857188284, 857095122, 857005119, 856899202, 856750071, 856650591, 856601417, 856518090, 856371462, 856195867, 856008172, 855723321, 855351686, 855050087, 854894459, 854766071, 854453504, 853949964, 853528023, 853329718, 853136003, 852812350, 852514505, 852342486, 852171421, 851888359, 851579070, 851355612, 851325452, 851855814, 853034019, 853721857, 853215754, 852104366, 851143837, 850521922, 850241363, 850368679, 850826740, 851487398, 852220178]
2365.9H52220178P70628Q21710Q70347R03308Q39472O70075N09322M33743L47018J72139
2386.3H58557940L4689K0385O1751M0233j8358N602N4658J5318l8445R954M1545n3943
2410.8H58731329q9347K0921P6473j2696r3221o2406m0889r7692q4877J7047L4570
2433.2H58399212m0292n7102J252j2696j30593j37747k146K6405p0274p6055j0252
2455.6H57889712l9280j11162p3493J0371n2571j45614o9201R477n8055j54793j44839
2478.1H57060552m2439k8849j15156q1598j1385j01983j71245p5996k6702j05560j24693
2500.5H56174946p1407p2121r3103n6088l3199r7931j56343j20699o6698o7115q7440
2522.9H55252802q2254n8234o6697p7784n4300o9440j34647j52170p8142q285o4552
$$ y = [852220178, 852990806, 853812516, 854682863, 855586171, 856425643, 857095718, 857605040, 858038783, 858385801, 858557940, 858592629, 858613014, 858674765, 858714998, 858696640, 858702242, 858756900, 858772218, 858733773, 858743727, 858785272, 858731329, 858641982, 858662903, 858739376, 858726680, 858633459, 858571053, 858530164, 858432472, 858347595, 858364642, 858399212, 858358920, 858301818, 858303070, 858290374, 858159781, 858022034, 858019888, 858046293, 857976019, 857899964, 857889712, 857850432, 857739270, 857665777, 857676148, 857623577, 857477963, 857408762, 857418239, 857360184, 857205391, 857060552, 857018113, 856989264, 856874108, 856792510, 856781125, 856679142, 856507897, 856431901, 856405199, 856299639, 856174946, 856103539, 856031418, 855938315, 855882227, 855849028, 855751097, 855594754, 855474055, 855407357, 855340242, 855252802, 855170548, 855112314, 855045617, 854967833, 854913533, 854844093, 854709446, 854557276, 854479134, 854470849, 854406297]
2545.4H54406297j57356j26600p6354j14441j03712k9266m5538j25110j21295o2108
2565.8H53444517r7812j98602k02179j22249q2493j23203j57297j18255j27673k03491
2586.2H52011263j78635j01506j56761k45452k16901j58489j61528k04027k15232j97888
2606.6H50174844k36988k76148k27571k18689k84851k79545j99855j47283j82331k58445
2626.9H47863138k67804k19703k25722k66433k43008k06888k29418k64228k54988k33412
2647.3H45451534k44677k44141k11775k22504k75135k73407k01821j74999k38598k63572
2667.7H43100905k06053j91271k50220k30730j45733j87457k97785l21984l06606l14415
2688.1H40648651k84612k17021k16186k71022l04460k89262k58386k82109l03447k72930
$$ y = [854406297, 854248941, 854122341, 854045987, 853931546, 853827834, 853798568, 853753030, 853627920, 853506625, 853444517, 853346705, 853148103, 852945924, 852823675, 852741182, 852617979, 852460682, 852342427, 852214754, 852011263, 851832628, 851731122, 851574361, 851328909, 851112008, 850953519, 850791991, 850587964, 850372732, 850174844, 849937856, 849661708, 849434137, 849215448, 848930597, 848651052, 848451197, 848303914, 848121583, 847863138, 847595334, 847375631, 847149909, 846883476, 846640468, 846433580, 846204162, 845939934, 845684946, 845451534, 845206857, 844962716, 844750941, 844528437, 844253302, 843979895, 843778074, 843603075, 843364477, 843100905, 842894852, 842703581, 842453361, 842222631, 842076898, 841889441, 841591656, 841269672, 840963066, 840648651, 840364039, 840147018, 839930832, 839659810, 839355350, 839066088, 838807702, 838525593, 838222146, 837949216]
2708.5H37949216k78175l19242l23713l03507k90751k76446k47360k30729l05653l95358
2728.9H34978282l39686k37227k20418k66731l27289l33488k80499k40624k16007k35916
2749.3H32280397l35276l72827l09765k89381l51011l91066l53516l29494l63767l82483
2769.7H28801811l39568k81453l13044m18305m68731m53353m22656l65794l34621m07457
2790.1H24996829m93169n03897m64499m83275o07610o46591n61833n25117n67198o30856
2810.5H19512784o65307o66081o64533o70492o82473p18952p70271p93397q01444q42631
2830.9H12237203r13024r79006j081467j345277j736462k034664k221763k327502k160489
2849.3G97437549j678706j151084q01623n66781m38273n67973q38100j031042j170694
$$ y = [837949216, 837671041, 837351799, 837028086, 836724579, 836433828, 836157382, 835910022, 835679293, 835373640, 834978282, 834638596, 834401369, 834180951, 833914220, 833586931, 833253443, 832972944, 832732320, 832516313, 832280397, 831945121, 831572294, 831262529, 830973148, 830622137, 830231071, 829877555, 829548061, 829184294, 828801811, 828462243, 828180790, 827867746, 827449441, 826980710, 826527357, 826104701, 825738907, 825404286, 824996829, 824503660, 823999763, 823535264, 823051989, 822444379, 821797788, 821235955, 820710838, 820143640, 819512784, 818847477, 818181396, 817516863, 816846371, 816163898, 815444946, 814674675, 813881278, 813079834, 812237203, 811324179, 810345173, 809263706, 807918429, 806181967, 804147303, 801925540, 799598038, 797437549, 795758843, 794607759, 793806136, 793239355, 792801082, 792233109, 791395009, 790363967, 789193273]
2867.6G89193273j233221j135885j043499j031399r21905p56084o95467p39933q52644
2886G80783236r55105j004576j021982j010179j070977j231968j296580j226127j219988
2904.3G70745754j342296j481891j619220j824796k061725k160489k009690j664460
2920.6G56581187j248240q60751m49955q3566J9371Q7023M01914P63357R95159J183570
2941G57389069J313746J196682P99656L93629J79827k3007k48492k31326p15J68085
2961.4G60937154K13445K87234M11153M82559N23389N50151N09977M91917M75109L26633
2981.8G65208721J87993K03252L01182L73781K62260m1723k47419l57866n14805n79953
3002.2G64795423o03080o28770n30421m08709m75228o97017q87692r74894r66370r13500
$$ y = [789193273, 787960052, 786824167, 785780668, 784749269, 783827364, 783071280, 782375813, 781635880, 780783236, 779828131, 778823555, 777801573, 776791394, 775720417, 774488449, 773191869, 771965742, 770745754, 769403458, 767921567, 766302347, 764477551, 762415826, 760255337, 758245647, 756581187, 755332947, 754472196, 754022241, 753938675, 753958046, 754045069, 754446983, 755210340, 756205499, 757389069, 758702815, 759899497, 760699153, 761092782, 761272609, 761249602, 761001110, 760769784, 760769069, 760937154, 761150599, 761437833, 761848986, 762331545, 762854934, 763405085, 763915062, 764406979, 764882088, 765208721, 765396714, 765599966, 765901148, 766274929, 766537189, 766495466, 766248047, 765890181, 765375376, 764795423, 764192343, 763563573, 763033152, 762624443, 762149215, 761452198, 760564506, 759589612, 758623242, 757709742]
3022.6G57709742r42469j051486j021385q76009q76785j062631j209676j145661j067877
3041G48455763j174152j330912j351416j257301j254975j325906j337528j400352j463592
3059.3G36559629j360893j206577j140236j252473j465499j501859j347899j161873
3075.6G26122320j085222j225710j409292j483739j507282j462221j433492j553476
3092G14961886j647114j555086j415014j408338j545787j646161j575709j487672j600802
3110.3G01080203j675904j499891j456201j698792j976252k147317k117037j914561
3126.6F86594248j785755j900316k043068j993060j859367j865625k093912k296090
3143F70757055k280473k168835k059579k003192k135158k380371k459109k390325k345145
$$ y = [757709742, 756767273, 755715787, 754694402, 753818393, 752941608, 751878977, 750669301, 749523640, 748455763, 747281611, 745950699, 744599283, 743341982, 742087007, 740761101, 739423573, 738023221, 736559629, 735198736, 733992159, 732851923, 731599450, 730133951, 728632092, 727284193, 726122320, 725037098, 723811388, 722402096, 720918357, 719411075, 717948854, 716515362, 714961886, 713314772, 711759686, 710344672, 708936334, 707390547, 705744386, 704168677, 702681005, 701080203, 699404299, 697904408, 696448207, 694749415, 692773163, 690625846, 688508809, 686594248, 684808493, 682908177, 680865109, 678872049, 677012682, 675147057, 673053145, 670757055, 668476582, 666307747, 664248168, 662244976, 660109818, 657729447, 655270338, 652880013, 650534868]
3161.3F50534868k338230k337873k356053k388000k403379k463698k528846k478958
3177.6F31239831k408683k447128k523244k549231k543389k541185k572715k601564
3193.9F11052692k572477k523243k495051k485275k515733k557636k549469k502680
3210.3E90851128k437711k408325k416909k400398k400875k422929k401650k337694
3226.6E71624637k253652k147555k085686k188921k303660k235949k110541k008319
3242.9E54290354j879632j835168j930296j972795j883328j774847j775146j838088
3259.2E39401054j828312j766086j727879j686394j604021j637936j805245j904727
3275.5E25440454j905024j867115j841605j847029j855790j858413j828969j811087
$$ y = [650534868, 648196638, 645858765, 643502712, 641114712, 638711333, 636247635, 633718789, 631239831, 628831148, 626384020, 623860776, 621311545, 618768156, 616226971, 613654256, 611052692, 608480215, 605956972, 603461921, 600976646, 598460913, 595903277, 593353808, 590851128, 588413417, 586005092, 583588183, 581187785, 578786910, 576363981, 573962331, 571624637, 569370985, 567223430, 565137744, 562948823, 560645163, 558409214, 556298673, 554290354, 552410722, 550575554, 548645258, 546672463, 544789135, 543014288, 541239142, 539401054, 537572742, 535806656, 534078777, 532392383, 530788362, 529150426, 527345181, 525440454, 523535430, 521668315, 519826710, 517979681, 516123891, 514265478, 512436509, 510625422]
3291.8E10625422j900256k041399k133370k131104k021670j908005j992583k266705
3308.2D94230330k451360k465457k438515k415300k389669k381444k351433k314836
3324.5D75022316k429247k600163k609342k512098k372145k258540k378016k614558
3340.8D55248207k656102k628893k589583k396495k392798k686173k764821k524286
3357.1D34609056k337933k363682k393365k187669j981556k141476k482772k474636
3373.4D16245967k108365j863212j809239j787484j696765j473248j139730q19713
3389.7D03548211q48353j212597j278698q00312m60803p79629j151651r08226m99278
3408.1C95608664l85762l91602m63456m89950k35528M5568J05947J80691M09186O52522
$$ y = [510625422, 508725166, 506683767, 504550397, 502419293, 500397623, 498489618, 496497035, 494230330, 491778970, 489313513, 486874998, 484459698, 482070029, 479688585, 477337152, 475022316, 472593069, 469992906, 467383564, 464871466, 462499321, 460240781, 457862765, 455248207, 452592105, 449963212, 447373629, 444977134, 442584336, 439898163, 437133342, 434609056, 432271123, 429907441, 427514076, 425326407, 423344851, 421203375, 418720603, 416245967, 414137602, 412274390, 410465151, 408677667, 406980902, 405507654, 404367924, 403548211, 402699858, 401487261, 400208563, 399408251, 398947448, 398167819, 397016168, 396107942, 395608664, 395222902, 394831300, 394367844, 393877894, 393642366, 393687934, 393793881, 393974572, 394383758, 395036280]
3428.5C95036280P25210Q04931R64194Q33273N12570N61595R29088J258135J486629
3446.8D03111905J476973J435578J576394J733184J910627K094358K057403K019972
3463.2D17416394K326071K566576K232432J710833J766800K211571K490074K502620
3479.5D35223371K359539K287626K424062K500951K393782K440870K687067K866745
3495.8D55184013K710849K531290K805501K913475K451777K400339K901524L155888
3512.1D77054656K971142K732009K761185K987772L362000L415048L076256L039330
3528.4E01399398L153741L152371L397405L641844L447890L364324L671110M054368
3544.7E29282451L963649L377736L345906L833592L818095L651142L909171M005253
$$ y = [395036280, 395761490, 396566421, 397530615, 398363888, 398876458, 399438053, 400367141, 401625276, 403111905, 404588878, 406024456, 407600850, 409334034, 411244661, 413339019, 415396422, 417416394, 419742465, 422309041, 424541473, 426252306, 428019106, 430230677, 432720751, 435223371, 437582910, 439870536, 442294598, 444795549, 447189331, 449630201, 452317268, 455184013, 457894862, 460426152, 463231653, 466145128, 468596905, 470997244, 473898768, 477054656, 480025798, 482757807, 485518992, 488506764, 491868764, 495283812, 498360068, 501399398, 504553139, 507705510, 511102915, 514744759, 518192649, 521556973, 525228083, 529282451, 533246100, 536623836, 539969742, 543803334, 547621429, 551272571, 555181742, 559186995]
3561.1E59186995L603041L950238N563975N388498L781617L668964M391551M711210
3577.4E94246089M824937M752219M357755M737139O079018N627751M110575M460394
3593.7F33195877N402327N333364N214274N143046M443645M263819N334556N688727
3610F74019635N214810M984200M364431N058110O204426M508078K482891K649725O043732
3628.4G15530038P306874L913700L002644L460049L407121L377080K895773K067685
3644.7G44960964K789676N940258N922974J765966R98795L039658K873600J605212
3661G69897103J342297R71079Q83281K504289K842665R11355K425015L210962P03990
3679.4G85692036N6863O8486n7698J269043L285289K313614M01139J12295L19541P20322
$$ y = [559186995, 562790036, 566740274, 572304249, 577692747, 581474364, 585143328, 589534879, 594246089, 599071026, 603823245, 608181000, 612918139, 618997157, 624624908, 628735483, 633195877, 638598204, 643931568, 649145842, 654288888, 658732533, 662996352, 668330908, 674019635, 679234445, 684218645, 688583076, 693641186, 699845612, 704353690, 706836581, 709486306, 715530038, 722836912, 726750612, 729753256, 733213305, 736620426, 739997506, 742893279, 744960964, 747750640, 753690898, 759613872, 761379838, 762378633, 765418291, 768291891, 769897103, 771239400, 772210479, 773093760, 775598049, 778440714, 779352069, 781777084, 784988046, 785692036, 785748899, 785817385, 785759687, 787028730, 790314019, 792627633, 793028772, 793141067, 793460608, 794180930]
3699.8G94180930J627862J250267k30670l52979J265467K767622J218736o65843n92828
3718.1H00468564J89066O20484O49691N83410k01046q35955K50101K259612K538144
3736.5H06522071J49548k117216j288951K075434J245439p37071J547516J818001q16047
3754.8H08398724j107991L96907O13928m52876k75970K70427O49512Q35955j63615
3773.2H09165001q12948j61111R11951N76854k56598N4836J73509j10865k86221m08888
3793.6H08845520Q2552J25051J17302J524270N18202n27262O98745j30355j548112
3811.9H09705913q64565R78827N86569L42846J522184j64449j049817n55813n21303
3830.3H09980392j55568j7404L77536J370668Q67546o9321k68280r59993k027988j886368
$$ y = [794180930, 795808792, 797059059, 796828389, 796475410, 797740877, 800508499, 801727235, 801061392, 800468564, 800657630, 801278114, 801927805, 802511215, 802310169, 801474214, 801724315, 803983927, 806522071, 806671619, 804554403, 803265452, 805340886, 806586325, 805849254, 807396770, 809214771, 808398724, 807290733, 807687640, 808301568, 807848692, 807572722, 807843149, 808492661, 809328616, 809165001, 808352053, 808190942, 809102893, 809679747, 809423149, 809477985, 809651494, 809540629, 809254408, 808845520, 808928072, 809053123, 809170425, 810694695, 811212897, 810685635, 811384380, 811254025, 809705913, 808841348, 809820175, 810406744, 810749590, 812271774, 812107325, 811057508, 810501695, 809980392, 809824824, 809807420, 810184956, 811555624, 812423170, 812353849, 812085569, 811125576, 809097588, 807211220]
3850.7H07211220J938641M413367n9605k245367j378119J79708O44386m34637N9664
3869H10329258J241804L93331m16398j107335n33641P18832J61946M10259J27732q65519
3889.4H10460269L74437N74350j153469j198053K36571J134514J309872N77807o82473
3907.8H11633825r25362o42597n75126K7240P51376L29256l04759n6445N8174m00126
3928.2H09895456r9719O64652L46005m14431n43595j95741L75688K66432k68578l576
3948.6H10022593K43008q0765k17974q9347k4319M4644J28806J7941r6977l5763M5300
3971H09957147P3433M9591o7532n5790J28626J54973l517j10567r2804n1439j6928
3993.4H09965193L6300M9173
$$ y = [807211220, 809149861, 813563228, 813503623, 811258256, 809880137, 810059845, 810704231, 810269594, 810329258, 811571062, 811964393, 811547995, 810440660, 809907019, 810625851, 810787797, 811198056, 811325788, 810460269, 810834706, 811409056, 810255587, 809057534, 809294105, 810428619, 811738491, 812316298, 811633825, 810708463, 810065866, 809490740, 809517980, 810269356, 810598612, 810293853, 810237408, 810295582, 809895456, 809795737, 810460389, 810806394, 810391963, 809848368, 809652627, 810028315, 810294747, 810026169, 810022593, 810265601, 810184836, 809966862, 809877515, 809853196, 809897840, 810026646, 810044587, 809947610, 809911847, 809957147, 810030580, 810080171, 810012639, 809956849, 810085475, 810240448, 810236931, 810126364, 810033560, 809982121, 809965193, 810001493, 810050666]
3997.5H10050666
$$ y = [810050666]
##END=$$ End of the data block
